{
	"layout": {
		"type": "layout",
		"pages": [
			"eye",
			"click",
			"pointer",
			"idle"
		],
		"eye": {
			"type": "page",
			"title": "Tray Eye",
			"sections": [
				"eye-generic",
				"eye-events",
				"eye-colors"
			]
		},
		"click": {
			"type": "page",
			"title": "Click Tracker",
			"sections": [
				"click-generic",
				"click-events",
				"click-colors"
			]
		},
		"pointer": {
			"type": "page",
			"title": "Pointer Tracker",
			"sections": [
				"pointer-generic",
				"pointer-events",
				"pointer-colors"
			]
		},
		"idle": {
			"type": "page",
			"title": "Idle Tracker",
			"sections": [
				"idle-generic",
				"idle-events",
				"idle-colors"
			]
		},
		"eye-generic": {
			"type": "section",
			"title": "General Configuration",
			"keys": [
				"eye-mode",
				"eye-line-width",
				"eye-margin",
				"eye-repaint-interval"
			]
		},
		"eye-events": {
			"type": "section",
			"title": "Events",
			"keys": [
				"start-mode"
			]
		},
		"eye-colors": {
			"type": "section",
			"title": "Colors",
			"keys": [
				"eye-clicked-color",
				"iris-clicked-color",
				"pupil-clicked-color"
			]
		},
		"click-generic": {
			"type": "section",
			"title": "Generic",
			"keys": [
				"click-enable",
				"click-image",
				"click-tween-mode",
				"click-min-size",
				"click-image-size"
			]
		},
		"click-events": {
			"type": "section",
			"title": "Events",
			"keys": [
				"left-click-enable",
				"middle-click-enable",
				"right-click-enable",
				"click-duration"
			],
			"dependency": "click-enable"
		},
		"click-colors": {
			"type": "section",
			"title": "Colors",
			"keys": [
				"left-click-color",
				"middle-click-color",
				"right-click-color",
				"click-opacity"
			],
			"dependency": "click-enable"
		},
		"pointer-generic": {
			"type": "section",
			"title": "Generic",
			"keys":  [
				"pointer-enable",
				"pointer-image",
				"pointer-image-size"
			]
		},
		"pointer-events": {
			"type": "section",
			"title": "Events",
			"keys": [
				"pointer-repaint-interval"
			],
			"dependency": "pointer-enable"
		},
		"pointer-colors": {
			"type": "section",
			"title": "Colors",
			"keys": [
				"pointer-color",
				"pointer-opacity"
			],
			"dependency": "pointer-enable"
		},
		"idle-generic": {
			"type": "section",
			"title": "Generic",
			"keys":  [
				"idle-enable",
				"idle-image",
				"idle-tween-mode",
				"idle-image-size"
			]
		},
		"idle-events": {
			"type": "section",
			"title": "Events",
			"keys": [
				"idle-delay",
				"idle-duration",
				"idle-frequency"
			],
			"dependency": "idle-enable"
		},
		"idle-colors": {
			"type": "section",
			"title": "Colors",
			"keys": [
				"idle-color",
				"idle-opacity"
			],
			"dependency": "idle-enable"
		}
	},
	"eye-mode": {
		"type": "combobox",
		"default": "lids",
		"description": "Eye Mode",
		"options": {
			"Lids": "lids",
			"Bulb": "bulb"
		}
	},
	"eye-line-width": {
		"type": "spinbutton",
		"description": "Eye Line Width",
		"default": 2,
		"min": 1,
		"max": 5,
		"step": 1,
		"units": "px"
	},
	"eye-margin": {
		"type": "spinbutton",
		"default": 4,
		"min": 1,
		"max": 10,
		"step": 1,
		"units": "px",
		"description": "Eye Margin Size"
	},
	"eye-repaint-interval": {
		"type": "spinbutton",
		"default": 60,
		"min": 5,
		"max": 200,
		"step": 5,
		"units": "ms",
		"description": "Eye Repaint Interval"
	},
	"start-mode": {
		"type": "combobox",
		"default": 0,
		"description": "Start mode",
		"options": {
			"disabled": 0,
			"enabled": 1,
			"last state": 2
		},
		"tooltip": "Choose how this applet will run at system start"
	},
	"eye-clicked-color": {
		"type": "colorchooser",
		"default": "#fcfcfc",
		"description": "Eye Clicked Color"
	},
	"iris-clicked-color": {
		"type": "colorchooser",
		"default": "#4077BF",
		"description": "Iris Clicked Color"
	},
	"pupil-clicked-color": {
		"type": "colorchooser",
		"default": "#333333",
		"description": "Pupil Clicked Color"
	},
	"click-enable": {
		"type": "checkbox",
		"default": true,
		"description": "Enable"
	},
	"click-image": {
		"type": "combobox",
		"default": 1,
		"description": "Click Image",
		"options": {
			"Simple": 1,
			"Trigun": 2,
			"Nublo": 3,
			"Risco": 4,
			"Wolf": 5,
			"Pincel": 6,
			"Claw": 7,
			"Metropoli": 8,
			"Flowey": 9,
			"Kusco": 10,
			"Ouroboros": 11,
			"Helix": 12,
			"Direction": 13,
			"Spinks": 14,
			"Thatch": 15,
			"Cotton": 16,
			"Circle": 17,
			"Gear": 18
		},
		"dependency": "click-enable"
	},
	"click-tween-mode": {
		"type": "tween",
		"default": "easeInExpo",
		"description": "Animation Type",
		"dependency": "click-enable"
	},
	"click-min-size": {
		"type": "spinbutton",
		"default": 60,
		"min": 16,
		"max": 80,
		"step": 2,
		"units": "px",
		"description": "Min. Size",
		"dependency": "click-enable"
	},
	"click-image-size": {
		"type": "spinbutton",
		"default": 100,
		"min": 80,
		"max": 200,
		"step": 2,
		"units": "px",
		"description": "Max. Size",
		"dependency": "click-enable"
	},
	"left-click-enable": {
		"type": "checkbox",
		"default": true,
		"description": "Enable Left Click"
	},
	"middle-click-enable": {
		"type": "checkbox",
		"default": true,
		"description": "Enable Middle Click"
	},
	"right-click-enable": {
		"type": "checkbox",
		"default": true,
		"description": "Enable Right Click"
	},
	"click-duration": {
		"type": "spinbutton",
		"default": 1000,
		"min": 100,
		"max": 5000,
		"step": 100,
		"units": "ms",
		"description": "Animation Duration"
	},
	"left-click-color": {
		"type": "colorchooser",
		"default": "#a40000",
		"description": "Left Click Color",
		"dependency": "left-click-enable"
	},
	"middle-click-color": {
		"type": "colorchooser",
		"default": "#105028",
		"description": "Middle Click Color",
		"dependency": "middle-click-enable"
	},
	"right-click-color": {
		"type": "colorchooser",
		"default": "#1e4b87",
		"description": "Right Click Color",
		"dependency": "right-click-enable"
	},
	"click-opacity": {
		"type": "spinbutton",
		"description": "Initial Opacity",
		"default": 255,
		"min": 5,
		"max": 255,
		"step": 5
	},
	"pointer-enable": {
		"type": "checkbox",
		"default": true,
		"description": "Enable"
	},
	"pointer-image": {
		"type": "combobox",
		"default": 1,
		"description": "Tracker Image",
		"options": {
			"Simple": 1,
			"Trigun": 2,
			"Nublo": 3,
			"Risco": 4,
			"Wolf": 5,
			"Pincel": 6,
			"Claw": 7,
			"Metropoli": 8,
			"Flowey": 9,
			"Kusco": 10,
			"Ouroboros": 11,
			"Helix": 12,
			"Direction": 13,
			"Spinks": 14,
			"Thatch": 15,
			"Cotton": 16,
			"Circle": 17,
			"Gear": 18
		},
		"dependency": "pointer-enable"
	},
	"pointer-image-size": {
		"type": "spinbutton",
		"default": 70,
		"min": 20,
		"max": 200,
		"step": 5,
		"units": "px",
		"description": "Tracker Size",
		"dependency": "pointer-enable"
	},
	"pointer-repaint-interval": {
		"type": "spinbutton",
		"default": 10,
		"min": 1,
		"max": 100,
		"step": 1,
		"units": "ms",
		"description": "Tracker Frequency"
	},
	"pointer-color": {
		"type": "colorchooser",
		"default": "#c17d11",
		"description": "Tracker Color"
	},
	"pointer-opacity": {
		"type": "spinbutton",
		"description": "Tracker Opacity",
		"default": 180,
		"min": 0,
		"max": 255,
		"step": 5
	},
	"idle-enable": {
		"type": "checkbox",
		"default": true,
		"description": "Enable"
	},
	"idle-image": {
		"type": "combobox",
		"default": 1,
		"description": "Idle Image",
		"options": {
			"Simple": 1,
			"Trigun": 2,
			"Nublo": 3,
			"Risco": 4,
			"Wolf": 5,
			"Pincel": 6,
			"Claw": 7,
			"Metropoli": 8,
			"Flowey": 9,
			"Kusco": 10,
			"Ouroboros": 11,
			"Helix": 12,
			"Direction": 13,
			"Spinks": 14,
			"Thatch": 15,
			"Cotton": 16,
			"Circle": 17,
			"Gear": 18
		},
		"dependency": "idle-enable"
	},
	"idle-tween-mode": {
		"type": "tween",
		"default": "easeOutQuad",
		"description": "Animation Type",
		"dependency": "idle-enable"
	},
	"idle-image-size": {
		"type": "spinbutton",
		"default": 70,
		"min": 20,
		"max": 250,
		"step": 5,
		"units": "px",
		"description": "Idle Locator Size",
		"dependency": "idle-enable"
	},
	"idle-delay": {
		"type": "spinbutton",
		"default": 5,
		"min": 1,
		"max": 60,
		"step": 0.5,
		"units": "sec",
		"description": "Idle Delay"
	},
	"idle-duration": {
		"type": "spinbutton",
		"default": 1000,
		"min": 100,
		"max": 5000,
		"step": 100,
		"units": "ms",
		"description": "Animation Duration"
	},
	"idle-frequency": {
		"type": "spinbutton",
		"default": 2.5,
		"min": 0.5,
		"max": 10,
		"step": 0.5,
		"units": "sec",
		"description": "Animation Frequency"
	},
	"idle-color": {
		"type": "colorchooser",
		"default": "#c4158e",
		"description": "Idle Locator Color"
	},
	"idle-opacity": {
		"type": "spinbutton",
		"description": "Idle Locator Opacity",
		"default": 180,
		"min": 10,
		"max": 255,
		"step": 5
	},
	"mouse-enable": {
	 "type": "generic",
	 "default": false
	}
}
