<svg enable-background="new 0 0 512 512" version="1.1" viewBox="0 0 512 512" xml:space="preserve" xmlns="http://www.w3.org/2000/svg">
<style type="text/css">
	.st0{fill:#333333;}
</style>
		<path class="st0" d="M408.19,256c0-83.92-68.27-152.19-152.19-152.19S103.81,172.08,103.81,256S172.08,408.19,256,408.19    S408.19,339.92,408.19,256z M256,376.19c-66.27,0-120.19-53.92-120.19-120.19S189.73,135.81,256,135.81S376.19,189.73,376.19,256    S322.27,376.19,256,376.19z"/>
		<path class="st0" d="m240 43.5v26.52c0 8.84 7.16 16 16 16s16-7.16 16-16v-26.52c0-8.84-7.16-16-16-16s-16 7.16-16 16z"/>
		<path class="st0" d="m417.57 94.43c-6.25-6.25-16.38-6.25-22.63 0l-18.75 18.75c-6.25 6.25-6.25 16.38 0 22.63 3.12 3.12 7.22 4.69 11.31 4.69s8.19-1.56 11.31-4.69l18.75-18.75c6.26-6.25 6.26-16.39 0.01-22.63z"/>
		<path class="st0" d="m441.98 272h26.52c8.84 0 16-7.16 16-16s-7.16-16-16-16h-26.52c-8.84 0-16 7.16-16 16s7.16 16 16 16z"/>
		<path class="st0" d="m394.95 417.57c3.12 3.12 7.22 4.69 11.31 4.69s8.19-1.56 11.31-4.69c6.25-6.25 6.25-16.38 0-22.63l-18.75-18.75c-6.25-6.25-16.38-6.25-22.63 0s-6.25 16.38 0 22.63l18.76 18.75z"/>
		<path class="st0" d="m240 441.98v26.52c0 8.84 7.16 16 16 16s16-7.16 16-16v-26.52c0-8.84-7.16-16-16-16s-16 7.16-16 16z"/>
		<path class="st0" d="m105.74 422.26c4.09 0 8.19-1.56 11.31-4.69l18.75-18.75c6.25-6.25 6.25-16.38 0-22.63s-16.38-6.25-22.63 0l-18.75 18.75c-6.25 6.25-6.25 16.38 0 22.63 3.13 3.13 7.23 4.69 11.32 4.69z"/>
		<path class="st0" d="m43.5 272h26.52c8.84 0 16-7.16 16-16s-7.16-16-16-16h-26.52c-8.84 0-16 7.16-16 16s7.16 16 16 16z"/>
		<path class="st0" d="m94.43 94.43c-6.25 6.25-6.25 16.38 0 22.63l18.75 18.75c3.12 3.12 7.22 4.69 11.31 4.69s8.19-1.56 11.31-4.69c6.25-6.25 6.25-16.38 0-22.63l-18.75-18.75c-6.24-6.25-16.38-6.25-22.62 0z"/>
</svg>
