Copyright 1986-2018 Xilinx, Inc. All Rights Reserved.
---------------------------------------------------------------------------------------------------------------------------------------
| Tool Version : Vivado v.2018.3 (lin64) Build 2405991 Thu Dec  6 23:36:41 MST 2018
| Date         : Thu Jul 18 14:55:21 2019
| Host         : ubuv1604 running 64-bit Ubuntu 16.04.6 LTS
| Command      : report_utilization -file ultra96v2_oob_wrapper_utilization_placed.rpt -pb ultra96v2_oob_wrapper_utilization_placed.pb
| Design       : ultra96v2_oob_wrapper
| Device       : xczu3egsbva484-1
| Design State : Fully Placed
---------------------------------------------------------------------------------------------------------------------------------------

Utilization Design Information

Table of Contents
-----------------
1. CLB Logic
1.1 Summary of Registers by Type
2. CLB Logic Distribution
3. BLOCKRAM
4. ARITHMETIC
5. I/O
6. CLOCK
7. ADVANCED
8. CONFIGURATION
9. Primitives
10. Black Boxes
11. Instantiated Netlists

1. CLB Logic
------------

+----------------------------+------+-------+-----------+-------+
|          Site Type         | Used | Fixed | Available | Util% |
+----------------------------+------+-------+-----------+-------+
| CLB LUTs                   | 2597 |     0 |     70560 |  3.68 |
|   LUT as Logic             | 2459 |     0 |     70560 |  3.48 |
|   LUT as Memory            |  138 |     0 |     28800 |  0.48 |
|     LUT as Distributed RAM |   56 |     0 |           |       |
|     LUT as Shift Register  |   82 |     0 |           |       |
| CLB Registers              | 2911 |     0 |    141120 |  2.06 |
|   Register as Flip Flop    | 2911 |     0 |    141120 |  2.06 |
|   Register as Latch        |    0 |     0 |    141120 |  0.00 |
| CARRY8                     |   18 |     0 |      8820 |  0.20 |
| F7 Muxes                   |    0 |     0 |     35280 |  0.00 |
| F8 Muxes                   |    0 |     0 |     17640 |  0.00 |
| F9 Muxes                   |    0 |     0 |      8820 |  0.00 |
+----------------------------+------+-------+-----------+-------+


1.1 Summary of Registers by Type
--------------------------------

+-------+--------------+-------------+--------------+
| Total | Clock Enable | Synchronous | Asynchronous |
+-------+--------------+-------------+--------------+
| 0     |            _ |           - |            - |
| 0     |            _ |           - |          Set |
| 0     |            _ |           - |        Reset |
| 0     |            _ |         Set |            - |
| 0     |            _ |       Reset |            - |
| 0     |          Yes |           - |            - |
| 33    |          Yes |           - |          Set |
| 69    |          Yes |           - |        Reset |
| 168   |          Yes |         Set |            - |
| 2641  |          Yes |       Reset |            - |
+-------+--------------+-------------+--------------+


2. CLB Logic Distribution
-------------------------

+--------------------------------------------+------+-------+-----------+-------+
|                  Site Type                 | Used | Fixed | Available | Util% |
+--------------------------------------------+------+-------+-----------+-------+
| CLB                                        |  525 |     0 |      8820 |  5.95 |
|   CLBL                                     |  356 |     0 |           |       |
|   CLBM                                     |  169 |     0 |           |       |
| LUT as Logic                               | 2459 |     0 |     70560 |  3.48 |
|   using O5 output only                     |   63 |       |           |       |
|   using O6 output only                     | 1873 |       |           |       |
|   using O5 and O6                          |  523 |       |           |       |
| LUT as Memory                              |  138 |     0 |     28800 |  0.48 |
|   LUT as Distributed RAM                   |   56 |     0 |           |       |
|     using O5 output only                   |    0 |       |           |       |
|     using O6 output only                   |    0 |       |           |       |
|     using O5 and O6                        |   56 |       |           |       |
|   LUT as Shift Register                    |   82 |     0 |           |       |
|     using O5 output only                   |    0 |       |           |       |
|     using O6 output only                   |   80 |       |           |       |
|     using O5 and O6                        |    2 |       |           |       |
| CLB Registers                              | 2911 |     0 |    141120 |  2.06 |
|   Register driven from within the CLB      | 1462 |       |           |       |
|   Register driven from outside the CLB     | 1449 |       |           |       |
|     LUT in front of the register is unused |  725 |       |           |       |
|     LUT in front of the register is used   |  724 |       |           |       |
| Unique Control Sets                        |  211 |       |     17640 |  1.20 |
+--------------------------------------------+------+-------+-----------+-------+
* Note: Available Control Sets calculated as CLB Registers / 8, Review the Control Sets Report for more information regarding control sets.


3. BLOCKRAM
-----------

+----------------+------+-------+-----------+-------+
|    Site Type   | Used | Fixed | Available | Util% |
+----------------+------+-------+-----------+-------+
| Block RAM Tile |    0 |     0 |       216 |  0.00 |
|   RAMB36/FIFO* |    0 |     0 |       216 |  0.00 |
|   RAMB18       |    0 |     0 |       432 |  0.00 |
+----------------+------+-------+-----------+-------+
* Note: Each Block RAM Tile only has one FIFO logic available and therefore can accommodate only one FIFO36E2 or one FIFO18E2. However, if a FIFO18E2 occupies a Block RAM Tile, that tile can still accommodate a RAMB18E2


4. ARITHMETIC
-------------

+-----------+------+-------+-----------+-------+
| Site Type | Used | Fixed | Available | Util% |
+-----------+------+-------+-----------+-------+
| DSPs      |    0 |     0 |       360 |  0.00 |
+-----------+------+-------+-----------+-------+


5. I/O
------

+------------------+------+-------+-----------+-------+
|     Site Type    | Used | Fixed | Available | Util% |
+------------------+------+-------+-----------+-------+
| Bonded IOB       |   45 |    45 |        82 | 54.88 |
| HPIOB_M          |   13 |    13 |        26 | 50.00 |
|   INPUT          |    0 |       |           |       |
|   OUTPUT         |   13 |       |           |       |
|   BIDIR          |    0 |       |           |       |
| HPIOB_S          |   14 |    14 |        26 | 53.85 |
|   INPUT          |    0 |       |           |       |
|   OUTPUT         |   14 |       |           |       |
|   BIDIR          |    0 |       |           |       |
| HDIOB_M          |    6 |     6 |        12 | 50.00 |
|   INPUT          |    3 |       |           |       |
|   OUTPUT         |    3 |       |           |       |
|   BIDIR          |    0 |       |           |       |
| HDIOB_S          |   10 |    10 |        12 | 83.33 |
|   INPUT          |    2 |       |           |       |
|   OUTPUT         |    8 |       |           |       |
|   BIDIR          |    0 |       |           |       |
| HPIOB_SNGL       |    2 |     2 |         6 | 33.33 |
|   INPUT          |    0 |       |           |       |
|   OUTPUT         |    2 |       |           |       |
|   BIDIR          |    0 |       |           |       |
| HPIOBDIFFINBUF   |    0 |     0 |        72 |  0.00 |
| HPIOBDIFFOUTBUF  |    0 |     0 |        72 |  0.00 |
| HDIOBDIFFINBUF   |    0 |     0 |        48 |  0.00 |
| BITSLICE_CONTROL |    0 |     0 |        24 |  0.00 |
| BITSLICE_RX_TX   |    0 |     0 |       156 |  0.00 |
| BITSLICE_TX      |    0 |     0 |        24 |  0.00 |
| RIU_OR           |    0 |     0 |        12 |  0.00 |
+------------------+------+-------+-----------+-------+


6. CLOCK
--------

+----------------------+------+-------+-----------+-------+
|       Site Type      | Used | Fixed | Available | Util% |
+----------------------+------+-------+-----------+-------+
| GLOBAL CLOCK BUFFERs |    1 |     0 |       196 |  0.51 |
|   BUFGCE             |    0 |     0 |        88 |  0.00 |
|   BUFGCE_DIV         |    0 |     0 |        12 |  0.00 |
|   BUFG_PS            |    1 |     0 |        72 |  1.39 |
|   BUFGCTRL*          |    0 |     0 |        24 |  0.00 |
| PLL                  |    0 |     0 |         6 |  0.00 |
| MMCM                 |    0 |     0 |         3 |  0.00 |
+----------------------+------+-------+-----------+-------+
* Note: Each used BUFGCTRL counts as two global buffer resources. This table does not include global clocking resources, only buffer cell usage. See the Clock Utilization Report (report_clock_utilization) for detailed accounting of global clocking resource availability.


7. ADVANCED
-----------

+-----------+------+-------+-----------+--------+
| Site Type | Used | Fixed | Available |  Util% |
+-----------+------+-------+-----------+--------+
| PS8       |    1 |     0 |         1 | 100.00 |
| SYSMONE4  |    1 |     1 |         1 | 100.00 |
+-----------+------+-------+-----------+--------+


8. CONFIGURATION
----------------

+-------------+------+-------+-----------+-------+
|  Site Type  | Used | Fixed | Available | Util% |
+-------------+------+-------+-----------+-------+
| BSCANE2     |    0 |     0 |         4 |  0.00 |
| DNA_PORTE2  |    0 |     0 |         1 |  0.00 |
| EFUSE_USR   |    0 |     0 |         1 |  0.00 |
| FRAME_ECCE4 |    0 |     0 |         1 |  0.00 |
| ICAPE3      |    0 |     0 |         2 |  0.00 |
| MASTER_JTAG |    0 |     0 |         1 |  0.00 |
| STARTUPE3   |    0 |     0 |         1 |  0.00 |
+-------------+------+-------+-----------+-------+


9. Primitives
-------------

+----------+------+---------------------+
| Ref Name | Used | Functional Category |
+----------+------+---------------------+
| FDRE     | 2641 |            Register |
| LUT6     | 1131 |                 CLB |
| LUT5     |  599 |                 CLB |
| LUT4     |  456 |                 CLB |
| LUT3     |  423 |                 CLB |
| LUT2     |  324 |                 CLB |
| FDSE     |  168 |            Register |
| RAMD32   |   98 |                 CLB |
| FDCE     |   69 |            Register |
| SRL16E   |   49 |                 CLB |
| LUT1     |   49 |                 CLB |
| OBUF     |   40 |                 I/O |
| SRLC32E  |   35 |                 CLB |
| FDPE     |   33 |            Register |
| CARRY8   |   18 |                 CLB |
| RAMS32   |   14 |                 CLB |
| INBUF    |    5 |                 I/O |
| IBUFCTRL |    5 |              Others |
| SYSMONE4 |    1 |            Advanced |
| PS8      |    1 |            Advanced |
| BUFG_PS  |    1 |               Clock |
+----------+------+---------------------+


10. Black Boxes
---------------

+----------+------+
| Ref Name | Used |
+----------+------+


11. Instantiated Netlists
-------------------------

+-----------------------------------------+------+
|                 Ref Name                | Used |
+-----------------------------------------+------+
| ultra96v2_oob_zynq_ultra_ps_e_0_0       |    1 |
| ultra96v2_oob_xbar_0                    |    1 |
| ultra96v2_oob_system_management_wiz_0_0 |    1 |
| ultra96v2_oob_rst_ps8_0_100M_0          |    1 |
| ultra96v2_oob_axi_uart16550_1_0         |    1 |
| ultra96v2_oob_axi_uart16550_0_0         |    1 |
| ultra96v2_oob_axi_gpio_2_0              |    1 |
| ultra96v2_oob_axi_gpio_1_0              |    1 |
| ultra96v2_oob_axi_gpio_0_0              |    1 |
| ultra96v2_oob_auto_pc_0                 |    1 |
| ultra96v2_oob_auto_ds_0                 |    1 |
| ultra96v2_oob_PWM_w_Int_1_0             |    1 |
| ultra96v2_oob_PWM_w_Int_0_0             |    1 |
+-----------------------------------------+------+


