<svg width="16" height="16" viewBox="0 0 16 16" fill="none" xmlns="http://www.w3.org/2000/svg">
<path d="M6.20898 15.4941C6.6748 15.4941 7.03516 15.3008 7.29004 14.9229L15.5518 2.05566C15.7363 1.76562 15.8154 1.51953 15.8154 1.28223C15.8154 0.658203 15.376 0.227539 14.7432 0.227539C14.3125 0.227539 14.0488 0.385742 13.7852 0.798828L6.16504 12.8838L2.25391 7.86523C1.99023 7.52246 1.71777 7.38184 1.33105 7.38184C0.698242 7.38184 0.241211 7.83008 0.241211 8.44531C0.241211 8.71777 0.337891 8.98145 0.566406 9.25391L5.11914 14.9316C5.42676 15.3184 5.75195 15.4941 6.20898 15.4941Z" fill="#157159"/>
</svg>
