<svg width="22" height="26" viewBox="0 0 22 26" fill="none" xmlns="http://www.w3.org/2000/svg">
<path d="M7.00005 22.9346C8.63628 22.9346 10.2542 22.9346 11.8712 22.9346C11.973 24.0462 10.8467 25.1398 9.56237 25.1901C8.11591 25.2467 6.99165 24.2687 7.00005 22.9346Z" fill="#157159"/>
<path d="M9.77378 0C10.3808 0.178016 10.8271 0.503044 10.9635 1.0951C11.0005 1.25611 10.9944 1.42512 11.0077 1.58564C11.4495 1.68615 11.8958 1.75665 12.3183 1.88867C15.6074 2.91776 17.5499 4.98344 18.0934 8.10371C18.1574 8.47174 18.1547 8.85128 18.1552 9.22581C18.1597 11.8085 18.1541 14.3918 18.1608 16.9745C18.1613 17.1435 18.206 17.32 18.2712 17.4795C18.4325 17.8776 18.6258 18.2651 18.791 18.6616C19.1201 19.4517 19.0688 20.2548 18.5783 20.9448C18.0751 21.6529 17.2561 21.9899 16.3116 21.9929C13.7991 22.0004 11.2866 21.9959 8.77464 21.9964C6.76861 21.9964 4.76203 22.0099 2.75601 21.9844C2.33625 21.9789 1.88997 21.8899 1.50611 21.7359C0.219205 21.2204 -0.354103 19.9372 0.226937 18.7731C0.696409 17.8326 0.878122 16.8845 0.854372 15.8544C0.803006 13.6307 0.870942 11.405 0.833384 9.18081C0.767106 5.26796 3.9435 2.20069 7.79924 1.54614C7.86165 1.53563 7.92185 1.51513 7.93566 1.51163C8.02348 1.22861 8.07043 0.962584 8.18752 0.725564C8.3847 0.327529 8.78458 0.135012 9.22146 0.000500044C9.40594 0 9.58986 0 9.77378 0ZM15.9371 19.5947C15.8504 19.3722 15.7885 19.1727 15.6974 18.9847C15.3395 18.2461 15.244 17.477 15.2528 16.673C15.2793 14.1577 15.2583 11.642 15.2672 9.1263C15.271 8.0232 14.959 7.01112 14.21 6.14054C12.7685 4.46489 10.8376 3.81333 8.53824 4.04936C5.75455 4.33488 3.39394 6.39856 3.43812 9.1648C3.47679 11.5885 3.42211 14.0127 3.45525 16.4364C3.4674 17.335 3.35859 18.1911 2.95484 19.0137C2.86702 19.1927 2.8129 19.3852 2.73447 19.5947C7.1475 19.5947 11.5152 19.5947 15.9371 19.5947Z" fill="#157159"/>
<circle cx="18" cy="4" r="3.5" fill="#FFAD0F" stroke="white"/>
</svg>
