<svg width="19" height="18" viewBox="0 0 19 18" fill="none" xmlns="http://www.w3.org/2000/svg">
<path d="M11.6641 9.98828C11.9505 10.2461 12.2799 10.375 12.6523 10.375C13.0247 10.375 13.3398 10.2461 13.5977 9.98828C13.8841 9.73047 14.0273 9.40104 14.0273 9C14.0273 8.59896 13.8841 8.26953 13.5977 8.01172C13.3398 7.75391 13.0247 7.625 12.6523 7.625C12.2799 7.625 11.9505 7.75391 11.6641 8.01172C11.4062 8.26953 11.2773 8.59896 11.2773 9C11.2773 9.40104 11.4062 9.73047 11.6641 9.98828ZM9 12.6523V5.34766H18.1523V12.6523H9ZM17.25 14.5V15.4023C17.25 15.8893 17.0638 16.319 16.6914 16.6914C16.319 17.0638 15.8893 17.25 15.4023 17.25H2.59766C2.08203 17.25 1.63802 17.0781 1.26562 16.7344C0.921875 16.362 0.75 15.918 0.75 15.4023V2.59766C0.75 2.08203 0.921875 1.65234 1.26562 1.30859C1.63802 0.936198 2.08203 0.75 2.59766 0.75H15.4023C15.8893 0.75 16.319 0.936198 16.6914 1.30859C17.0638 1.68099 17.25 2.11068 17.25 2.59766V3.5H9C8.48438 3.5 8.04036 3.6862 7.66797 4.05859C7.32422 4.40234 7.15234 4.83203 7.15234 5.34766V12.6523C7.15234 13.168 7.32422 13.612 7.66797 13.9844C8.04036 14.3281 8.48438 14.5 9 14.5H17.25Z" fill="#FFAD0F"/>
</svg>
