<svg width="19" height="20" viewBox="0 0 19 20" fill="none" xmlns="http://www.w3.org/2000/svg">
<path d="M14.1367 6.42871L17.4414 4.54785C17.3096 4.41602 17.1514 4.31055 16.958 4.20508L10.7529 0.671875C10.2168 0.364258 9.68066 0.197266 9.16211 0.197266C8.63477 0.197266 8.09863 0.364258 7.5625 0.671875L5.77832 1.68262L14.1367 6.42871ZM9.16211 9.25L12.915 7.12305L4.5918 2.36816L1.36621 4.20508C1.17285 4.31055 1.01465 4.41602 0.874023 4.54785L9.16211 9.25ZM9.75977 19.3223C9.82129 19.3047 9.87402 19.2783 9.93555 19.2432L16.8174 15.3232C17.6348 14.8574 18.0742 14.3828 18.0742 13.1084V6.26172C18.0742 5.99805 18.0566 5.78711 18.0039 5.59375L9.75977 10.3047V19.3223ZM8.55566 19.3223V10.3047L0.311523 5.59375C0.258789 5.78711 0.241211 5.99805 0.241211 6.26172V13.1084C0.241211 14.3828 0.689453 14.8574 1.49805 15.3232L8.38867 19.2432C8.44141 19.2783 8.49414 19.3047 8.55566 19.3223Z" fill="#157159"/>
</svg>
