<svg width="23" height="5" viewBox="0 0 23 5" fill="none" xmlns="http://www.w3.org/2000/svg">
<path d="M4.82031 2.55078C4.82031 1.25 3.76562 0.207031 2.44141 0.207031C1.15234 0.207031 0.0976562 1.25 0.0976562 2.55078C0.0976562 3.85156 1.15234 4.89453 2.44141 4.89453C3.76562 4.89453 4.82031 3.85156 4.82031 2.55078ZM13.4922 2.55078C13.4922 1.25 12.4492 0.207031 11.1484 0.207031C9.85938 0.207031 8.81641 1.25 8.81641 2.55078C8.81641 3.85156 9.85938 4.89453 11.1484 4.89453C12.4492 4.89453 13.4922 3.85156 13.4922 2.55078ZM22.1992 2.55078C22.1992 1.25 21.1562 0.207031 19.8555 0.207031C18.5312 0.207031 17.4883 1.25 17.4883 2.55078C17.4883 3.85156 18.5312 4.89453 19.8555 4.89453C21.1562 4.89453 22.1992 3.85156 22.1992 2.55078Z" fill="#157159"/>
</svg>
