<svg width="26" height="22" viewBox="0 0 26 22" fill="none" xmlns="http://www.w3.org/2000/svg">
<path d="M3.55664 16.6719H5.42188V18.166C5.42188 20.1777 6.4375 21.1934 8.48828 21.1934H22.7363C24.7676 21.1934 25.793 20.1777 25.793 18.166V8.2832C25.793 6.27148 24.7676 5.25586 22.7363 5.25586H20.8613V3.76172C20.8613 1.75 19.8359 0.734375 17.8047 0.734375H3.55664C1.50586 0.734375 0.490234 1.75 0.490234 3.76172V13.6445C0.490234 15.6562 1.50586 16.6719 3.55664 16.6719ZM3.57617 15.0996C2.59961 15.0996 2.0625 14.5723 2.0625 13.5566V3.84961C2.0625 2.83398 2.59961 2.30664 3.57617 2.30664H17.7754C18.7422 2.30664 19.2891 2.83398 19.2891 3.84961V5.25586H8.48828C6.4375 5.25586 5.42188 6.26172 5.42188 8.2832V15.0996H3.57617ZM8.50781 19.6211C7.53125 19.6211 6.99414 19.0938 6.99414 18.0781V8.37109C6.99414 7.35547 7.53125 6.82812 8.50781 6.82812H22.707C23.6738 6.82812 24.2207 7.35547 24.2207 8.37109V18.0781C24.2207 19.0938 23.6738 19.6211 22.707 19.6211H8.50781Z" fill="#9AA09F"/>
</svg>
