<svg width="20" height="20" viewBox="0 0 20 20" fill="none" xmlns="http://www.w3.org/2000/svg">
<path d="M19.5032 8.13967L17.7185 7.92528C17.5361 7.24451 17.2689 6.60134 16.9249 6.00456L18.0345 4.59422C18.2041 4.37742 18.1849 4.04224 17.9889 3.84705L16.1498 2.00712C15.9562 1.81273 15.6202 1.79193 15.4026 1.96152L13.9898 3.07268C13.3955 2.72869 12.7523 2.4615 12.0731 2.28071L11.8595 0.49598C11.8267 0.223191 11.5747 0 11.2995 0H8.69805C8.42286 0 8.17087 0.223191 8.13888 0.49598L7.92448 2.28071C7.24451 2.4623 6.60054 2.73029 6.00616 3.07348L4.59422 1.96392C4.37823 1.79433 4.04224 1.81433 3.84785 2.00872L2.00792 3.84945C1.81433 4.04304 1.79433 4.37902 1.96472 4.59662L3.07348 6.00776C2.72949 6.60294 2.4623 7.24691 2.28071 7.92768L0.49678 8.14127C0.223991 8.17327 0 8.42526 0 8.70125V11.3027C0 11.5779 0.223191 11.8283 0.49678 11.8619L2.28151 12.0763C2.4639 12.7547 2.73029 13.3979 3.07428 13.993L1.96552 15.4058C1.79673 15.6226 1.81593 15.9578 2.01112 16.153L3.84785 17.9937C4.04224 18.1873 4.37823 18.2089 4.59422 18.0393L6.00696 16.9273C6.60214 17.2713 7.24531 17.5393 7.92528 17.7201L8.13968 19.504C8.17247 19.7776 8.42366 20 8.69885 20H11.3003C11.5763 20 11.8275 19.7776 11.8595 19.504L12.0739 17.7201C12.7547 17.5377 13.3979 17.2705 13.9922 16.9273L15.405 18.0369C15.6218 18.2065 15.957 18.1865 16.1514 17.9921L17.9905 16.1514C18.1857 15.9578 18.2057 15.6218 18.0353 15.4034L16.9249 13.9922C17.2697 13.3971 17.5361 12.7539 17.7185 12.0747L19.5024 11.8603C19.776 11.8275 19.9992 11.5779 19.9992 11.3011V8.69965C20 8.42286 19.7776 8.17247 19.5032 8.13967ZM10.0004 14.9994C7.23891 14.9994 5.0006 12.7611 5.0006 9.9996C5.0006 7.23811 7.23891 4.9998 10.0004 4.9998C12.7619 4.9998 15.0002 7.23811 15.0002 9.9996C15.0002 12.7611 12.7627 14.9994 10.0004 14.9994Z" fill="#555857"/>
</svg>
