<svg width="24" height="22" viewBox="0 0 24 22" fill="none" xmlns="http://www.w3.org/2000/svg">
<path d="M12 21.5904C11.226 20.9043 10.3512 20.1907 9.426 19.4315H9.414C6.15601 16.7688 2.46361 13.756 0.832813 10.1458C0.297613 8.99678 0.0132138 7.74701 1.37731e-05 6.47806C-0.00176427 5.61687 0.168628 4.76401 0.501184 3.96956C0.833741 3.1751 1.32176 2.45507 1.93658 1.85173C2.5514 1.24839 3.28064 0.773912 4.08146 0.456156C4.88229 0.138399 5.73856 -0.0162303 6.60001 0.00134677C8.01676 0.0035834 9.40301 0.412835 10.5936 1.18035C11.1168 1.51974 11.5901 1.93027 12 2.40013C12.4128 1.93237 12.8856 1.52217 13.4076 1.18035C14.5977 0.412684 15.9836 0.00340799 17.4 0.00134677C18.2614 -0.0162303 19.1177 0.138399 19.9185 0.456156C20.7194 0.773912 21.4486 1.24839 22.0634 1.85173C22.6782 2.45507 23.1663 3.1751 23.4988 3.96956C23.8314 4.76401 24.0018 5.61687 24 6.47806C23.9878 7.74799 23.7038 9.00061 23.1672 10.1518C21.5364 13.762 17.8452 16.7736 14.5872 19.4315L14.5752 19.4411C13.6488 20.1955 12.7752 20.9091 12.0012 21.6L12 21.5904ZM6.60001 2.40013C5.48222 2.38615 4.4041 2.81373 3.60001 3.58992C3.21656 3.96639 2.91273 4.41605 2.70658 4.9122C2.50044 5.40834 2.39618 5.94084 2.40001 6.47806C2.41321 7.40159 2.62321 8.31313 3.01441 9.1503C3.78424 10.7079 4.82296 12.1176 6.08281 13.3146C7.27201 14.514 8.64 15.675 9.8232 16.6513C10.1508 16.9212 10.4844 17.1934 10.818 17.4657L11.028 17.6372C11.3484 17.8987 11.6796 18.1697 12 18.436L12.0156 18.4216L12.0228 18.4156H12.03L12.0408 18.4072H12.0528L12.0744 18.3892L12.1236 18.3496L12.132 18.3424L12.1452 18.3328H12.1524L12.1632 18.3232L12.96 17.6696L13.1688 17.4981C13.506 17.2234 13.8396 16.9511 14.1672 16.6813C15.3504 15.705 16.7196 14.5452 17.9088 13.3398C19.1689 12.1435 20.2076 10.7341 20.9772 9.17669C21.3756 8.33232 21.5892 7.41118 21.6012 6.47806C21.6035 5.94238 21.4984 5.41167 21.2921 4.91727C21.0858 4.42287 20.7824 3.9748 20.4 3.59952C19.5975 2.81982 18.5191 2.38871 17.4 2.40013C16.7248 2.39439 16.056 2.53153 15.4376 2.80254C14.8192 3.07354 14.2652 3.47227 13.812 3.97253L12 6.05947L10.188 3.97253C9.73477 3.47227 9.18076 3.07354 8.56237 2.80254C7.94397 2.53153 7.27521 2.39439 6.60001 2.40013Z" fill="#6D6E6E"/>
</svg>
