<svg width="24" height="23" viewBox="0 0 24 23" fill="none" xmlns="http://www.w3.org/2000/svg">
<path d="M9.13619 21.5458C9.66337 21.5458 10.0907 21.1184 10.0907 20.5913C10.0907 20.0641 9.66337 19.6367 9.13619 19.6367C8.60901 19.6367 8.18164 20.0641 8.18164 20.5913C8.18164 21.1184 8.60901 21.5458 9.13619 21.5458Z" stroke="black" stroke-width="2" stroke-linecap="round" stroke-linejoin="round"/>
<path d="M19.6362 21.5458C20.1634 21.5458 20.5907 21.1184 20.5907 20.5913C20.5907 20.0641 20.1634 19.6367 19.6362 19.6367C19.109 19.6367 18.6816 20.0641 18.6816 20.5913C18.6816 21.1184 19.109 21.5458 19.6362 21.5458Z" stroke="black" stroke-width="2" stroke-linecap="round" stroke-linejoin="round"/>
<path d="M1.5 1.5H5.31818L7.87636 14.2814C7.96365 14.7208 8.20273 15.1156 8.55175 15.3966C8.90077 15.6775 9.33748 15.8268 9.78545 15.8182H19.0636C19.5116 15.8268 19.9483 15.6775 20.2973 15.3966C20.6464 15.1156 20.8854 14.7208 20.9727 14.2814L22.5 6.27273H6.27273" stroke="black" stroke-width="2" stroke-linecap="round" stroke-linejoin="round"/>
</svg>
