# Alias OBJ Model File
# Exported from SketchUp, (c) 2000-2012 Trimble Navigation Limited
# File units = inches

mtllib bedsideC_v3.mtl

g Mesh1 Model

usemtl FrontColor
v -10.4061 221.35 14.9255
vt -10.4061 221.826
vn -4.14144e-018 -0.0827144 0.996573
v -10.4061 131.608 7.47709
vt -10.4061 131.776
v 116.276 131.608 7.47709
vt 116.276 131.776
v 116.276 221.35 14.9255
vt 116.276 221.826
f 1/1/1 2/2/1 3/3/1 4/4/1 

v -10.4061 226.579 12.7505
vt 12.7505 226.579
vn -1 1.86387e-016 -9.08886e-017
v -10.4061 242.268 6.22547
vt 6.22547 242.268
v -10.4061 242.268 -150.016
vt -150.016 242.268
v -10.4061 226.579 -155.417
vt -155.417 226.579
v -10.4061 227.394 -156.908
vt -156.908 227.394
v -10.4061 222.165 -158.709
vt -158.709 222.165
v -10.4061 221.35 -157.218
vt -157.218 221.35
v -10.4061 131.608 -149.079
vt -149.079 131.608
v -10.4061 127.907 -149.079
vt -149.079 127.907
v -10.4061 127.907 7.47709
vt 7.47709 127.907
vt 7.47709 131.608
vt 14.9255 221.35
v -10.4061 222.3 16.3649
vt 16.3649 222.3
v -10.4061 227.53 14.1899
vt 14.1899 227.53
f 5/5/2 6/6/2 7/7/2 8/8/2 9/9/2 10/10/2 11/11/2 12/12/2 13/13/2 14/14/2 2/15/2 1/16/2 15/17/2 16/18/2 

vt -10.4061 221.302
vn 2.23269e-018 0.384014 0.923327
vt -10.4061 204.311
v 116.276 226.579 12.7505
vt 116.276 204.311
v 116.276 242.268 6.22547
vt 116.276 221.302
f 6/19/3 5/20/3 17/21/3 18/22/3 

v 117.901 226.579 12.7505
vt -117.901 135.488
vn 1.72338e-019 0.8345 -0.551009
vt -116.276 135.488
vt 10.4061 135.488
vt 10.4061 137.212
v 117.901 227.53 14.1899
vt -117.901 137.212
f 19/23/4 17/24/4 5/25/4 16/26/4 20/27/4 

v 116.276 226.579 -155.417
vt 116.276 155.417
vn 2.15945e-015 1 -0
vt 116.276 -12.7505
vt 117.901 -12.7505
v 117.901 226.579 -155.417
vt 117.901 155.417
f 21/28/5 17/29/5 19/30/5 22/31/5 

vt -6.22547 242.268
vn 1 -9.68493e-016 5.57514e-017
vt -12.7505 226.579
vt 155.417 226.579
v 116.276 242.268 -150.016
vt 150.016 242.268
f 18/32/6 17/33/6 21/34/6 23/35/6 

vt -116.276 180.243
vn -7.16672e-015 0.325505 -0.94554
vt -116.276 163.651
vt 10.4061 163.651
vt 10.4061 180.243
f 23/36/7 21/37/7 8/38/7 7/39/7 

vt -10.4061 245.042
vn 1.91838e-015 0.877496 0.479583
vt 116.276 245.042
vt 117.901 245.042
v 117.901 227.394 -156.908
vt 117.901 246.741
vt -10.4061 246.741
f 8/40/8 21/41/8 22/42/8 24/43/8 9/44/8 

v 117.901 221.35 14.9255
vt -14.9255 221.35
vn 1 -1.3602e-015 -4.22405e-017
v 117.901 221.35 -157.218
vt 157.218 221.35
v 117.901 222.165 -158.709
vt 158.709 222.165
vt 156.908 227.394
vt -14.1899 227.53
v 117.901 222.3 16.3649
vt -16.3649 222.3
f 25/45/9 26/46/9 27/47/9 24/48/9 22/34/9 19/33/9 20/49/9 28/50/9 

vt -116.276 -14.9255
vn -2.15945e-015 -1 1.78268e-031
v 116.276 221.35 -157.218
vt -116.276 157.218
vt -117.901 157.218
vt -117.901 -14.9255
f 4/51/10 29/52/10 26/53/10 25/54/10 

vn 1 -3.30093e-019 -8.76751e-017
v 116.276 213.013 4.3236
vt -4.3236 213.013
f 4/45/11 30/55/11 29/46/11

vt -7.47709 131.608
f 30/55/11 4/45/11 3/56/11

v 116.276 136.389 -4.35586
vt 4.35586 136.389
f 3/56/11 31/57/11 30/55/11

v 116.276 127.907 -149.079
vt 149.079 127.907
f 3/56/11 32/58/11 31/57/11

v 116.276 127.907 7.47709
vt -7.47709 127.907
f 32/58/11 3/56/11 33/59/11

vt 116.276 131.608
vn 0 0 1
vt -10.4061 131.608
vt -10.4061 127.907
vt 116.276 127.907
f 3/60/12 2/61/12 14/62/12 33/63/12 

vt -116.276 -7.47709
vn 0 -1 -0
vt 10.4061 -7.47709
vt 10.4061 149.079
vt -116.276 149.079
f 33/64/13 14/65/13 13/66/13 32/67/13 

vt 10.4061 131.608
vn 0 0 -1
v 116.276 131.608 -149.079
vt -116.276 131.608
vt -116.276 127.907
vt 10.4061 127.907
f 12/68/14 34/69/14 32/70/14 13/71/14 

vt 10.4061 144.536
vn -5.19768e-015 -0.0903227 -0.995913
vt 10.4061 234.645
vt -116.276 234.645
vt -116.276 144.536
f 12/72/15 11/73/15 29/74/15 34/75/15 

vt -116.276 244.114
vn -1.93991e-015 -0.877496 -0.479583
vt 10.4061 244.114
vt 10.4061 245.813
v 116.276 222.165 -158.709
vt -116.276 245.813
f 29/76/16 11/77/16 10/78/16 35/79/16 

vt 10.4061 158.405
vn -1.04976e-014 0.325505 -0.94554
vt 10.4061 163.936
vt -117.901 163.936
vt -117.901 158.405
vt -116.276 158.405
f 10/80/17 9/81/17 24/82/17 27/83/17 35/84/17 

vt -117.901 244.114
vn 0 -0.877496 -0.479583
vt -117.901 245.813
f 26/85/18 29/76/18 35/79/18 27/86/18 

v 116.276 213.013 -146.114
vt 146.114 213.013
vt 149.079 131.608
f 29/46/11 36/87/11 34/88/11

f 29/46/11 30/55/11 36/87/11

v 114.151 213.013 4.3236
vt -114.151 -4.3236
vn 4.14214e-017 -1 -0
v 114.151 213.013 -146.114
vt -114.151 146.114
vt -116.276 146.114
vt -116.276 -4.3236
f 37/89/19 38/90/19 36/91/19 30/92/19 

vn 1 0 -0
v 114.151 197.736 -70.0702
vt 70.0702 197.736
f 37/55/20 39/93/20 38/87/20

v 114.151 177.559 0.30765
vt -0.30765 177.559
f 39/93/20 37/55/20 40/94/20

vt -116.276 212.146
vn 0 0.112554 -0.993646
v 116.276 177.559 0.30765
vt -116.276 176.466
vt -114.151 176.466
vt -114.151 212.146
f 30/95/21 41/96/21 40/97/21 37/98/21 

v 116.276 172.754 -0.236697
vt 0.236697 172.754
f 30/55/11 42/99/11 41/94/11

f 30/55/11 31/57/11 42/99/11

v 114.151 172.754 -0.236697
vt -114.151 171.629
vt -116.276 171.629
vt -116.276 135.032
v 114.151 136.389 -4.35586
vt -114.151 135.032
f 43/100/21 42/101/21 31/102/21 44/103/21 

vt -114.151 0.236697
v 114.151 172.754 -142.003
vt -114.151 142.003
v 116.276 172.754 -142.003
vt -116.276 142.003
vt -116.276 0.236697
f 43/104/13 45/105/13 46/106/13 42/107/13 

v 114.151 159.424 -70.0702
vt 70.0702 159.424
vt 142.003 172.754
f 43/99/20 47/108/20 45/109/20

f 47/108/20 43/99/20 44/57/20

v 114.151 159.023 -69.3014
vt 69.3014 159.023
f 47/108/20 44/57/20 48/110/20

v 114.151 158.385 -68.6412
vt 68.6412 158.385
f 48/110/20 44/57/20 49/111/20

v 114.151 157.553 -68.1347
vt 68.1347 157.553
f 49/111/20 44/57/20 50/112/20

v 114.151 156.584 -67.8163
vt 67.8163 156.584
f 50/112/20 44/57/20 51/113/20

v 114.151 155.545 -67.7076
vt 67.7076 155.545
f 51/113/20 44/57/20 52/114/20

v 114.151 154.506 -67.8163
vt 67.8163 154.506
f 44/57/20 53/115/20 52/114/20

v 114.151 153.537 -68.1347
vt 68.1347 153.537
f 53/115/20 44/57/20 54/116/20

v 114.151 152.705 -68.6412
vt 68.6412 152.705
f 54/116/20 44/57/20 55/117/20

v 114.151 152.067 -69.3014
vt 69.3014 152.067
f 55/117/20 44/57/20 56/118/20

v 114.151 151.666 -70.0702
vt 70.0702 151.666
f 56/118/20 44/57/20 57/119/20

v 114.151 136.389 -138.29
vt 138.29 136.389
f 57/119/20 44/57/20 58/120/20

vt 114.151 138.29
vn -4.14214e-017 1 -0
vt 114.151 4.35586
vt 116.276 4.35586
v 116.276 136.389 -138.29
vt 116.276 138.29
f 58/121/22 44/122/22 31/123/22 59/124/22 

f 31/57/11 32/58/11 59/120/11

f 59/120/11 32/58/11 46/109/11

v 116.276 177.559 -142.494
vt 142.494 177.559
f 46/109/11 32/58/11 60/125/11

f 60/125/11 32/58/11 36/87/11

f 34/88/11 36/87/11 32/58/11

v 114.151 177.559 -142.494
vt 114.151 191.115
vn 0 0.101573 0.994828
vt 116.276 191.115
vt 116.276 226.752
vt 114.151 226.752
f 61/126/23 60/127/23 36/128/23 38/129/23 

vt 114.151 142.494
vn 0 1 1.99029e-016
vt 114.151 -0.30765
vt 116.276 -0.30765
vt 116.276 142.494
f 61/130/24 40/131/24 41/132/24 60/133/24 

v 114.151 189.977 -70.0702
vt 70.0702 189.977
f 62/134/20 40/94/20 61/125/20

v 114.151 190.379 -69.3014
vt 69.3014 190.379
f 63/135/20 40/94/20 62/134/20

v 114.151 191.017 -68.6412
vt 68.6412 191.017
f 64/136/20 40/94/20 63/135/20

v 114.151 191.849 -68.1347
vt 68.1347 191.849
f 65/137/20 40/94/20 64/136/20

v 114.151 192.817 -67.8163
vt 67.8163 192.817
f 66/138/20 40/94/20 65/137/20

v 114.151 193.857 -67.7076
vt 67.7076 193.857
f 40/94/20 66/138/20 67/139/20

vt 114.151 185.771
vt 114.151 184.726
vn 0 -0.209301 0.977851
v 117.839 192.817 -67.8163
vt 117.839 184.726
v 117.839 193.857 -67.7076
vt 117.839 185.771
f 67/140/12 66/141/25 68/142/25 69/143/12 

vt 114.151 161.995
vt 114.151 160.975
vn 0 -0.418967 0.908001
v 117.839 191.849 -68.1347
vt 117.839 160.975
vt 117.839 161.995
f 66/144/25 65/145/26 70/146/26 68/147/25 

vt 114.151 128.417
vt 114.151 127.443
vn 0 -0.62461 0.780937
v 117.839 191.017 -68.6412
vt 117.839 127.443
vt 117.839 128.417
f 65/148/26 64/149/27 71/150/27 70/151/26 

vt 114.151 83.4246
vt 114.151 82.5063
vn 0 -0.811093 0.584918
v 117.839 190.379 -69.3014
vt 117.839 82.5063
vt 117.839 83.4246
f 64/152/27 63/153/28 72/154/28 71/155/27 

vt 114.151 26.648
vt 114.151 25.7808
vn 0 -0.948382 0.317131
v 117.839 189.977 -70.0702
vt 117.839 25.7808
vt 117.839 26.648
f 63/156/28 62/157/29 73/158/29 72/159/28 

vt 114.151 -38.0365
v 114.151 189.841 -70.8951
vt 114.151 -38.8728
v 117.839 189.841 -70.8951
vt 117.839 -38.8728
vt 117.839 -38.0365
f 62/160/29 74/161/13 75/162/13 73/163/29 

vt 70.8951 189.841
f 62/134/20 61/125/20 74/164/20

v 114.151 189.977 -71.7201
vt 71.7201 189.977
f 74/164/20 61/125/20 76/165/20

v 114.151 190.379 -72.4889
vt 72.4889 190.379
f 76/165/20 61/125/20 77/166/20

v 114.151 191.017 -73.1491
vt 73.1491 191.017
f 77/166/20 61/125/20 78/167/20

v 114.151 191.849 -73.6556
vt 73.6556 191.849
f 78/167/20 61/125/20 79/168/20

v 114.151 192.817 -73.974
vt 73.974 192.817
f 79/168/20 61/125/20 80/169/20

v 114.151 193.857 -74.0826
vt 74.0826 193.857
f 80/169/20 61/125/20 81/170/20

f 38/87/20 81/170/20 61/125/20

v 114.151 194.896 -73.974
vt 73.974 194.896
f 38/87/20 82/171/20 81/170/20

v 114.151 195.865 -73.6556
vt 73.6556 195.865
f 38/87/20 83/172/20 82/171/20

v 114.151 196.697 -73.1491
vt 73.1491 196.697
f 38/87/20 84/173/20 83/172/20

v 114.151 197.335 -72.4889
vt 72.4889 197.335
f 38/87/20 85/174/20 84/173/20

v 114.151 197.736 -71.7201
vt 71.7201 197.736
f 38/87/20 86/175/20 85/174/20

v 114.151 197.873 -70.8951
vt 70.8951 197.873
f 38/87/20 87/176/20 86/175/20

f 38/87/20 39/93/20 87/176/20

vt 114.151 102.321
vn 0 1 -0
vt 114.151 101.484
vn 0 0.948382 0.317131
v 117.839 197.736 -70.0702
vt 117.839 101.484
v 117.839 197.873 -70.8951
vt 117.839 102.321
f 87/177/30 39/178/31 88/179/31 89/180/30 

vt 114.151 153.608
v 114.151 197.335 -69.3014
vt 114.151 152.741
vn 0 0.811093 0.584918
v 117.839 197.335 -69.3014
vt 117.839 152.741
vt 117.839 153.608
f 39/181/31 90/182/32 91/183/32 88/184/31 

vt 69.3014 197.335
f 39/93/20 40/94/20 90/185/20

v 114.151 196.697 -68.6412
vt 68.6412 196.697
f 90/185/20 40/94/20 92/186/20

v 114.151 195.865 -68.1347
vt 68.1347 195.865
f 92/186/20 40/94/20 93/187/20

v 114.151 194.896 -67.8163
vt 67.8163 194.896
f 93/187/20 40/94/20 94/188/20

f 94/188/20 40/94/20 67/139/20

vt 114.151 200.889
vn 0 0.209301 0.977851
vt 114.151 199.843
vt 117.839 199.843
v 117.839 194.896 -67.8163
vt 117.839 200.889
f 94/189/33 67/190/12 69/191/12 95/192/33 

v 117.839 197.736 -71.7201
v 117.839 196.697 -68.6412
v 117.839 195.865 -68.1347
v 117.839 189.977 -71.7201
v 117.839 190.379 -72.4889
v 117.839 191.017 -73.1491
v 117.839 191.849 -73.6556
v 117.839 192.817 -73.974
v 117.839 193.857 -74.0826
v 117.839 194.896 -73.974
v 117.839 195.865 -73.6556
v 117.839 196.697 -73.1491
v 117.839 197.335 -72.4889
f 96/175/20 89/176/20 88/93/20 91/185/20 97/186/20 98/187/20 95/188/20 69/139/20 68/138/20 70/137/20 71/136/20 72/135/20 73/134/20 75/164/20 99/165/20 100/166/20 101/167/20 102/168/20 103/169/20 104/170/20 105/171/20 106/172/20 107/173/20 108/174/20 

vt -114.151 -38.3946
vn 0 0.948382 -0.317131
vt -114.151 -37.5583
vt -117.839 -37.5583
vt -117.839 -38.3946
f 86/193/34 87/194/30 89/195/30 96/196/34 

vt -114.151 27.0408
vn 0 0.811093 -0.584918
vt -114.151 27.9079
vt -117.839 27.9079
vt -117.839 27.0408
f 85/197/35 86/198/34 96/199/34 108/200/35 

vt -114.151 84.1317
vn 0 0.62461 -0.780937
vt -114.151 85.05
vt -117.839 85.05
vt -117.839 84.1317
f 84/201/36 85/202/35 108/203/35 107/204/36 

vt -114.151 128.975
vn 0 0.418967 -0.908001
vt -114.151 129.949
vt -117.839 129.949
vt -117.839 128.975
f 83/205/37 84/206/36 107/207/36 106/208/37 

vt -114.151 162.046
vn 0 0.209301 -0.977851
vt -114.151 163.066
vt -117.839 163.066
vt -117.839 162.046
f 82/209/38 83/210/37 106/211/37 105/212/38 

vt -114.151 185.109
vn 0 -1.77905e-015 -1
vt -114.151 186.154
vt -117.839 186.154
vt -117.839 185.109
f 81/213/39 82/214/38 105/215/38 104/216/39 

vt -114.151 199.461
vn 0 -0.209301 -0.977851
vt -114.151 200.506
vt -117.839 200.506
vt -117.839 199.461
f 80/217/40 81/218/39 104/219/39 103/220/40 

vt -114.151 205.256
vn 0 -0.418967 -0.908001
vt -114.151 206.275
vt -117.839 206.275
vt -117.839 205.256
f 79/221/41 80/222/40 103/223/40 102/224/41 

vt -114.151 201.192
vn 0 -0.62461 -0.780937
vt -114.151 202.166
vt -117.839 202.166
vt -117.839 201.192
f 78/225/42 79/226/41 102/227/41 101/228/42 

vt -114.151 184.443
vn 0 -0.811093 -0.584918
vt -114.151 185.362
vt -117.839 185.362
vt -117.839 184.443
f 77/229/43 78/230/42 101/231/42 100/232/43 

vt -114.151 151.481
vn 0 -0.948382 -0.317131
vt -114.151 152.348
vt -117.839 152.348
vt -117.839 151.481
f 76/233/44 77/234/43 100/235/43 99/236/44 

vt -114.151 101.006
vt -114.151 101.842
vt -117.839 101.842
vt -117.839 101.006
f 74/237/13 76/238/44 99/239/44 75/240/13 

vt 114.151 186.987
vt 114.151 186.069
vn 0 0.62461 0.780937
vt 117.839 186.069
vt 117.839 186.987
f 90/241/32 92/242/45 97/243/45 91/244/32 

vt 114.151 203.699
vt 114.151 202.725
vn 0 0.418967 0.908001
vt 117.839 202.725
vt 117.839 203.699
f 92/245/45 93/246/46 98/247/46 97/248/45 

vt 114.151 207.347
vt 114.151 206.327
vt 117.839 206.327
vt 117.839 207.347
f 93/249/46 94/250/33 95/251/33 98/252/46 

f 42/99/11 60/125/11 41/94/11

f 60/125/11 42/99/11 46/109/11

vt 116.276 149.73
vt 116.276 186.284
vt 114.151 186.284
vt 114.151 149.73
f 59/253/23 46/254/23 45/255/23 58/256/23 

v 114.151 155.545 -74.0826
vt 74.0826 155.545
f 45/109/20 109/257/20 58/120/20

v 114.151 156.584 -73.974
vt 73.974 156.584
f 45/109/20 110/258/20 109/257/20

v 114.151 157.553 -73.6556
vt 73.6556 157.553
f 45/109/20 111/259/20 110/258/20

v 114.151 158.385 -73.1491
vt 73.1491 158.385
f 45/109/20 112/260/20 111/259/20

v 114.151 159.023 -72.4889
vt 72.4889 159.023
f 45/109/20 113/261/20 112/260/20

v 114.151 159.424 -71.7201
vt 71.7201 159.424
f 45/109/20 114/262/20 113/261/20

v 114.151 159.561 -70.8951
vt 70.8951 159.561
f 45/109/20 115/263/20 114/262/20

f 45/109/20 47/108/20 115/263/20

vt 114.151 96.051
vt 114.151 95.2147
v 117.839 159.424 -70.0702
vt 117.839 95.2147
v 117.839 159.561 -70.8951
vt 117.839 96.051
f 115/264/30 47/265/31 116/266/31 117/267/30 

vt 114.151 135.882
vt 114.151 135.015
v 117.839 159.023 -69.3014
vt 117.839 135.015
vt 117.839 135.882
f 47/268/31 48/269/32 118/270/32 116/271/31 

vt 114.151 160.357
vt 114.151 159.439
v 117.839 158.385 -68.6412
vt 117.839 159.439
vt 117.839 160.357
f 48/272/32 49/273/45 119/274/45 118/275/32 

vt 114.151 170.977
vt 114.151 170.003
v 117.839 157.553 -68.1347
vt 117.839 170.003
vt 117.839 170.977
f 49/276/45 50/277/46 120/278/46 119/279/45 

vt 114.151 170.951
vt 114.151 169.932
v 117.839 156.584 -67.8163
vt 117.839 169.932
vt 117.839 170.951
f 50/280/46 51/281/33 121/282/33 120/283/46 

vt 114.151 162.784
vt 114.151 161.739
v 117.839 155.545 -67.7076
vt 117.839 161.739
vt 117.839 162.784
f 51/284/33 52/285/12 122/286/12 121/287/33 

vt 114.151 147.667
vt 114.151 146.621
v 117.839 154.506 -67.8163
vt 117.839 146.621
vt 117.839 147.667
f 52/288/12 53/289/25 123/290/25 122/291/12 

vt 114.151 125.599
vt 114.151 124.579
v 117.839 153.537 -68.1347
vt 117.839 124.579
vt 117.839 125.599
f 53/292/25 54/293/26 124/294/26 123/295/25 

vt 114.151 95.6949
vt 114.151 94.721
v 117.839 152.705 -68.6412
vt 117.839 94.721
vt 117.839 95.6949
f 54/296/26 55/297/27 125/298/27 124/299/26 

vt 114.151 56.7946
vt 114.151 55.8764
v 117.839 152.067 -69.3014
vt 117.839 55.8764
vt 117.839 56.7946
f 55/300/27 56/301/28 126/302/28 125/303/27 

vt 114.151 8.92167
vt 114.151 8.0545
v 117.839 151.666 -70.0702
vt 117.839 8.0545
vt 117.839 8.92167
f 56/304/28 57/305/29 127/306/29 126/307/28 

vt 114.151 -44.3061
v 114.151 151.529 -70.8951
vt 114.151 -45.1424
v 117.839 151.529 -70.8951
vt 117.839 -45.1424
vt 117.839 -44.3061
f 57/308/29 128/309/13 129/310/13 127/311/29 

vt 70.8951 151.529
f 57/119/20 58/120/20 128/312/20

v 114.151 151.666 -71.7201
vt 71.7201 151.666
f 128/312/20 58/120/20 130/313/20

v 114.151 152.067 -72.4889
vt 72.4889 152.067
f 130/313/20 58/120/20 131/314/20

v 114.151 152.705 -73.1491
vt 73.1491 152.705
f 131/314/20 58/120/20 132/315/20

v 114.151 153.537 -73.6556
vt 73.6556 153.537
f 132/315/20 58/120/20 133/316/20

v 114.151 154.506 -73.974
vt 73.974 154.506
f 133/316/20 58/120/20 134/317/20

f 134/317/20 58/120/20 109/257/20

vt -114.151 161.356
vt -114.151 162.402
v 117.839 155.545 -74.0826
vt -117.839 162.402
v 117.839 154.506 -73.974
vt -117.839 161.356
f 134/318/40 109/319/39 135/320/39 136/321/40 

vt -114.151 147.004
vt -114.151 148.049
v 117.839 156.584 -73.974
vt -117.839 148.049
vt -117.839 147.004
f 109/322/39 110/323/38 137/324/38 135/325/39 

vt -114.151 125.651
vt -114.151 126.67
v 117.839 157.553 -73.6556
vt -117.839 126.67
vt -117.839 125.651
f 110/326/38 111/327/37 138/328/37 137/329/38 

vt -114.151 96.2536
vt -114.151 97.2275
v 117.839 158.385 -73.1491
vt -117.839 97.2275
vt -117.839 96.2536
f 111/330/37 112/331/36 139/332/36 138/333/37 

vt -114.151 57.5018
vt -114.151 58.42
v 117.839 159.023 -72.4889
vt -117.839 58.42
vt -117.839 57.5018
f 112/334/36 113/335/35 140/336/35 139/337/36 

vt -114.151 9.31447
vt -114.151 10.1816
v 117.839 159.424 -71.7201
vt -117.839 10.1816
vt -117.839 9.31447
f 113/338/35 114/339/34 141/340/34 140/341/35 

vt -114.151 -44.6641
vt -114.151 -43.8279
vt -117.839 -43.8279
vt -117.839 -44.6641
f 114/342/34 115/343/30 117/344/30 141/345/34 

v 117.839 151.666 -71.7201
v 117.839 152.067 -72.4889
v 117.839 152.705 -73.1491
v 117.839 153.537 -73.6556
f 141/262/20 117/263/20 116/108/20 118/110/20 119/111/20 120/112/20 121/113/20 122/114/20 123/115/20 124/116/20 125/117/20 126/118/20 127/119/20 129/312/20 142/313/20 143/314/20 144/315/20 145/316/20 136/317/20 135/257/20 137/258/20 138/259/20 139/260/20 140/261/20 

vt -114.151 94.7365
vt -114.151 95.5727
vt -117.839 95.5727
vt -117.839 94.7365
f 128/346/13 130/347/44 142/348/44 129/349/13 

vt -114.151 133.755
vt -114.151 134.622
vt -117.839 134.622
vt -117.839 133.755
f 130/350/44 131/351/43 143/352/43 142/353/44 

vt -114.151 157.814
vt -114.151 158.732
vt -117.839 158.732
vt -117.839 157.814
f 131/354/43 132/355/42 144/356/42 143/357/43 

vt -114.151 168.47
vt -114.151 169.444
vt -117.839 169.444
vt -117.839 168.47
f 132/358/42 133/359/41 145/360/41 144/361/42 

vt -114.151 168.86
vt -114.151 169.88
vt -117.839 169.88
vt -117.839 168.86
f 133/362/41 134/363/40 136/364/40 145/365/41 

vt 116.276 134.421
vn 0 -0.8345 0.551009
vt 117.901 134.421
vt 117.901 136.146
v 116.276 222.3 16.3649
vt 116.276 136.146
f 4/366/47 25/367/47 28/368/47 146/369/47 

vt -10.4061 198.971
vn 1.45236e-033 0.384014 0.923327
vt 116.276 198.971
vt 117.901 198.971
vt 117.901 204.635
vt -10.4061 204.635
f 15/370/48 146/371/48 28/372/48 20/373/48 16/374/48 

vt -10.4061 134.421
vt -10.4061 136.146
f 1/375/47 4/366/47 146/369/47 15/376/47 

vt 116.276 150.016
vt -10.4061 150.016
vt -10.4061 -6.22547
vt 116.276 -6.22547
f 23/377/30 7/378/30 6/379/30 18/380/30 

g Mesh2 Model

v 3.53144 131.608 -125.134
vt -3.53144 125.134
v 3.53144 131.608 -138.317
vt -3.53144 138.317
v 12.4636 131.608 -138.317
vt -12.4636 138.317
v 12.4636 131.608 -125.134
vt -12.4636 125.134
f 147/381/13 148/382/13 149/383/13 150/384/13 

g Mesh3 Model

v 18.9456 4.301 -15.9042
vt -15.9042 19.301
vn -0.108769 0.994067 -1.58843e-019
v 18.2759 4.22772 -16.6743
vt -16.6743 18.6273
vn -0.21849 0.975839 -3.00957e-019
v 18.2759 4.22772 -1.95111
vt -1.95111 18.6273
v 18.9456 4.301 -2.72126
vt -2.72126 19.301
v 18.9456 4.301 -6.01699
vt -6.01699 19.301
v 18.9456 4.301 -9.31272
vt -9.31272 19.301
v 18.9456 4.301 -12.6084
vt -12.6084 19.301
f 151/385/49 152/386/50 153/387/50 154/388/49 155/389/49 156/390/49 157/391/49 

v 27.8778 4.301 -15.9042
vt -27.8778 -15.4253
vn 1.69108e-019 0.995504 -0.0947182
v 28.5475 4.22772 -16.6743
vt -28.5475 -16.1989
vn 5.39406e-019 0.98146 -0.191669
vt -18.2759 -16.1989
vt -18.9456 -15.4253
f 158/392/51 159/393/52 152/394/52 151/395/51 

vt 16.6743 -27.9183
vn 0.21849 0.975839 -1.68149e-016
vt 15.9042 -27.2446
vn 0.108769 0.994067 -1.20853e-016
v 27.8778 4.301 -12.6084
vt 12.6084 -27.2446
v 27.8778 4.301 -9.31272
vt 9.31272 -27.2446
v 27.8778 4.301 -6.01699
vt 6.01699 -27.2446
v 27.8778 4.301 -2.72126
vt 2.72126 -27.2446
v 28.5475 4.22772 -1.95111
vt 1.95111 -27.9183
v 28.5475 4.22772 -15.9042
vt 15.9042 -27.9183
f 159/396/53 158/397/54 160/398/54 161/399/54 162/400/54 163/401/54 164/402/53 165/403/53 

v 27.8778 50.0787 -15.9042
vt 15.9042 50.0787
vn 1 0 -2.15595e-015
v 27.8778 50.0787 -12.6084
vt 12.6084 50.0787
vt 12.6084 4.301
vt 15.9042 4.301
f 166/404/55 167/405/55 160/406/55 158/407/55 

v 31.4666 56.3735 -20.0313
vt 20.0313 64.5584
vn 0.868731 -0.495284 -3.6909e-016
v 31.4666 56.3735 -15.9042
vt 15.9042 64.5584
v 31.4666 56.3735 1.4059
vt -1.4059 64.5584
v 27.8778 50.0787 -2.72126
vt 2.72126 57.3123
v 27.8778 50.0787 -6.01699
vt 6.01699 57.3123
v 27.8778 50.0787 -9.31272
vt 9.31272 57.3123
vt 12.6084 57.3123
vt 15.9042 57.3123
f 168/408/56 169/409/56 170/410/56 171/411/56 172/412/56 173/413/56 167/414/56 166/415/56 

vt 20.0313 54.1364
vn 0.997749 0.0670611 -3.8369e-016
v 27.8778 109.769 -15.9042
vt 15.9042 107.652
v 27.8778 109.769 -2.72126
vt 2.72126 107.652
vt -1.4059 54.1364
vt 15.9042 54.1364
f 168/416/57 174/417/57 175/418/57 170/419/57 169/420/57 

vt -27.8778 108.217
vn -1.33133e-017 0.0770644 -0.997026
vt -31.4666 54.6622
v 15.3568 56.3735 -20.0313
vt -15.3568 54.6622
v 18.9456 109.769 -15.9042
vt -18.9456 108.217
f 174/421/58 168/422/58 176/423/58 177/424/58 

vt -31.4666 58.1273
vn 1.15845e-018 -0.548301 -0.836281
vt -27.8778 50.6001
v 18.9456 50.0787 -15.9042
vt -18.9456 50.6001
vt -15.3568 58.1273
f 168/425/59 166/426/59 178/427/59 176/428/59 

vt -27.8778 50.0787
vt -27.8778 4.301
vt -18.9456 4.301
vt -18.9456 50.0787
f 166/429/14 158/430/14 151/431/14 178/432/14 

vt -15.9042 4.301
vn -1 0 -0
vt -12.6084 4.301
v 18.9456 50.0787 -12.6084
vt -12.6084 50.0787
vt -15.9042 50.0787
f 151/433/60 157/434/60 179/435/60 178/436/60 

v 18.9456 50.0787 -9.31272
vt -9.31272 50.0787
vt -9.31272 4.301
f 180/437/60 179/435/60 157/434/60 156/438/60 

vt -20.0313 41.3675
vn -0.868731 -0.495284 1.84078e-017
vt -15.9042 34.1215
vt -12.6084 34.1215
vt -9.31272 34.1215
v 18.9456 50.0787 -6.01699
vt -6.01699 34.1215
v 18.9456 50.0787 -2.72126
vt -2.72126 34.1215
v 15.3568 56.3735 1.4059
vt 1.4059 41.3675
f 176/439/61 178/440/61 179/441/61 180/442/61 181/443/61 182/444/61 183/445/61 

vt -6.01699 4.301
vt -6.01699 50.0787
f 156/438/60 155/446/60 181/447/60 180/437/60 

vt -2.72126 50.0787
vt -2.72126 4.301
f 182/448/60 181/447/60 155/446/60 154/449/60 

vt 18.9456 50.0787
vt 18.9456 4.301
vt 27.8778 4.301
vt 27.8778 50.0787
f 182/450/12 154/451/12 163/452/12 171/453/12 

vt 18.9456 3.11641
vn -1.29139e-019 0.995504 0.0947182
vt 18.2759 2.34278
vn -6.48809e-020 0.98146 0.191669
vt 28.5475 2.34278
vt 27.8778 3.11641
f 154/454/62 153/455/63 164/456/63 163/457/62 

vt 18.2759 3.08158
v 17.6519 4.01289 -1.23345
vt 17.6519 2.33245
vn 1.76856e-019 0.921606 0.388126
v 29.1715 4.01289 -1.23345
vt 29.1715 2.33245
vt 28.5475 3.08158
f 153/458/63 184/459/64 185/460/64 164/461/63 

vt -16.6743 18.6568
v 17.6519 4.01289 -17.392
vt -17.392 17.9968
vn -0.43463 0.900609 -6.09009e-020
vt -1.23345 17.9968
vt -1.95111 18.6568
f 152/462/50 186/463/65 184/464/65 153/465/50 

vt -28.5475 -14.7615
v 29.1715 4.01289 -17.392
vt -29.1715 -15.5106
vn 6.37818e-019 0.921606 -0.388126
vt -17.6519 -15.5106
vt -18.2759 -14.7615
f 159/466/52 187/467/66 186/468/66 152/469/52 

vt 16.6743 -25.6166
vt 15.9042 -25.6166
vt 1.95111 -25.6166
vt 1.23345 -26.2766
vn 0.43463 0.900609 -2.11175e-016
v 29.1715 4.01289 -15.9042
vt 15.9042 -26.2766
vt 17.392 -26.2766
f 159/470/53 165/471/53 164/472/53 185/473/67 188/474/67 187/475/67 

vt 17.392 -22.4379
vt 15.9042 -22.4379
vt 1.23345 -22.4379
v 29.7074 3.67113 -0.617174
vt 0.617174 -23.0735
vn 0.641531 0.767097 -1.97698e-016
v 29.7074 3.67113 -15.9042
vt 15.9042 -23.0735
v 29.7074 3.67113 -18.0083
vt 18.0083 -23.0735
f 187/476/67 188/477/67 185/478/67 189/479/68 190/480/68 191/481/68 

vt 17.6519 3.02482
v 17.116 3.67113 -0.617174
vt 17.116 2.32013
vn 2.89153e-019 0.8075 0.589868
vt 29.7074 2.32013
vt 29.1715 3.02482
f 184/482/64 192/483/69 189/484/69 185/485/64 

vt -17.392 17.0407
v 17.116 3.67113 -18.0083
vt -18.0083 16.4051
vn -0.641531 0.767097 3.39027e-019
vt -0.617174 16.4051
vt -1.23345 17.0407
f 186/486/65 193/487/70 192/488/70 184/489/65 

vt -29.1715 -13.2637
vt -29.7074 -13.9684
vn 7.48517e-019 0.8075 -0.589868
vt -17.116 -13.9684
vt -17.6519 -13.2637
f 187/490/66 191/491/71 193/492/71 186/493/66 

vt -29.7074 -10.5922
v 30.1186 3.22575 -18.4811
vt -30.1186 -11.2418
vn 1.16193e-019 0.619328 -0.785132
v 16.7048 3.22575 -18.4811
vt -16.7048 -11.2418
vt -17.116 -10.5922
f 191/494/71 194/495/72 195/496/72 193/497/71 

vt 18.0083 -17.4547
vt 15.9042 -17.4547
vt 0.617174 -17.4547
v 30.1186 3.22575 -0.144292
vt 0.144292 -18.0609
vn 0.823107 0.567886 -2.06544e-016
v 30.1186 3.22575 -15.9042
vt 15.9042 -18.0609
vt 18.4811 -18.0609
f 191/498/68 190/499/68 189/500/68 196/501/73 197/502/73 194/503/73 

vt 17.116 2.96629
v 16.7048 3.22575 -0.144292
vt 16.7048 2.31669
vn 4.80693e-019 0.619328 0.785132
vt 30.1186 2.31669
vt 29.7074 2.96629
f 192/504/69 198/505/74 196/506/74 189/507/69 

vt -18.0083 14.308
vt -18.4811 13.7018
vn -0.823107 0.567886 1.82544e-019
vt -0.144292 13.7018
vt -0.617174 14.308
f 193/508/70 195/509/75 198/510/75 192/511/70 

vt -18.4811 10.3383
v 16.4463 2.70709 -18.7784
vt -18.7784 9.75884
vn -0.952417 0.304799 -5.76454e-020
v 16.4463 2.70709 0.152975
vt 0.152975 9.75884
vt -0.144292 10.3383
f 195/512/75 199/513/76 200/514/76 198/515/75 

vt -30.1186 -6.39127
v 30.3771 2.70709 -18.7784
vt -30.3771 -6.98907
vn -5.02741e-019 0.343193 -0.939265
vt -16.4463 -6.98907
vt -16.7048 -6.39127
f 194/516/72 201/517/77 199/518/77 195/519/72 

vt 18.4811 -10.5476
vt 15.9042 -10.5476
vt 0.144292 -10.5476
v 30.3771 2.70709 0.152975
vt -0.152975 -11.1271
vn 0.952417 0.304799 -2.05198e-016
v 30.3771 2.70709 -15.9042
vt 15.9042 -11.1271
vt 18.7784 -11.1271
f 194/520/73 197/521/73 196/522/73 202/523/78 203/524/78 201/525/78 

vt 16.7048 2.87042
vt 16.4463 2.27261
vn 4.72452e-019 0.343193 0.939265
vt 30.3771 2.27261
vt 30.1186 2.87042
f 198/526/74 200/527/79 202/528/79 196/529/74 

vt 16.4463 2.63585
v 16.3581 2.1505 0.254366
vt 16.3581 2.0701
vn 1.02903e-019 -5.92459e-016 1
v 30.4653 2.1505 0.254366
vt 30.4653 2.0701
vt 30.3771 2.63585
f 200/530/79 204/531/80 205/532/80 202/533/79 

vt -18.7784 5.24685
v 16.3581 2.1505 -18.8798
vt -18.8798 4.68332
vn -1 -5.0583e-016 -1.02379e-019
vt 0.254366 4.68332
vt 0.152975 5.24685
f 199/534/76 206/535/81 204/536/81 200/537/76 

vt -30.3771 -0.702146
v 30.4653 2.1505 -18.8798
vt -30.4653 -1.2679
vn -6.2422e-020 -5.92459e-016 -1
vt -16.3581 -1.2679
vt -16.4463 -0.702146
f 201/538/77 207/539/82 206/540/82 199/541/77 

vt 18.7784 -2.07889
vt 15.9042 -2.07889
vt -0.152975 -2.07889
vt -0.254366 -2.64242
vn 1 -5.0583e-016 -1.85158e-016
v 30.4653 2.1505 -15.9042
vt 15.9042 -2.64242
vt 18.8798 -2.64242
f 201/542/78 203/543/78 202/544/78 205/545/83 208/546/83 207/547/83 

vt 18.8798 6.89045
vt 15.9042 6.89045
vt -0.254366 6.89045
v 30.3771 1.59391 0.152975
vt -0.152975 6.32692
vn 0.952417 -0.304799 -2.05825e-016
v 30.3771 1.59391 -15.9042
vt 15.9042 6.32692
v 30.3771 1.59391 -18.7784
vt 18.7784 6.32692
f 207/548/83 208/549/83 205/550/83 209/551/84 210/552/84 211/553/84 

vt 16.3581 2.16127
v 16.4463 1.59391 0.152975
vt 16.4463 1.59552
vn 7.01829e-020 -0.343193 0.939265
vt 30.3771 1.59552
vt 30.4653 2.16127
f 204/554/80 212/555/85 209/556/85 205/557/80 

vt -18.8798 -0.435288
v 16.4463 1.59391 -18.7784
vt -18.7784 -0.998818
vn -0.952417 -0.304799 2.52274e-019
vt 0.152975 -0.998818
vt 0.254366 -0.435288
f 206/558/81 213/559/86 212/560/86 204/561/81 

vt -30.4653 5.49926
vt -30.3771 4.93351
vn -1.64941e-019 -0.343193 -0.939265
vt -16.4463 4.93351
vt -16.3581 5.49926
f 207/562/82 211/563/87 213/564/87 206/565/82 

vt -30.3771 10.7206
v 30.1186 1.07525 -18.4811
vt -30.1186 10.1228
vn 4.14657e-019 -0.619328 -0.785132
v 16.7048 1.07525 -18.4811
vt -16.7048 10.1228
vt -16.4463 10.7206
f 211/566/87 214/567/88 215/568/88 213/569/87 

vt 18.7784 14.9765
vt 15.9042 14.9765
vt -0.152975 14.9765
v 30.1186 1.07525 -0.144292
vt 0.144292 14.397
vn 0.823107 -0.567886 -2.0724e-016
v 30.1186 1.07525 -15.9042
vt 15.9042 14.397
vt 18.4811 14.397
f 211/570/84 210/571/84 209/572/84 216/573/89 217/574/89 214/575/89 

vt 16.4463 1.45895
v 16.7048 1.07525 -0.144292
vt 16.7048 0.861138
vn -3.00559e-019 -0.619328 0.785132
vt 30.1186 0.861138
vt 30.3771 1.45895
f 212/576/85 218/577/90 216/578/90 209/579/85 

vt -18.7784 -5.90943
vt -18.4811 -6.48893
vn -0.823107 -0.567886 4.71529e-019
vt -0.144292 -6.48893
vt 0.152975 -5.90943
f 213/580/86 215/581/91 218/582/91 212/583/86 

vt -18.4811 -10.5417
v 17.116 0.629867 -18.0083
vt -18.0083 -11.1478
vn -0.641531 -0.767097 3.39027e-019
v 17.116 0.629867 -0.617174
vt -0.617174 -11.1478
vt -0.144292 -10.5417
f 215/584/91 219/585/92 220/586/92 218/587/91 

vt -30.1186 14.1907
v 29.7074 0.629867 -18.0083
vt -29.7074 13.5411
vn 4.12546e-019 -0.8075 -0.589868
vt -17.116 13.5411
vt -16.7048 14.1907
f 214/588/88 221/589/93 219/590/93 215/591/88 

vt 18.4811 21.221
vt 15.9042 21.221
vt 0.144292 21.221
v 29.7074 0.629867 -0.617174
vt 0.617174 20.6148
vn 0.641531 -0.767097 -1.98177e-016
v 29.7074 0.629867 -15.9042
vt 15.9042 20.6148
vt 18.0083 20.6148
f 214/592/89 217/593/89 216/594/89 222/595/94 223/596/94 221/597/94 

vt 16.7048 0.632179
vt 17.116 -0.0174237
vn -1.20004e-018 -0.8075 0.589868
vt 29.7074 -0.0174237
vt 30.1186 0.632179
f 218/598/90 220/599/95 222/600/95 216/601/90 

vt 17.116 -0.234269
v 17.6519 0.288112 -1.23345
vt 17.6519 -0.938959
vn -8.2908e-019 -0.921606 0.388126
v 29.1715 0.288112 -1.23345
vt 29.1715 -0.938959
vt 29.7074 -0.234269
f 220/602/95 224/603/96 225/604/96 222/605/95 

vt -18.0083 -14.0925
v 17.6519 0.288112 -17.392
vt -17.392 -14.728
vn -0.43463 -0.900609 1.60313e-019
vt -1.23345 -14.728
vt -0.617174 -14.0925
f 219/606/92 226/607/97 224/608/97 220/609/92 

vt -29.7074 16.0542
v 29.1715 0.288112 -17.392
vt -29.1715 15.3495
vn 3.02506e-019 -0.921606 -0.388126
vt -17.6519 15.3495
vt -17.116 16.0542
f 221/610/93 227/611/98 226/612/98 219/613/93 

vt 18.0083 25.3861
vt 15.9042 25.3861
vt 0.617174 25.3861
vt 1.23345 24.7505
vn 0.43463 -0.900609 -2.10863e-016
v 29.1715 0.288112 -15.9042
vt 15.9042 24.7505
vt 17.392 24.7505
f 221/614/94 223/615/94 222/616/94 225/617/99 228/618/99 227/619/99 

vt 17.392 27.6766
vt 15.9042 27.6766
vt 1.23345 27.6766
v 28.5475 0.0732765 -1.95111
vt 1.95111 27.0166
vn 0.21849 -0.975839 -1.67775e-016
v 28.5475 0.0732765 -15.9042
vt 15.9042 27.0166
v 28.5475 0.0732765 -16.6743
vt 16.6743 27.0166
f 227/620/99 228/621/99 225/622/99 229/623/100 230/624/100 231/625/100 

vt 17.6519 -1.09901
v 18.2759 0.0732765 -1.95111
vt 18.2759 -1.84814
vn -1.00668e-019 -0.98146 0.191669
vt 28.5475 -1.84814
vt 29.1715 -1.09901
f 224/626/96 232/627/101 229/628/101 225/629/96 

vt -17.392 -16.5968
v 18.2759 0.0732765 -16.6743
vt -16.6743 -17.2568
vn -0.21849 -0.975839 1.77612e-019
vt -1.95111 -17.2568
vt -1.23345 -16.5968
f 226/630/97 233/631/102 232/632/102 224/633/97 

vt -29.1715 16.7441
vt -28.5475 15.995
vn 5.39406e-019 -0.98146 -0.191669
vt -18.2759 15.995
vt -17.6519 16.7441
f 227/634/98 231/635/103 233/636/103 226/637/98 

vt -28.5475 16.6063
v 27.8778 0 -15.9042
vt -27.8778 15.8327
vn 1.69108e-019 -0.995504 -0.0947182
v 18.9456 0 -15.9042
vt -18.9456 15.8327
vt -18.2759 16.6063
f 231/638/103 234/639/104 235/640/104 233/641/103 

vt 16.6743 28.3861
vt 15.9042 28.3861
vt 1.95111 28.3861
v 27.8778 0 -2.72126
vt 2.72126 27.7124
vn 0.108769 -0.994067 -1.21281e-016
vt 15.9042 27.7124
f 231/642/100 230/643/100 229/644/100 236/645/105 234/646/105 

vt 18.2759 -1.9354
v 18.9456 0 -2.72126
vt 18.9456 -2.70902
vn -2.0037e-019 -0.995504 0.0947182
vt 27.8778 -2.70902
vt 28.5475 -1.9354
f 232/647/101 237/648/106 236/649/106 229/650/101 

vt -16.6743 -18.1595
vt -15.9042 -18.8332
vn -0.108769 -0.994067 3.53026e-019
vt -2.72126 -18.8332
vt -1.95111 -18.1595
f 233/651/102 235/652/107 237/653/107 232/654/102 

vt -27.8778 2.72126
vt -18.9456 2.72126
vt -18.9456 15.9042
vt -27.8778 15.9042
f 236/655/13 237/656/13 235/657/13 234/658/13 

vt 2.72126 4.301
vt 6.01699 4.301
vt 6.01699 50.0787
vt 2.72126 50.0787
f 163/659/55 162/660/55 172/661/55 171/662/55 

vt 9.31272 50.0787
vt 9.31272 4.301
f 173/663/55 172/661/55 162/660/55 161/664/55 

f 161/664/20 160/406/20 167/405/20 173/663/20 

vt 15.3568 47.915
vn 1.06643e-017 -0.548301 0.836281
vt 18.9456 40.3878
vt 27.8778 40.3878
vt 31.4666 47.915
f 183/665/108 182/666/108 171/667/108 170/668/108 

v 18.9456 109.769 -2.72126
vt 18.9456 109.652
vn 2.37232e-018 0.0770644 0.997026
vt 15.3568 56.0975
vt 31.4666 56.0975
vt 27.8778 109.652
f 238/669/109 183/670/109 170/671/109 175/672/109 

vt -15.9042 110.792
vn -0.997749 0.0670611 8.66171e-018
vt -20.0313 57.2765
vt 1.4059 57.2765
vt -2.72126 110.792
f 177/673/110 176/674/110 183/675/110 238/676/110 

v 16.0206 109.769 0.642491
vt -16.0206 -0.642491
f 238/656/13 239/677/13 177/657/13

v 30.8028 109.769 0.642491
vt -30.8028 -0.642491
f 239/677/13 238/656/13 240/678/13

f 240/678/13 238/656/13 175/655/13

v 30.8028 109.769 -19.2679
vt -30.8028 19.2679
f 240/678/13 175/655/13 241/679/13

f 174/658/13 241/679/13 175/655/13

f 177/657/13 241/679/13 174/658/13

v 16.0206 109.769 -19.2679
vt -16.0206 19.2679
f 177/657/13 242/680/13 241/679/13

f 242/680/13 177/657/13 239/677/13

v 16.0206 111.078 -19.2679
vt -19.2679 111.078
vt -19.2679 109.769
vt 0.642491 109.769
v 16.0206 111.078 0.642491
vt 0.642491 111.078
f 243/681/60 242/682/60 239/683/60 244/684/60 

v 30.8028 111.078 -19.2679
vt -30.8028 111.078
vt -30.8028 109.769
vt -16.0206 109.769
vt -16.0206 111.078
f 245/685/14 241/686/14 242/687/14 243/688/14 

vt 19.2679 111.078
vn 1 2.51553e-031 -3.63973e-016
v 30.8028 111.078 -15.9042
vt 15.9042 111.078
v 30.8028 111.078 0.642491
vt -0.642491 111.078
vt -0.642491 109.769
v 30.8028 109.769 -15.9042
vt 15.9042 109.769
vt 19.2679 109.769
f 245/689/111 246/690/111 247/691/111 240/692/111 248/693/111 241/694/111 

vt 30.8028 19.2679
vt 30.8028 -0.642491
vt 30.8028 15.9042
f 245/695/30 247/696/30 246/697/30

v 27.8778 111.078 -2.72126
vt 27.8778 2.72126
f 249/698/30 247/696/30 245/695/30

v 18.9456 111.078 -2.72126
vt 18.9456 2.72126
f 250/699/30 247/696/30 249/698/30

vt 16.0206 -0.642491
f 250/699/30 244/700/30 247/696/30

vt 16.0206 19.2679
f 244/700/30 250/699/30 243/701/30

v 18.9456 111.078 -15.9042
vt 18.9456 15.9042
f 251/702/30 243/701/30 250/699/30

f 243/701/30 251/702/30 245/695/30

v 27.8778 111.078 -15.9042
vt 27.8778 15.9042
f 245/695/30 251/702/30 252/703/30

v 27.8778 113.509 -15.9042
vt -27.8778 113.509
vt -27.8778 111.078
vt -18.9456 111.078
v 18.9456 113.509 -15.9042
vt -18.9456 113.509
f 253/704/14 252/705/14 251/706/14 254/707/14 

v 27.8778 113.509 -2.72126
vt 2.72126 113.509
vn 1 0 -1.61696e-015
vt 2.72126 111.078
vt 15.9042 113.509
f 255/708/112 249/709/112 252/690/112 253/710/112 

v 18.9456 113.509 -2.72126
vt 18.9456 113.509
vt 18.9456 111.078
vt 27.8778 111.078
vt 27.8778 113.509
f 256/711/12 250/712/12 249/713/12 255/714/12 

vt -15.9042 113.509
vt -15.9042 111.078
vt -2.72126 111.078
vt -2.72126 113.509
f 254/715/60 251/716/60 250/717/60 256/718/60 

v 13.2644 113.509 3.81218
vt -13.2644 -3.81218
f 256/656/13 257/719/13 254/657/13

v 33.559 113.509 3.81218
vt -33.559 -3.81218
f 257/719/13 256/656/13 258/720/13

f 258/720/13 256/656/13 255/655/13

v 33.559 113.509 -22.4376
vt -33.559 22.4376
f 258/720/13 255/655/13 259/721/13

f 253/658/13 259/721/13 255/655/13

f 254/657/13 259/721/13 253/658/13

v 13.2644 113.509 -22.4376
vt -13.2644 22.4376
f 254/657/13 260/722/13 259/721/13

f 260/722/13 254/657/13 257/719/13

vt 3.81218 110.075
vn -0.925481 0.378795 -1.30859e-018
v 15.5072 118.989 1.23293
vt 1.23293 115.996
v 15.5072 118.989 -19.8584
vt -19.8584 115.996
vt -22.4376 110.075
f 257/723/113 261/724/113 262/725/113 260/726/113 

vt 15.5072 107.134
vn 0 0.425872 0.904784
vt 13.2644 101.078
vt 33.559 101.078
v 31.3162 118.989 1.23293
vt 31.3162 107.134
f 261/727/114 257/728/114 258/729/114 263/730/114 

v 31.3162 118.989 -0.837066
vt 0.837066 98.2594
vn 0.925481 0.378795 4.30882e-018
vt -1.23293 98.2594
vt -3.81218 92.3384
v 33.559 113.509 0.203406
vt -0.203406 92.3384
v 33.559 113.509 -15.9042
vt 15.9042 92.3384
vt 22.4376 92.3384
v 31.3162 118.989 -19.8584
vt 19.8584 98.2594
v 31.3162 118.989 -15.9042
vt 15.9042 98.2594
f 264/731/115 263/732/115 258/733/115 265/734/115 266/735/115 259/736/115 267/737/115 268/738/115 

vt 31.3162 19.8584
vt 31.3162 -1.23293
vt 31.3162 0.837066
f 267/739/30 263/740/30 264/741/30

v 29.5162 118.989 -17.7884
vt 29.5162 17.7884
f 267/739/30 269/742/30 263/740/30

v 17.3072 118.989 -17.7884
vt 17.3072 17.7884
f 267/739/30 270/743/30 269/742/30

vt 15.5072 19.8584
f 262/744/30 270/743/30 267/739/30

v 17.3072 118.989 -0.837066
vt 17.3072 0.837066
f 270/743/30 262/744/30 271/745/30

vt 15.5072 -1.23293
f 261/746/30 271/745/30 262/744/30

f 271/745/30 261/746/30 263/740/30

v 29.5162 118.989 -0.837066
vt 29.5162 0.837066
f 271/745/30 263/740/30 272/747/30

v 29.5162 118.989 -15.9042
vt 29.5162 15.9042
f 272/747/30 263/740/30 273/748/30

f 273/748/30 263/740/30 269/742/30

vt 17.7884 118.989
vn 1 -3.57944e-031 4.3927e-016
v 29.5162 120.194 -17.7884
vt 17.7884 120.194
v 29.5162 120.194 -15.9042
vt 15.9042 120.194
v 29.5162 120.194 -0.837066
vt 0.837066 120.194
vt 0.837066 118.989
vt 15.9042 118.989
f 269/749/116 274/750/116 275/751/116 276/752/116 272/753/116 273/754/116 

vt -17.3072 118.989
v 17.3072 120.194 -17.7884
vt -17.3072 120.194
vt -29.5162 120.194
vt -29.5162 118.989
f 270/755/14 277/756/14 274/757/14 269/758/14 

vt -0.837066 118.989
v 17.3072 120.194 -0.837066
vt -0.837066 120.194
vt -17.7884 120.194
vt -17.7884 118.989
f 271/759/60 278/760/60 277/761/60 270/762/60 

vt 29.5162 118.989
vn 0 -2.94702e-015 1
vt 29.5162 120.194
vt 17.3072 120.194
vt 17.3072 118.989
f 272/763/117 276/764/117 278/765/117 271/766/117 

v 18.9456 120.194 -2.72126
f 279/699/30 278/745/30 276/747/30

f 278/745/30 279/699/30 277/743/30

v 18.9456 120.194 -15.9042
f 280/702/30 277/743/30 279/699/30

f 277/743/30 280/702/30 274/742/30

v 27.8778 120.194 -15.9042
f 274/742/30 280/702/30 281/703/30

v 27.8778 121.907 -15.9042
vt -27.8778 121.907
vt -27.8778 120.194
vt -18.9456 120.194
v 18.9456 121.907 -15.9042
vt -18.9456 121.907
f 282/767/14 281/768/14 280/769/14 283/770/14 

vt 15.9042 121.907
v 27.8778 121.907 -2.72126
vt 2.72126 121.907
v 27.8778 120.194 -2.72126
vt 2.72126 120.194
f 281/751/112 282/771/112 284/772/112 285/773/112 

vn -7.95488e-016 -1 5.38987e-016
v 18.9456 121.907 -2.72126
f 284/655/118 286/656/118 283/657/118 282/658/118 

vt 27.8778 120.194
vt 27.8778 121.907
vt 18.9456 121.907
vt 18.9456 120.194
f 285/774/12 284/775/12 286/776/12 279/777/12 

v 27.8778 127.907 -2.72126
vt 27.8778 127.907
v 18.9456 127.907 -2.72126
vt 18.9456 127.907
f 286/776/12 284/775/12 287/778/12 288/779/12 

v 27.8778 127.907 -15.9042
vt 15.9042 127.907
vt 2.72126 127.907
f 284/772/112 282/771/112 289/780/112 287/781/112 

v 18.9456 127.907 -15.9042
vt -18.9456 127.907
vt -27.8778 127.907
f 282/767/14 283/770/14 290/782/14 289/783/14 

vt -15.9042 121.907
vt -2.72126 121.907
vt -2.72126 127.907
vt -15.9042 127.907
f 283/784/60 286/785/60 288/786/60 290/787/60 

vt -2.72126 120.194
vt -15.9042 120.194
f 279/788/60 286/785/60 283/784/60 280/789/60 

f 279/699/30 276/747/30 285/698/30

f 274/742/30 285/698/30 276/747/30

f 274/742/30 281/703/30 285/698/30

f 274/742/30 276/747/30 275/748/30

vt -13.2644 93.1455
vn 0 0.425872 -0.904784
vt -15.5072 99.2019
vt -31.3162 99.2019
vt -33.559 93.1455
f 260/790/119 262/791/119 267/792/119 259/793/119 

vt 31.3162 15.9042
f 267/739/30 264/741/30 268/794/30

vt -33.559 15.9042
vt -33.559 -0.203406
f 258/720/13 266/795/13 265/796/13

f 258/720/13 259/721/13 266/795/13

f 245/695/30 252/703/30 249/698/30

vt 16.0206 111.078
vt 16.0206 109.769
vt 30.8028 109.769
vt 30.8028 111.078
f 244/797/12 239/798/12 240/799/12 247/800/12 

vt -30.8028 15.9042
f 240/678/13 241/679/13 248/801/13

g Mesh4 Model

v 101.707 0.629867 -18.0083
vt 18.0083 86.092
vn 0.641531 -0.767097 -1.9471e-016
v 101.707 0.629867 -15.9042
vt 15.9042 86.092
v 101.707 0.629867 -0.617174
vt 0.617174 86.092
v 101.172 0.288112 -1.23345
vt 1.23345 85.4565
vn 0.43463 -0.900609 3.33086e-019
v 101.172 0.288112 -15.9042
vt 15.9042 85.4565
v 101.172 0.288112 -17.392
vt 17.392 85.4565
f 291/802/120 292/803/120 293/804/120 294/805/121 295/806/121 296/807/121 

v 102.119 1.07525 -18.4811
vt 18.4811 70.0622
vn 0.823107 -0.567886 -4.16251e-016
v 102.119 1.07525 -15.9042
vt 15.9042 70.0622
v 102.119 1.07525 -0.144292
vt 0.144292 70.0622
vt 0.617174 69.4561
vt 15.9042 69.4561
vt 18.0083 69.4561
f 297/808/122 298/809/122 299/810/122 293/811/120 292/812/120 291/813/120 

v 102.377 1.59391 -18.7784
vt 18.7784 47.0926
vn 0.952417 -0.304799 -2.21567e-016
v 102.377 1.59391 -15.9042
vt 15.9042 47.0926
v 102.377 1.59391 0.152975
vt -0.152975 47.0926
vt 0.144292 46.5131
vt 15.9042 46.5131
vt 18.4811 46.5131
f 300/814/123 301/815/123 302/816/123 299/817/122 298/818/122 297/819/122 

v 102.465 2.1505 -18.8798
vt 18.8798 18.1552
vn 1 -5.1988e-016 -1.36667e-019
v 102.465 2.1505 -15.9042
vt 15.9042 18.1552
v 102.465 2.1505 0.254366
vt -0.254366 18.1552
vt -0.152975 17.5917
vt 15.9042 17.5917
vt 18.7784 17.5917
f 303/820/124 304/821/124 305/822/124 302/823/123 301/824/123 300/825/123 

v 102.377 2.70709 -18.7784
vt 18.7784 -13.3436
vn 0.952417 0.304799 -2.21386e-016
v 102.377 2.70709 -15.9042
vt 15.9042 -13.3436
v 102.377 2.70709 0.152975
vt -0.152975 -13.3436
vt -0.254366 -13.9072
vt 15.9042 -13.9072
vt 18.8798 -13.9072
f 306/826/125 307/827/125 308/828/125 305/829/124 304/830/124 303/831/124 

v 102.119 3.22575 -18.4811
vt 18.4811 -42.6637
vn 0.823107 0.567886 -4.16021e-016
v 102.119 3.22575 -15.9042
vt 15.9042 -42.6637
v 102.119 3.22575 -0.144292
vt 0.144292 -42.6637
vt -0.152975 -43.2432
vt 15.9042 -43.2432
vt 18.7784 -43.2432
f 309/832/126 310/833/126 311/834/126 308/835/125 307/836/125 306/837/125 

v 101.707 3.67113 -18.0083
vt 18.0083 -66.296
vn 0.641531 0.767097 -1.94803e-016
v 101.707 3.67113 -15.9042
vt 15.9042 -66.296
v 101.707 3.67113 -0.617174
vt 0.617174 -66.296
vt 0.144292 -66.9021
vt 15.9042 -66.9021
vt 18.4811 -66.9021
f 312/838/127 313/839/127 314/840/127 311/841/126 310/842/126 309/843/126 

v 101.172 4.01289 -17.392
vt 17.392 -83.1438
vn 0.43463 0.900609 -4.55541e-019
v 101.172 4.01289 -15.9042
vt 15.9042 -83.1438
v 101.172 4.01289 -1.23345
vt 1.23345 -83.1438
vt 0.617174 -83.7794
vt 15.9042 -83.7794
vt 18.0083 -83.7794
f 315/844/128 316/845/128 317/846/128 314/847/127 313/848/127 312/849/127 

v 100.547 4.22772 -16.6743
vt 16.6743 -93.6954
vn 0.21849 0.975839 -6.29588e-017
v 100.547 4.22772 -15.9042
vt 15.9042 -93.6954
v 100.547 4.22772 -1.95111
vt 1.95111 -93.6954
vt 1.23345 -94.3554
vt 15.9042 -94.3554
vt 17.392 -94.3554
f 318/850/129 319/851/129 320/852/129 317/853/128 316/854/128 315/855/128 

vt 16.6743 -99.4911
v 99.8778 4.301 -15.9042
vt 15.9042 -98.8174
vn 0.108769 0.994067 -1.24321e-016
v 99.8778 4.301 -12.6084
vt 12.6084 -98.8174
v 99.8778 4.301 -9.31272
vt 9.31272 -98.8174
v 99.8778 4.301 -6.01699
vt 6.01699 -98.8174
v 99.8778 4.301 -2.72126
vt 2.72126 -98.8174
vt 1.95111 -99.4911
vt 15.9042 -99.4911
f 318/856/129 321/857/130 322/858/130 323/859/130 324/860/130 325/861/130 320/862/129 319/863/129 

vt -99.8778 -15.4253
vn -3.1566e-019 0.995504 -0.0947182
vt -100.547 -16.1989
vn -1.58591e-019 0.98146 -0.191669
v 90.2759 4.22772 -16.6743
vt -90.2759 -16.1989
v 90.9456 4.301 -15.9042
vt -90.9456 -15.4253
f 321/864/131 318/865/132 326/866/132 327/867/131 

vt -100.547 -14.7615
vt -101.172 -15.5106
vn 5.79488e-019 0.921606 -0.388126
v 89.6519 4.01289 -17.392
vt -89.6519 -15.5106
vt -90.2759 -14.7615
f 318/868/132 315/869/133 328/870/133 326/871/132 

vt -101.172 -13.2637
vt -101.707 -13.9684
vn 9.3897e-019 0.8075 -0.589868
v 89.116 3.67113 -18.0083
vt -89.116 -13.9684
vt -89.6519 -13.2637
f 315/872/133 312/873/134 329/874/134 328/875/133 

vt -101.707 -10.5922
vt -102.119 -11.2418
vn 3.14537e-019 0.619328 -0.785132
v 88.7048 3.22575 -18.4811
vt -88.7048 -11.2418
vt -89.116 -10.5922
f 312/876/134 309/877/135 330/878/135 329/879/134 

vt -102.119 -6.39127
vt -102.377 -6.98907
vn -7.77885e-020 0.343193 -0.939265
v 88.4463 2.70709 -18.7784
vt -88.4463 -6.98907
vt -88.7048 -6.39127
f 309/880/135 306/881/136 331/882/136 330/883/135 

vt -102.377 -0.702146
vt -102.465 -1.2679
vn 3.73943e-020 -5.92459e-016 -1
v 88.3581 2.1505 -18.8798
vt -88.3581 -1.2679
vt -88.4463 -0.702146
f 306/884/136 303/885/137 332/886/137 331/887/136 

vt -102.465 5.49926
vt -102.377 4.93351
vn 2.49312e-020 -0.343193 -0.939265
v 88.4463 1.59391 -18.7784
vt -88.4463 4.93351
vt -88.3581 5.49926
f 303/888/137 300/889/138 333/890/138 332/891/137 

vt -102.377 10.7206
vt -102.119 10.1228
vn 3.14537e-019 -0.619328 -0.785132
v 88.7048 1.07525 -18.4811
vt -88.7048 10.1228
vt -88.4463 10.7206
f 300/892/138 297/893/139 334/894/139 333/895/138 

vt -102.119 14.1907
vt -101.707 13.5411
vn 9.02314e-019 -0.8075 -0.589868
v 89.116 0.629867 -18.0083
vt -89.116 13.5411
vt -88.7048 14.1907
f 297/896/139 291/897/140 335/898/140 334/899/139 

vt -101.707 16.0542
vt -101.172 15.3495
vn 5.42905e-019 -0.921606 -0.388126
v 89.6519 0.288112 -17.392
vt -89.6519 15.3495
vt -89.116 16.0542
f 291/900/140 296/901/141 336/902/141 335/903/140 

vt -101.172 16.7441
v 100.547 0.0732765 -16.6743
vt -100.547 15.995
vn -1.58591e-019 -0.98146 -0.191669
v 90.2759 0.0732765 -16.6743
vt -90.2759 15.995
vt -89.6519 16.7441
f 296/904/141 337/905/142 338/906/142 336/907/141 

vt 17.392 95.7554
vt 15.9042 95.7554
vt 1.23345 95.7554
v 100.547 0.0732765 -1.95111
vt 1.95111 95.0954
vn 0.21849 -0.975839 -4.53623e-017
v 100.547 0.0732765 -15.9042
vt 15.9042 95.0954
vt 16.6743 95.0954
f 296/908/121 295/909/121 294/910/121 339/911/143 340/912/143 337/913/143 

v 89.6519 0.288112 -1.23345
vt 89.6519 -1.09901
vn 5.42905e-019 -0.921606 0.388126
v 90.2759 0.0732765 -1.95111
vt 90.2759 -1.84814
vn 0 -0.98146 0.191669
vt 100.547 -1.84814
vt 101.172 -1.09901
f 341/914/144 342/915/145 339/916/145 294/917/144 

vt -17.392 -84.6756
vt -16.6743 -85.3356
vn -0.21849 -0.975839 5.31666e-020
vt -1.95111 -85.3356
vt -1.23345 -84.6756
f 336/918/97 338/919/146 342/920/146 341/921/97 

vt -16.6743 -89.7324
v 90.9456 0 -15.9042
vt -15.9042 -90.406
vn -0.108769 -0.994067 1.05675e-019
v 90.9456 0 -2.72126
vt -2.72126 -90.406
vt -1.95111 -89.7324
f 338/922/146 343/923/147 344/924/147 342/925/146 

vt -100.547 16.6063
v 99.8778 0 -15.9042
vt -99.8778 15.8327
vn -3.1566e-019 -0.995504 -0.0947182
vt -90.9456 15.8327
vt -90.2759 16.6063
f 337/926/142 345/927/148 343/928/148 338/929/142 

vt 16.6743 99.9589
vt 15.9042 99.9589
vt 1.95111 99.9589
v 99.8778 0 -2.72126
vt 2.72126 99.2852
vn 0.108769 -0.994067 -9.07606e-017
vt 15.9042 99.2852
f 337/930/143 340/931/143 339/932/143 346/933/149 345/934/149 

vt 90.2759 -1.9354
vt 90.9456 -2.70902
vn 0 -0.995504 0.0947182
vt 99.8778 -2.70902
vt 100.547 -1.9354
f 342/935/145 344/936/150 346/937/150 339/938/145 

vt -99.8778 2.72126
vt -90.9456 2.72126
vt -90.9456 15.9042
vt -99.8778 15.9042
f 346/939/13 344/940/13 343/941/13 345/942/13 

vt -18.0083 -74.7984
vt -17.392 -75.434
vt -1.23345 -75.434
v 89.116 0.629867 -0.617174
vt -0.617174 -74.7984
f 335/943/92 336/944/97 341/945/97 347/946/92 

vt 89.116 -0.234269
vn 3.26087e-019 -0.8075 0.589868
vt 89.6519 -0.938959
vt 101.172 -0.938959
vt 101.707 -0.234269
f 347/947/151 341/948/144 294/949/144 293/950/151 

v 88.7048 1.07525 -0.144292
vt 88.7048 0.632179
vn -2.18569e-019 -0.619328 0.785132
vt 89.116 -0.0174237
vt 101.707 -0.0174237
vt 102.119 0.632179
f 348/951/152 347/952/151 293/953/151 299/954/152 

vt -18.4811 -59.3829
vt -18.0083 -59.9891
vt -0.617174 -59.9891
vt -0.144292 -59.3829
f 334/955/91 335/956/92 347/957/92 348/958/91 

vt -18.7784 -38.0255
vt -18.4811 -38.605
vt -0.144292 -38.605
v 88.4463 1.59391 0.152975
vt 0.152975 -38.0255
f 333/959/86 334/960/91 348/961/91 349/962/86 

vt 88.4463 1.45895
vn 7.00237e-020 -0.343193 0.939265
vt 88.7048 0.861138
vt 102.119 0.861138
vt 102.377 1.45895
f 349/963/153 348/964/152 299/965/152 302/966/153 

v 88.3581 2.1505 0.254366
vt 88.3581 2.16127
vn 3.73943e-020 -5.64247e-016 1
vt 88.4463 1.59552
vt 102.377 1.59552
vt 102.465 2.16127
f 350/967/154 349/968/153 302/969/153 305/970/154 

vt -18.8798 -11.7
vn -1 -4.91779e-016 -1.02379e-019
vt -18.7784 -12.2636
vt 0.152975 -12.2636
vt 0.254366 -11.7
f 332/971/155 333/972/86 349/973/86 350/974/155 

vt -18.7784 16.5116
vt -18.8798 15.9481
vt 0.254366 15.9481
v 88.4463 2.70709 0.152975
vt 0.152975 16.5116
f 331/975/76 332/976/155 350/977/155 351/978/76 

vt 88.4463 2.63585
vn -3.2696e-020 0.343193 0.939265
vt 88.3581 2.0701
vt 102.465 2.0701
vt 102.377 2.63585
f 351/979/156 350/980/154 305/981/154 308/982/156 

v 88.7048 3.22575 -0.144292
vt 88.7048 2.87042
vn -2.18569e-019 0.619328 0.785132
vt 88.4463 2.27261
vt 102.377 2.27261
vt 102.119 2.87042
f 352/983/157 351/984/156 308/985/156 311/986/157 

vt -18.4811 42.4545
vt -18.7784 41.875
vt 0.152975 41.875
vt -0.144292 42.4545
f 330/987/75 331/988/76 351/989/76 352/990/75 

vt -18.0083 63.1492
vn -0.641531 0.767097 -8.82299e-020
vt -18.4811 62.543
vt -0.144292 62.543
v 89.116 3.67113 -0.617174
vt -0.617174 63.1492
f 329/991/158 330/992/75 352/993/75 353/994/158 

vt 89.116 2.96629
vn -9.88431e-021 0.8075 0.589868
vt 88.7048 2.31669
vt 102.119 2.31669
vt 101.707 2.96629
f 353/995/159 352/996/157 311/997/157 314/998/159 

v 89.6519 4.01289 -1.23345
vt 89.6519 3.02482
vn 2.07593e-019 0.921606 0.388126
vt 89.116 2.32013
vt 101.707 2.32013
vt 101.172 3.02482
f 354/999/160 353/1000/159 314/1001/159 317/1002/160 

vt -17.392 77.7466
vn -0.43463 0.900609 -4.8759e-019
vt -18.0083 77.111
vt -0.617174 77.111
vt -1.23345 77.7466
f 328/1003/161 329/1004/158 353/1005/158 354/1006/161 

vt -16.6743 86.7356
vn -0.21849 0.975839 -7.69821e-020
vt -17.392 86.0756
vt -1.23345 86.0756
v 90.2759 4.22772 -1.95111
vt -1.95111 86.7356
f 326/1007/162 328/1008/161 354/1009/161 355/1010/162 

vt 90.2759 3.08158
vn 0 0.98146 0.191669
vt 89.6519 2.33245
vt 101.172 2.33245
vt 100.547 3.08158
f 355/1011/163 354/1012/160 317/1013/160 320/1014/163 

v 90.9456 4.301 -2.72126
vt 90.9456 3.11641
vn 0 0.995504 0.0947182
vt 90.2759 2.34278
vt 100.547 2.34278
vt 99.8778 3.11641
f 356/1015/164 355/1016/163 320/1017/163 325/1018/164 

vt -15.9042 90.8739
vn -0.108769 0.994067 2.86336e-019
vt -16.6743 90.2002
vt -1.95111 90.2002
vt -2.72126 90.8739
v 90.9456 4.301 -6.01699
vt -6.01699 90.8739
v 90.9456 4.301 -9.31272
vt -9.31272 90.8739
v 90.9456 4.301 -12.6084
vt -12.6084 90.8739
f 327/1019/165 326/1020/162 355/1021/162 356/1022/165 357/1023/165 358/1024/165 359/1025/165 

v 90.9456 50.0787 -2.72126
v 90.9456 50.0787 -6.01699
f 360/448/60 361/447/60 357/446/60 356/449/60 

v 87.3568 56.3735 -20.0313
vt -20.0313 5.70705
vn -0.868731 -0.495284 9.28722e-018
v 90.9456 50.0787 -15.9042
vt -15.9042 -1.53897
v 90.9456 50.0787 -12.6084
vt -12.6084 -1.53897
v 90.9456 50.0787 -9.31272
vt -9.31272 -1.53897
vt -6.01699 -1.53897
vt -2.72126 -1.53897
v 87.3568 56.3735 1.4059
vt 1.4059 5.70705
f 362/1026/166 363/1027/166 364/1028/166 365/1029/166 361/1030/166 360/1031/166 366/1032/166 

v 103.467 56.3735 -20.0313
vt -103.467 58.1273
vn 8.17534e-019 -0.548301 -0.836281
v 99.8778 50.0787 -15.9042
vt -99.8778 50.6001
vt -90.9456 50.6001
vt -87.3568 58.1273
f 367/1033/167 368/1034/167 363/1035/167 362/1036/167 

vt 20.0313 100.219
vn 0.868731 -0.495284 -6.51335e-016
v 103.467 56.3735 -15.9042
vt 15.9042 100.219
v 103.467 56.3735 1.4059
vt -1.4059 100.219
v 99.8778 50.0787 -2.72126
vt 2.72126 92.9728
v 99.8778 50.0787 -6.01699
vt 6.01699 92.9728
v 99.8778 50.0787 -9.31272
vt 9.31272 92.9728
v 99.8778 50.0787 -12.6084
vt 12.6084 92.9728
vt 15.9042 92.9728
f 367/1037/168 369/1038/168 370/1039/168 371/1040/168 372/1041/168 373/1042/168 374/1043/168 368/1044/168 

vt 20.0313 49.308
vn 0.997749 0.0670611 -5.31028e-016
v 99.8778 109.769 -15.9042
vt 15.9042 102.824
v 99.8778 109.769 -2.72126
vt 2.72126 102.824
vt -1.4059 49.308
vt 15.9042 49.308
f 367/1045/169 375/1046/169 376/1047/169 370/1048/169 369/1049/169 

vt -99.8778 108.217
vn -2.37232e-018 0.0770644 -0.997026
vt -103.467 54.6622
vt -87.3568 54.6622
v 90.9456 109.769 -15.9042
vt -90.9456 108.217
f 375/1050/170 367/1051/170 362/1052/170 377/1053/170 

vt -15.9042 115.621
vt -20.0313 62.1049
vt 1.4059 62.1049
v 90.9456 109.769 -2.72126
vt -2.72126 115.621
f 377/1054/110 362/1055/110 366/1056/110 378/1057/110 

vt 90.9456 109.652
vn 0 0.0770644 0.997026
vt 87.3568 56.0975
vt 103.467 56.0975
vt 99.8778 109.652
f 378/1058/171 366/1059/171 370/1060/171 376/1061/171 

vt 87.3568 47.915
vn 0 -0.548301 0.836281
vt 90.9456 40.3878
vt 99.8778 40.3878
vt 103.467 47.915
f 366/1062/172 360/1063/172 371/1064/172 370/1065/172 

vt 90.9456 50.0787
vt 90.9456 4.301
vt 99.8778 4.301
vt 99.8778 50.0787
f 360/1066/12 356/1067/12 325/1068/12 371/1069/12 

f 325/659/20 324/660/20 372/661/20 371/662/20 

vn 1 0 -8.6238e-015
f 373/663/173 372/661/173 324/660/173 323/664/173 

f 323/664/20 322/406/20 374/405/20 373/663/20 

f 368/404/20 374/405/20 322/406/20 321/407/20 

vt -99.8778 50.0787
vt -99.8778 4.301
vt -90.9456 4.301
vt -90.9456 50.0787
f 368/1070/14 321/1071/14 327/1072/14 363/1073/14 

f 327/433/60 359/434/60 364/435/60 363/436/60 

f 365/437/60 364/435/60 359/434/60 358/438/60 

f 358/438/60 357/446/60 361/447/60 365/437/60 

v 102.803 109.769 0.642491
vt -102.803 -0.642491
f 379/1074/13 378/940/13 376/939/13

v 88.0206 109.769 0.642491
vt -88.0206 -0.642491
f 380/1075/13 378/940/13 379/1074/13

f 378/940/13 380/1075/13 377/941/13

v 88.0206 109.769 -19.2679
vt -88.0206 19.2679
f 381/1076/13 377/941/13 380/1075/13

v 102.803 109.769 -19.2679
vt -102.803 19.2679
f 377/941/13 381/1076/13 382/1077/13

v 102.803 111.078 -19.2679
vt -102.803 111.078
vt -102.803 109.769
vt -88.0206 109.769
v 88.0206 111.078 -19.2679
vt -88.0206 111.078
f 383/1078/14 382/1079/14 381/1080/14 384/1081/14 

v 102.803 111.078 -15.9042
v 102.803 111.078 0.642491
v 102.803 109.769 -15.9042
f 383/689/20 385/690/20 386/691/20 379/692/20 387/693/20 382/694/20 

vt 102.803 19.2679
vt 102.803 -0.642491
vt 102.803 15.9042
f 383/1082/30 386/1083/30 385/1084/30

v 99.8778 111.078 -2.72126
vt 99.8778 2.72126
f 383/1082/30 388/1085/30 386/1083/30

v 99.8778 111.078 -15.9042
vt 99.8778 15.9042
f 383/1082/30 389/1086/30 388/1085/30

v 90.9456 111.078 -15.9042
vt 90.9456 15.9042
f 383/1082/30 390/1087/30 389/1086/30

vt 88.0206 19.2679
f 384/1088/30 390/1087/30 383/1082/30

v 90.9456 111.078 -2.72126
vt 90.9456 2.72126
f 390/1087/30 384/1088/30 391/1089/30

v 88.0206 111.078 0.642491
vt 88.0206 -0.642491
f 392/1090/30 391/1089/30 384/1088/30

f 391/1089/30 392/1090/30 386/1083/30

vt 88.0206 111.078
vt 88.0206 109.769
vt 102.803 109.769
vt 102.803 111.078
f 392/1091/12 380/1092/12 379/1093/12 386/1094/12 

f 384/681/60 381/682/60 380/683/60 392/684/60 

f 391/1089/30 386/1083/30 388/1085/30

v 90.9456 113.509 -2.72126
vt 90.9456 113.509
vt 90.9456 111.078
vt 99.8778 111.078
v 99.8778 113.509 -2.72126
vt 99.8778 113.509
f 393/1095/12 391/1096/12 388/1097/12 394/1098/12 

v 90.9456 113.509 -15.9042
f 395/715/60 390/716/60 391/717/60 393/718/60 

v 99.8778 113.509 -15.9042
vt -99.8778 113.509
vt -99.8778 111.078
vt -90.9456 111.078
vt -90.9456 113.509
f 396/1099/14 389/1100/14 390/1101/14 395/1102/14 

f 394/708/55 388/709/55 389/690/55 396/710/55 

v 105.559 113.509 -22.4376
vt -105.559 22.4376
f 396/942/13 397/1103/13 394/939/13

f 395/941/13 397/1103/13 396/942/13

v 85.2644 113.509 -22.4376
vt -85.2644 22.4376
f 395/941/13 398/1104/13 397/1103/13

v 85.2644 113.509 3.81218
vt -85.2644 -3.81218
f 398/1104/13 395/941/13 399/1105/13

f 393/940/13 399/1105/13 395/941/13

v 105.559 113.509 3.81218
vt -105.559 -3.81218
f 399/1105/13 393/940/13 400/1106/13

f 400/1106/13 393/940/13 394/939/13

f 400/1106/13 394/939/13 397/1103/13

v 105.559 113.509 -15.9042
vt -105.559 15.9042
f 400/1106/13 397/1103/13 401/1107/13

v 103.316 118.989 -0.837066
vt 0.837066 70.9862
v 103.316 118.989 1.23293
vt -1.23293 70.9862
vt -3.81218 65.0652
v 105.559 113.509 0.203406
vt -0.203406 65.0652
vt 15.9042 65.0652
vt 22.4376 65.0652
v 103.316 118.989 -19.8584
vt 19.8584 70.9862
v 103.316 118.989 -15.9042
vt 15.9042 70.9862
f 402/1108/115 403/1109/115 400/1110/115 404/1111/115 401/1112/115 397/1113/115 405/1114/115 406/1115/115 

vt 103.316 19.8584
vt 103.316 -1.23293
vt 103.316 0.837066
f 405/1116/30 403/1117/30 402/1118/30

v 101.516 118.989 -17.7884
vt 101.516 17.7884
f 405/1116/30 407/1119/30 403/1117/30

v 89.3072 118.989 -17.7884
vt 89.3072 17.7884
f 405/1116/30 408/1120/30 407/1119/30

v 87.5072 118.989 -19.8584
vt 87.5072 19.8584
f 409/1121/30 408/1120/30 405/1116/30

v 89.3072 118.989 -0.837066
vt 89.3072 0.837066
f 408/1120/30 409/1121/30 410/1122/30

v 87.5072 118.989 1.23293
vt 87.5072 -1.23293
f 411/1123/30 410/1122/30 409/1121/30

f 410/1122/30 411/1123/30 403/1117/30

vt 87.5072 107.134
vt 85.2644 101.078
vt 105.559 101.078
vt 103.316 107.134
f 411/1124/114 399/1125/114 400/1126/114 403/1127/114 

vt 3.81218 137.348
vt 1.23293 143.269
vt -19.8584 143.269
vt -22.4376 137.348
f 399/1128/113 411/1129/113 409/1130/113 398/1131/113 

vt -85.2644 93.1455
vt -87.5072 99.2019
vt -103.316 99.2019
vt -105.559 93.1455
f 398/1132/119 409/1133/119 405/1134/119 397/1135/119 

v 101.516 118.989 -0.837066
vt 101.516 0.837066
f 410/1122/30 403/1117/30 412/1136/30

v 101.516 118.989 -15.9042
vt 101.516 15.9042
f 412/1136/30 403/1117/30 413/1137/30

f 413/1137/30 403/1117/30 407/1119/30

v 101.516 120.194 -17.7884
v 101.516 120.194 -15.9042
v 101.516 120.194 -0.837066
f 407/749/20 414/750/20 415/751/20 416/752/20 412/753/20 413/754/20 

vt -89.3072 118.989
v 89.3072 120.194 -17.7884
vt -89.3072 120.194
vt -101.516 120.194
vt -101.516 118.989
f 408/1138/14 417/1139/14 414/1140/14 407/1141/14 

v 89.3072 120.194 -0.837066
f 410/759/60 418/760/60 417/761/60 408/762/60 

vt 101.516 118.989
vt 101.516 120.194
vt 89.3072 120.194
vt 89.3072 118.989
f 412/1142/12 416/1143/12 418/1144/12 410/1145/12 

v 90.9456 120.194 -2.72126
f 419/1089/30 418/1122/30 416/1136/30

f 418/1122/30 419/1089/30 417/1120/30

v 90.9456 120.194 -15.9042
f 420/1087/30 417/1120/30 419/1089/30

f 417/1120/30 420/1087/30 414/1119/30

v 99.8778 120.194 -15.9042
f 414/1119/30 420/1087/30 421/1086/30

v 99.8778 121.907 -15.9042
vt -99.8778 121.907
vt -99.8778 120.194
vt -90.9456 120.194
v 90.9456 121.907 -15.9042
vt -90.9456 121.907
f 422/1146/14 421/1147/14 420/1148/14 423/1149/14 

v 99.8778 121.907 -2.72126
v 99.8778 120.194 -2.72126
f 421/751/55 422/771/55 424/772/55 425/773/55 

v 90.9456 121.907 -2.72126
f 422/942/13 424/939/13 426/940/13 423/941/13 

v 99.8778 127.907 -15.9042
v 99.8778 127.907 -2.72126
f 424/772/55 422/771/55 427/780/55 428/781/55 

v 90.9456 127.907 -15.9042
vt -90.9456 127.907
vt -99.8778 127.907
f 422/1146/14 423/1149/14 429/1150/14 427/1151/14 

v 90.9456 127.907 -2.72126
f 423/784/60 426/785/60 430/786/60 429/787/60 

f 419/788/60 426/785/60 423/784/60 420/789/60 

vt 99.8778 120.194
vt 99.8778 121.907
vt 90.9456 121.907
vt 90.9456 120.194
f 425/1152/12 424/1153/12 426/1154/12 419/1155/12 

vt 99.8778 127.907
vt 90.9456 127.907
f 426/1154/12 424/1153/12 428/1156/12 430/1157/12 

f 419/1089/30 416/1136/30 425/1085/30

f 414/1119/30 425/1085/30 416/1136/30

f 414/1119/30 421/1086/30 425/1085/30

f 414/1119/30 416/1136/30 415/1137/30

vt 103.316 15.9042
f 405/1116/30 402/1118/30 406/1158/30

vt -105.559 -0.203406
f 400/1106/13 401/1107/13 404/1159/13

vt -102.803 15.9042
f 379/1074/13 382/1077/13 387/1160/13

f 379/1074/13 376/939/13 382/1077/13

f 375/942/13 382/1077/13 376/939/13

f 377/941/13 382/1077/13 375/942/13

g Mesh5 Model

v 88.0206 111.078 -120.295
vt 88.0206 120.295
v 90.9456 111.078 -123.659
vt 90.9456 123.659
v 88.0206 111.078 -140.205
vt 88.0206 140.205
f 431/1161/30 432/1162/30 433/1163/30

v 102.803 111.078 -120.295
vt 102.803 120.295
f 432/1162/30 431/1161/30 434/1164/30

v 88.0206 109.769 -120.295
v 102.803 109.769 -120.295
f 431/1091/12 435/1092/12 436/1093/12 434/1094/12 

vt -140.205 111.078
v 88.0206 109.769 -140.205
vt -140.205 109.769
vt -120.295 109.769
vt -120.295 111.078
f 433/1165/60 437/1166/60 435/1167/60 431/1168/60 

v 102.803 111.078 -140.205
v 102.803 109.769 -140.205
f 438/1078/14 439/1079/14 437/1080/14 433/1081/14 

vt 140.205 111.078
v 102.803 111.078 -136.842
vt 136.842 111.078
vt 120.295 111.078
vt 120.295 109.769
v 102.803 109.769 -136.842
vt 136.842 109.769
vt 140.205 109.769
f 438/1169/20 440/1170/20 434/1171/20 436/1172/20 441/1173/20 439/1174/20 

vt 102.803 140.205
vt 102.803 136.842
f 438/1175/30 434/1164/30 440/1176/30

v 99.8778 111.078 -123.659
vt 99.8778 123.659
f 438/1175/30 442/1177/30 434/1164/30

v 99.8778 111.078 -136.842
vt 99.8778 136.842
f 438/1175/30 443/1178/30 442/1177/30

v 90.9456 111.078 -136.842
vt 90.9456 136.842
f 438/1175/30 444/1179/30 443/1178/30

f 433/1163/30 444/1179/30 438/1175/30

f 444/1179/30 433/1163/30 432/1162/30

v 90.9456 113.509 -136.842
vt -136.842 113.509
vt -136.842 111.078
vt -123.659 111.078
v 90.9456 113.509 -123.659
vt -123.659 113.509
f 445/1180/60 444/1181/60 432/1182/60 446/1183/60 

v 99.8778 113.509 -136.842
f 447/1099/14 443/1100/14 444/1101/14 445/1102/14 

v 99.8778 113.509 -123.659
vt 123.659 113.509
vt 123.659 111.078
vt 136.842 113.509
f 448/1184/55 442/1185/55 443/1170/55 447/1186/55 

f 446/1095/12 432/1096/12 442/1097/12 448/1098/12 

f 432/1162/30 434/1164/30 442/1177/30

v 105.559 113.509 -117.125
vt -105.559 117.125
vt -90.9456 123.659
vt -99.8778 123.659
f 449/1187/13 446/1188/13 448/1189/13

v 85.2644 113.509 -117.125
vt -85.2644 117.125
f 450/1190/13 446/1188/13 449/1187/13

vt -90.9456 136.842
f 446/1188/13 450/1190/13 445/1191/13

v 85.2644 113.509 -143.375
vt -85.2644 143.375
f 451/1192/13 445/1191/13 450/1190/13

v 105.559 113.509 -143.375
vt -105.559 143.375
f 445/1191/13 451/1192/13 452/1193/13

vt -85.2644 41.6417
v 87.5072 118.989 -140.796
vt -87.5072 47.6981
v 103.316 118.989 -140.796
vt -103.316 47.6981
vt -105.559 41.6417
f 451/1194/119 453/1195/119 454/1196/119 452/1197/119 

vt -117.125 137.348
vn -0.925481 0.378795 2.6017e-019
v 87.5072 118.989 -119.705
vt -119.705 143.269
vt -140.796 143.269
vt -143.375 137.348
f 450/1198/174 455/1199/174 453/1200/174 451/1201/174 

vt 87.5072 158.638
vt 85.2644 152.581
vt 105.559 152.581
v 103.316 118.989 -119.705
vt 103.316 158.638
f 455/1202/114 450/1203/114 449/1204/114 456/1205/114 

v 103.316 118.989 -121.775
vt 121.775 70.9862
vn 0.925481 0.378795 2.69301e-018
vt 119.705 70.9862
vt 117.125 65.0652
v 105.559 113.509 -120.734
vt 120.734 65.0652
v 105.559 113.509 -136.842
vt 136.842 65.0652
vt 143.375 65.0652
vt 140.796 70.9862
v 103.316 118.989 -136.842
vt 136.842 70.9862
f 457/1206/175 456/1207/175 449/1208/175 458/1209/175 459/1210/175 452/1211/175 454/1212/175 460/1213/175 

vt 103.316 140.796
vt 103.316 119.705
vt 103.316 121.775
f 454/1214/30 456/1215/30 457/1216/30

v 101.516 118.989 -138.726
vt 101.516 138.726
f 454/1214/30 461/1217/30 456/1215/30

v 89.3072 118.989 -138.726
vt 89.3072 138.726
f 454/1214/30 462/1218/30 461/1217/30

vt 87.5072 140.796
f 453/1219/30 462/1218/30 454/1214/30

v 89.3072 118.989 -121.775
vt 89.3072 121.775
f 462/1218/30 453/1219/30 463/1220/30

vt 87.5072 119.705
f 455/1221/30 463/1220/30 453/1219/30

f 463/1220/30 455/1221/30 456/1215/30

v 101.516 118.989 -121.775
vt 101.516 121.775
f 463/1220/30 456/1215/30 464/1222/30

v 101.516 118.989 -136.842
vt 101.516 136.842
f 464/1222/30 456/1215/30 465/1223/30

f 465/1223/30 456/1215/30 461/1217/30

vt 138.726 118.989
v 101.516 120.194 -138.726
vt 138.726 120.194
v 101.516 120.194 -136.842
vt 136.842 120.194
v 101.516 120.194 -121.775
vt 121.775 120.194
vt 121.775 118.989
vt 136.842 118.989
f 461/1224/20 466/1225/20 467/1226/20 468/1227/20 464/1228/20 465/1229/20 

v 89.3072 120.194 -138.726
f 462/1138/14 469/1139/14 466/1140/14 461/1141/14 

vt -121.775 118.989
v 89.3072 120.194 -121.775
vt -121.775 120.194
vt -138.726 120.194
vt -138.726 118.989
f 463/1230/60 470/1231/60 469/1232/60 462/1233/60 

f 464/1142/12 468/1143/12 470/1144/12 463/1145/12 

v 90.9456 120.194 -123.659
f 471/1162/30 470/1220/30 468/1222/30

f 470/1220/30 471/1162/30 469/1218/30

v 90.9456 120.194 -136.842
f 472/1179/30 469/1218/30 471/1162/30

f 469/1218/30 472/1179/30 466/1217/30

v 99.8778 120.194 -136.842
f 466/1217/30 472/1179/30 473/1178/30

v 90.9456 121.907 -136.842
v 99.8778 121.907 -136.842
f 472/1148/14 474/1149/14 475/1146/14 473/1147/14 

vt -123.659 120.194
v 90.9456 121.907 -123.659
vt -123.659 121.907
vt -136.842 121.907
vt -136.842 120.194
f 471/1234/60 476/1235/60 474/1236/60 472/1237/60 

v 99.8778 120.194 -123.659
v 99.8778 121.907 -123.659
f 477/1152/12 478/1153/12 476/1154/12 471/1155/12 

vn 1 -8.2971e-015 -1.07797e-015
vt 136.842 121.907
vt 123.659 121.907
vt 123.659 120.194
f 473/1226/176 475/1238/176 478/1239/176 477/1240/176 

vt -99.8778 136.842
f 474/1191/13 475/1241/13 478/1189/13 476/1188/13 

v 90.9456 127.907 -136.842
v 99.8778 127.907 -136.842
f 475/1146/14 474/1149/14 479/1150/14 480/1151/14 

v 90.9456 127.907 -123.659
vt -123.659 127.907
vt -136.842 127.907
f 474/1236/60 476/1235/60 481/1242/60 479/1243/60 

v 99.8778 127.907 -123.659
f 476/1154/12 478/1153/12 482/1156/12 481/1157/12 

vt 136.842 127.907
vt 123.659 127.907
f 478/1239/20 475/1238/20 480/1244/20 482/1245/20 

f 466/1217/30 473/1178/30 477/1177/30

f 466/1217/30 477/1177/30 468/1222/30

f 471/1162/30 468/1222/30 477/1177/30

f 466/1217/30 468/1222/30 467/1223/30

vt 103.316 136.842
f 454/1214/30 457/1216/30 460/1246/30

vt -105.559 136.842
vt -105.559 120.734
f 449/1187/13 459/1247/13 458/1248/13

f 449/1187/13 452/1193/13 459/1247/13

f 449/1187/13 448/1189/13 452/1193/13

f 447/1241/13 452/1193/13 448/1189/13

f 445/1191/13 452/1193/13 447/1241/13

vt -102.803 120.295
vt -102.803 140.205
vt -102.803 136.842
f 436/1249/13 439/1250/13 441/1251/13

v 99.8778 109.769 -123.659
f 436/1249/13 483/1189/13 439/1250/13

v 90.9456 109.769 -123.659
f 436/1249/13 484/1188/13 483/1189/13

vt -88.0206 120.295
f 435/1252/13 484/1188/13 436/1249/13

v 90.9456 109.769 -136.842
f 484/1188/13 435/1252/13 485/1191/13

vt -88.0206 140.205
f 437/1253/13 485/1191/13 435/1252/13

f 485/1191/13 437/1253/13 439/1250/13

v 99.8778 109.769 -136.842
f 485/1191/13 439/1250/13 486/1241/13

f 486/1241/13 439/1250/13 483/1189/13

v 103.467 56.3735 -140.969
vt 140.969 49.308
vn 0.997749 0.0670611 -5.46375e-016
vt 136.842 102.824
vt 123.659 102.824
v 103.467 56.3735 -119.532
vt 119.532 49.308
v 103.467 56.3735 -136.842
vt 136.842 49.308
f 487/1254/177 486/1255/177 483/1256/177 488/1257/177 489/1258/177 

vt -99.8778 98.8969
vt -103.467 45.3422
v 87.3568 56.3735 -140.969
vt -87.3568 45.3422
vt -90.9456 98.8969
f 486/1259/170 487/1260/170 490/1261/170 485/1262/170 

vt -103.467 124.437
v 99.8778 50.0787 -136.842
vt -99.8778 116.91
v 90.9456 50.0787 -136.842
vt -90.9456 116.91
vt -87.3568 124.437
f 487/1263/167 491/1264/167 492/1265/167 490/1266/167 

vt 140.969 100.219
vn 0.868731 -0.495284 -6.65809e-016
vt 136.842 100.219
vt 119.532 100.219
v 99.8778 50.0787 -123.659
vt 123.659 92.9728
v 99.8778 50.0787 -126.954
vt 126.954 92.9728
v 99.8778 50.0787 -130.25
vt 130.25 92.9728
v 99.8778 50.0787 -133.546
vt 133.546 92.9728
vt 136.842 92.9728
f 487/1267/178 489/1268/178 488/1269/178 493/1270/178 494/1271/178 495/1272/178 496/1273/178 491/1274/178 

v 87.3568 56.3735 -119.532
vt 87.3568 -18.3951
v 90.9456 50.0787 -123.659
vt 90.9456 -25.9223
vt 99.8778 -25.9223
vt 103.467 -18.3951
f 497/1275/172 498/1276/172 493/1277/172 488/1278/172 

vt -140.969 5.70705
vn -0.868731 -0.495284 9.56625e-018
vt -136.842 -1.53897
v 90.9456 50.0787 -133.546
vt -133.546 -1.53897
v 90.9456 50.0787 -130.25
vt -130.25 -1.53897
v 90.9456 50.0787 -126.954
vt -126.954 -1.53897
vt -123.659 -1.53897
vt -119.532 5.70705
f 490/1279/179 492/1280/179 499/1281/179 500/1282/179 501/1283/179 498/1284/179 497/1285/179 

v 90.9456 4.301 -136.842
vt -136.842 4.301
v 90.9456 4.301 -133.546
vt -133.546 4.301
vt -133.546 50.0787
vt -136.842 50.0787
f 502/1286/60 503/1287/60 499/1288/60 492/1289/60 

vt -136.842 90.8739
vn -0.108769 0.994067 4.78182e-020
v 90.2759 4.22772 -137.612
vt -137.612 90.2002
vn -0.21849 0.975839 6.1096e-021
v 90.2759 4.22772 -122.889
vt -122.889 90.2002
v 90.9456 4.301 -123.659
vt -123.659 90.8739
v 90.9456 4.301 -126.954
vt -126.954 90.8739
v 90.9456 4.301 -130.25
vt -130.25 90.8739
vt -133.546 90.8739
f 502/1290/180 504/1291/181 505/1292/181 506/1293/180 507/1294/180 508/1295/180 503/1296/180 

v 99.8778 4.301 -136.842
vt -99.8778 -135.819
vn -8.86438e-020 0.995504 -0.0947182
v 100.547 4.22772 -137.612
vt -100.547 -136.593
vn -4.45356e-020 0.98146 -0.191669
vt -90.2759 -136.593
vt -90.9456 -135.819
f 509/1297/182 510/1298/183 504/1299/183 502/1300/182 

vt 137.612 -99.4911
vn 0.21849 0.975839 -6.26962e-017
vt 136.842 -98.8174
vn 0.108769 0.994067 -1.24588e-016
v 99.8778 4.301 -133.546
vt 133.546 -98.8174
v 99.8778 4.301 -130.25
vt 130.25 -98.8174
v 99.8778 4.301 -126.954
vt 126.954 -98.8174
v 99.8778 4.301 -123.659
vt 123.659 -98.8174
v 100.547 4.22772 -122.889
vt 122.889 -99.4911
v 100.547 4.22772 -136.842
vt 136.842 -99.4911
f 510/1301/184 509/1302/185 511/1303/185 512/1304/185 513/1305/185 514/1306/185 515/1307/184 516/1308/184 

vt 136.842 50.0787
vt 133.546 50.0787
vt 133.546 4.301
vt 136.842 4.301
f 491/1309/20 496/1310/20 511/1311/20 509/1312/20 

vt 130.25 4.301
vt 130.25 50.0787
f 512/1313/20 511/1311/20 496/1310/20 495/1314/20 

vn 1 4.15529e-046 -8.6238e-015
vt 126.954 50.0787
vt 126.954 4.301
f 495/1314/186 494/1315/186 513/1316/186 512/1313/186 

vt 123.659 4.301
vt 123.659 50.0787
f 514/1317/20 513/1316/20 494/1315/20 493/1318/20 

f 498/1066/12 506/1067/12 514/1068/12 493/1069/12 

vt -123.659 50.0787
vt -126.954 50.0787
vt -126.954 4.301
vt -123.659 4.301
f 498/1319/60 501/1320/60 507/1321/60 506/1322/60 

vt -130.25 4.301
vt -130.25 50.0787
f 508/1323/60 507/1321/60 501/1320/60 500/1324/60 

f 500/1324/60 499/1288/60 503/1287/60 508/1323/60 

vt 90.9456 123.51
vt 90.2759 122.737
vt 100.547 122.737
vt 99.8778 123.51
f 506/1325/164 505/1326/163 515/1327/163 514/1328/164 

vt 90.2759 118.939
v 89.6519 4.01289 -122.171
vt 89.6519 118.19
vn 5.79488e-019 0.921606 0.388126
v 101.172 4.01289 -122.171
vt 101.172 118.19
vt 100.547 118.939
f 505/1329/163 517/1330/187 518/1331/187 515/1332/163 

vt -137.612 86.7356
v 89.6519 4.01289 -138.329
vt -138.329 86.0756
vn -0.43463 0.900609 9.0539e-020
vt -122.171 86.0756
vt -122.889 86.7356
f 504/1333/181 519/1334/188 517/1335/188 505/1336/181 

vt -100.547 -130.619
v 101.172 4.01289 -138.329
vt -101.172 -131.368
vt -89.6519 -131.368
vt -90.2759 -130.619
f 510/1337/183 520/1338/133 519/1339/133 504/1340/183 

vt 137.612 -93.6954
vt 136.842 -93.6954
vt 122.889 -93.6954
vt 122.171 -94.3554
vn 0.43463 0.900609 -8.97412e-022
v 101.172 4.01289 -136.842
vt 136.842 -94.3554
vt 138.329 -94.3554
f 510/1341/184 516/1342/184 515/1343/184 518/1344/189 521/1345/189 520/1346/189 

vt 138.329 -83.1438
vt 136.842 -83.1438
vt 122.171 -83.1438
v 101.707 3.67113 -121.555
vt 121.555 -83.7794
vn 0.641531 0.767097 -1.94607e-016
v 101.707 3.67113 -136.842
vt 136.842 -83.7794
v 101.707 3.67113 -138.946
vt 138.946 -83.7794
f 520/1347/189 521/1348/189 518/1349/189 522/1350/190 523/1351/190 524/1352/190 

vt 89.6519 108.788
v 89.116 3.67113 -121.555
vt 89.116 108.084
vn 3.62742e-019 0.8075 0.589868
vt 101.707 108.084
vt 101.172 108.788
f 517/1353/187 525/1354/191 522/1355/191 518/1356/187 

vt -138.329 77.7466
v 89.116 3.67113 -138.946
vt -138.946 77.111
vn -0.641531 0.767097 -3.22076e-019
vt -121.555 77.111
vt -122.171 77.7466
f 519/1357/188 526/1358/192 525/1359/192 517/1360/188 

vt -101.172 -119.027
vt -101.707 -119.732
vt -89.116 -119.732
vt -89.6519 -119.027
f 520/1361/133 524/1362/134 526/1363/134 519/1364/133 

vt -101.707 -98.6294
v 102.119 3.22575 -139.419
vt -102.119 -99.279
v 88.7048 3.22575 -139.419
vt -88.7048 -99.279
vt -89.116 -98.6294
f 524/1365/134 527/1366/135 528/1367/135 526/1368/134 

vt 138.946 -66.296
vt 136.842 -66.296
vt 121.555 -66.296
v 102.119 3.22575 -121.082
vt 121.082 -66.9021
vn 0.823107 0.567886 -4.15898e-016
v 102.119 3.22575 -136.842
vt 136.842 -66.9021
vt 139.419 -66.9021
f 524/1369/190 523/1370/190 522/1371/190 529/1372/193 530/1373/193 527/1374/193 

vt 89.116 91.0035
v 88.7048 3.22575 -121.082
vt 88.7048 90.3539
vt 102.119 90.3539
vt 101.707 91.0035
f 525/1375/191 531/1376/157 529/1377/157 522/1378/191 

vt -138.946 63.1492
vt -139.419 62.543
vn -0.823107 0.567886 -4.47337e-019
vt -121.082 62.543
vt -121.555 63.1492
f 526/1379/192 528/1380/194 531/1381/194 525/1382/192 

vt -139.419 42.4545
v 88.4463 2.70709 -139.716
vt -139.716 41.875
vn -0.952417 0.304799 2.07198e-019
v 88.4463 2.70709 -120.785
vt -120.785 41.875
vt -121.082 42.4545
f 528/1383/194 532/1384/195 533/1385/195 531/1386/194 

vt -102.119 -66.5286
v 102.377 2.70709 -139.716
vt -102.377 -67.1264
vt -88.4463 -67.1264
vt -88.7048 -66.5286
f 527/1387/135 534/1388/136 532/1389/136 528/1390/135 

vt 139.419 -42.6637
vt 136.842 -42.6637
vt 121.082 -42.6637
v 102.377 2.70709 -120.785
vt 120.785 -43.2432
vn 0.952417 0.304799 -2.2121e-016
v 102.377 2.70709 -136.842
vt 136.842 -43.2432
vt 139.716 -43.2432
f 527/1391/193 530/1392/193 529/1393/193 535/1394/196 536/1395/196 534/1396/196 

vt 88.7048 63.0078
vt 88.4463 62.41
vt 102.377 62.41
vt 102.119 63.0078
f 531/1397/157 533/1398/156 535/1399/156 529/1400/157 

vt 88.4463 24.3099
v 88.3581 2.1505 -120.683
vt 88.3581 23.7441
v 102.465 2.1505 -120.683
vt 102.465 23.7441
vt 102.377 24.3099
f 533/1401/156 537/1402/154 538/1403/154 535/1404/156 

vt -139.716 16.5116
v 88.3581 2.1505 -139.817
vt -139.817 15.9481
vn -1 -5.0583e-016 2.52302e-019
vt -120.683 15.9481
vt -120.785 16.5116
f 532/1405/195 539/1406/197 537/1407/197 533/1408/195 

vt -102.377 -22.3762
v 102.465 2.1505 -139.817
vt -102.465 -22.9419
vt -88.3581 -22.9419
vt -88.4463 -22.3762
f 534/1409/136 540/1410/137 539/1411/137 532/1412/136 

vt 139.716 -13.3436
vt 136.842 -13.3436
vt 120.785 -13.3436
vt 120.683 -13.9072
vn 1 -5.1988e-016 1.3381e-019
v 102.465 2.1505 -136.842
vt 136.842 -13.9072
vt 139.817 -13.9072
f 534/1413/196 536/1414/196 535/1415/196 538/1416/198 541/1417/198 540/1418/198 

vt 139.817 18.1552
vt 136.842 18.1552
vt 120.683 18.1552
v 102.377 1.59391 -120.785
vt 120.785 17.5917
vn 0.952417 -0.304799 -2.2163e-016
v 102.377 1.59391 -136.842
vt 136.842 17.5917
v 102.377 1.59391 -139.716
vt 139.716 17.5917
f 540/1419/198 541/1420/198 538/1421/198 542/1422/199 543/1423/199 544/1424/199 

vt 88.3581 -19.5128
v 88.4463 1.59391 -120.785
vt 88.4463 -20.0785
vt 102.377 -20.0785
vt 102.465 -19.5128
f 537/1425/154 545/1426/153 542/1427/153 538/1428/154 

vt -139.817 -11.7
v 88.4463 1.59391 -139.716
vt -139.716 -12.2636
vn -0.952417 -0.304799 1.31455e-020
vt -120.785 -12.2636
vt -120.683 -11.7
f 539/1429/197 546/1430/200 545/1431/200 537/1432/197 

vt -102.465 27.1733
vt -102.377 26.6076
vt -88.4463 26.6076
vt -88.3581 27.1733
f 540/1433/137 544/1434/138 546/1435/138 539/1436/137 

vt -102.377 70.858
v 102.119 1.07525 -139.419
vt -102.119 70.2602
v 88.7048 1.07525 -139.419
vt -88.7048 70.2602
vt -88.4463 70.858
f 544/1437/138 547/1438/139 548/1439/139 546/1440/138 

vt 139.716 47.0926
vt 136.842 47.0926
vt 120.785 47.0926
v 102.119 1.07525 -121.082
vt 121.082 46.5131
vn 0.823107 -0.567886 -4.16303e-016
v 102.119 1.07525 -136.842
vt 136.842 46.5131
vt 139.419 46.5131
f 544/1441/199 543/1442/199 542/1443/199 549/1444/201 550/1445/201 547/1446/201 

vt 88.4463 -58.6784
v 88.7048 1.07525 -121.082
vt 88.7048 -59.2762
vn 2.36144e-019 -0.619328 0.785132
vt 102.119 -59.2762
vt 102.377 -58.6784
f 545/1447/153 551/1448/202 549/1449/202 542/1450/153 

vt -139.716 -38.0255
vt -139.419 -38.605
vn -0.823107 -0.567886 2.67312e-019
vt -121.082 -38.605
vt -120.785 -38.0255
f 546/1451/200 548/1452/203 551/1453/203 545/1454/200 

vt -139.419 -59.3829
v 89.116 0.629867 -138.946
vt -138.946 -59.9891
vn -0.641531 -0.767097 -3.59258e-020
v 89.116 0.629867 -121.555
vt -121.555 -59.9891
vt -121.082 -59.3829
f 548/1455/203 552/1456/204 553/1457/204 551/1458/203 

vt -102.119 102.228
v 101.707 0.629867 -138.946
vt -101.707 101.578
vn 5.29688e-019 -0.8075 -0.589868
vt -89.116 101.578
vt -88.7048 102.228
f 547/1459/139 554/1460/205 552/1461/205 548/1462/139 

vt 139.419 70.0622
vt 136.842 70.0622
vt 121.082 70.0622
v 101.707 0.629867 -121.555
vt 121.555 69.4561
vn 0.641531 -0.767097 -1.95273e-016
v 101.707 0.629867 -136.842
vt 136.842 69.4561
vt 138.946 69.4561
f 547/1463/201 550/1464/201 549/1465/201 555/1466/206 556/1467/206 554/1468/206 

vt 88.7048 -87.405
vt 89.116 -88.0546
vn 7.79378e-019 -0.8075 0.589868
vt 101.707 -88.0546
vt 102.119 -87.405
f 551/1469/202 553/1470/207 555/1471/207 549/1472/202 

vt 89.116 -105.998
v 89.6519 0.288112 -122.171
vt 89.6519 -106.702
v 101.172 0.288112 -122.171
vt 101.172 -106.702
vt 101.707 -105.998
f 553/1473/207 557/1474/144 558/1475/144 555/1476/207 

vt -138.946 -74.7984
v 89.6519 0.288112 -138.329
vt -138.329 -75.434
vn -0.43463 -0.900609 -3.3615e-019
vt -122.171 -75.434
vt -121.555 -74.7984
f 552/1477/204 559/1478/208 557/1479/208 553/1480/204 

vt -101.707 121.818
v 101.172 0.288112 -138.329
vt -101.172 121.113
vn 1.7101e-019 -0.921606 -0.388126
vt -89.6519 121.113
vt -89.116 121.818
f 554/1481/205 560/1482/209 559/1483/209 552/1484/205 

vt 138.946 86.092
vt 136.842 86.092
vt 121.555 86.092
vt 122.171 85.4565
vn 0.43463 -0.900609 -1.00007e-018
v 101.172 0.288112 -136.842
vt 136.842 85.4565
vt 138.329 85.4565
f 554/1485/206 556/1486/206 555/1487/206 558/1488/210 561/1489/210 560/1490/210 

vt 138.329 95.7554
vt 136.842 95.7554
vt 122.171 95.7554
v 100.547 0.0732765 -122.889
vt 122.889 95.0954
vn 0.21849 -0.975839 -4.60447e-017
v 100.547 0.0732765 -136.842
vt 136.842 95.0954
v 100.547 0.0732765 -137.612
vt 137.612 95.0954
f 560/1491/210 561/1492/210 558/1493/210 562/1494/211 563/1495/211 564/1496/211 

vt 89.6519 -116.957
v 90.2759 0.0732765 -122.889
vt 90.2759 -117.706
vt 100.547 -117.706
vt 101.172 -116.957
f 557/1497/144 565/1498/145 562/1499/145 558/1500/144 

vt -138.329 -84.6756
v 90.2759 0.0732765 -137.612
vt -137.612 -85.3356
vn -0.21849 -0.975839 -1.53877e-019
vt -122.889 -85.3356
vt -122.171 -84.6756
f 559/1501/208 566/1502/212 565/1503/212 557/1504/208 

vt -101.172 132.602
vt -100.547 131.853
vn -4.45356e-020 -0.98146 -0.191669
vt -90.2759 131.853
vt -89.6519 132.602
f 560/1505/209 564/1506/213 566/1507/213 559/1508/209 

vt -100.547 137
v 99.8778 0 -136.842
vt -99.8778 136.226
vn -8.86438e-020 -0.995504 -0.0947182
v 90.9456 0 -136.842
vt -90.9456 136.226
vt -90.2759 137
f 564/1509/213 567/1510/214 568/1511/214 566/1512/213 

vt 137.612 99.9589
vt 136.842 99.9589
vt 122.889 99.9589
v 99.8778 0 -123.659
vt 123.659 99.2852
vt 136.842 99.2852
f 564/1513/211 563/1514/211 562/1515/211 569/1516/149 567/1517/149 

vt 90.2759 -122.329
v 90.9456 0 -123.659
vt 90.9456 -123.103
vt 99.8778 -123.103
vt 100.547 -122.329
f 565/1518/145 570/1519/150 569/1520/150 562/1521/145 

vt -137.612 -89.7324
vt -136.842 -90.406
vn -0.108769 -0.994067 -2.70176e-019
vt -123.659 -90.406
vt -122.889 -89.7324
f 566/1522/212 568/1523/215 570/1524/215 565/1525/212 

f 569/1189/13 570/1188/13 568/1191/13 567/1241/13 

f 491/1070/14 509/1071/14 502/1072/14 492/1073/14 

vt -136.842 115.621
vn -0.997749 0.0670611 -5.79687e-018
vt -140.969 62.1049
vt -119.532 62.1049
vt -123.659 115.621
f 485/1526/216 490/1527/216 497/1528/216 484/1529/216 

vt 90.9456 118.972
vt 87.3568 65.4175
vt 103.467 65.4175
vt 99.8778 118.972
f 484/1530/171 497/1531/171 488/1532/171 483/1533/171 

g Mesh6 Model

v 18.9456 120.194 -136.842
v 18.9456 121.907 -136.842
v 27.8778 121.907 -136.842
v 27.8778 120.194 -136.842
f 571/769/14 572/770/14 573/767/14 574/768/14 

v 18.9456 120.194 -123.659
v 18.9456 121.907 -123.659
f 575/1234/60 576/1235/60 572/1236/60 571/1237/60 

v 27.8778 120.194 -123.659
v 27.8778 121.907 -123.659
f 577/774/12 578/775/12 576/776/12 575/777/12 

f 574/1226/112 573/1238/112 578/1239/112 577/1240/112 

vt -18.9456 123.659
vn -7.95488e-016 -1 -5.38987e-016
vt -18.9456 136.842
vt -27.8778 136.842
vt -27.8778 123.659
f 576/1534/217 572/1535/217 573/1536/217 578/1537/217 

v 18.9456 127.907 -123.659
v 18.9456 127.907 -136.842
f 576/1235/60 579/1242/60 580/1243/60 572/1236/60 

v 27.8778 127.907 -123.659
f 576/776/12 578/775/12 581/778/12 579/779/12 

vn 1 1.81413e-044 -1.61696e-015
v 27.8778 127.907 -136.842
f 578/1239/218 573/1238/218 582/1244/218 581/1245/218 

f 573/767/14 572/770/14 580/782/14 582/783/14 

v 29.5162 120.194 -138.726
vt 29.5162 138.726
vt 27.8778 136.842
vt 27.8778 123.659
f 583/1538/30 574/1539/30 577/1540/30

vt 18.9456 136.842
f 583/1538/30 571/1541/30 574/1539/30

v 17.3072 120.194 -138.726
vt 17.3072 138.726
f 584/1542/30 571/1541/30 583/1538/30

vt 18.9456 123.659
f 571/1541/30 584/1542/30 575/1543/30

v 17.3072 120.194 -121.775
vt 17.3072 121.775
f 585/1544/30 575/1543/30 584/1542/30

v 29.5162 120.194 -121.775
vt 29.5162 121.775
f 575/1543/30 585/1544/30 586/1545/30

v 29.5162 118.989 -121.775
v 17.3072 118.989 -121.775
f 587/763/12 586/764/12 585/765/12 588/766/12 

v 29.5162 118.989 -138.726
vn 1 0 4.3927e-016
v 29.5162 120.194 -136.842
v 29.5162 118.989 -136.842
f 589/1224/219 583/1225/219 590/1226/219 586/1227/219 587/1228/219 591/1229/219 

v 17.3072 118.989 -138.726
f 592/755/14 584/756/14 583/757/14 589/758/14 

f 588/1230/60 585/1231/60 584/1232/60 592/1233/60 

v 15.5072 118.989 -140.796
vt 15.5072 140.796
f 592/1542/30 593/1546/30 588/1544/30

v 31.3162 118.989 -140.796
vt 31.3162 140.796
f 593/1546/30 592/1542/30 594/1547/30

f 594/1547/30 592/1542/30 589/1538/30

v 31.3162 118.989 -119.705
vt 31.3162 119.705
f 594/1547/30 589/1538/30 595/1548/30

vt 29.5162 136.842
f 591/1549/30 595/1548/30 589/1538/30

f 587/1545/30 595/1548/30 591/1549/30

f 588/1544/30 595/1548/30 587/1545/30

v 15.5072 118.989 -119.705
vt 15.5072 119.705
f 588/1544/30 596/1550/30 595/1548/30

f 596/1550/30 588/1544/30 593/1546/30

v 13.2644 113.509 -117.125
vt -117.125 110.075
vt -119.705 115.996
vt -140.796 115.996
v 13.2644 113.509 -143.375
vt -143.375 110.075
f 597/1551/174 596/1552/174 593/1553/174 598/1554/174 

vt 15.5072 158.638
vt 13.2644 152.581
v 33.559 113.509 -117.125
vt 33.559 152.581
vt 31.3162 158.638
f 596/1555/114 597/1556/114 599/1557/114 595/1558/114 

vt -13.2644 117.125
v 18.9456 113.509 -123.659
vt -33.559 117.125
f 597/1559/13 600/1534/13 599/1560/13

v 18.9456 113.509 -136.842
f 600/1534/13 597/1559/13 601/1535/13

vt -13.2644 143.375
f 598/1561/13 601/1535/13 597/1559/13

v 33.559 113.509 -143.375
vt -33.559 143.375
f 601/1535/13 598/1561/13 602/1562/13

vt -13.2644 41.6417
vt -15.5072 47.6981
vt -31.3162 47.6981
vt -33.559 41.6417
f 598/1563/119 593/1564/119 594/1565/119 602/1566/119 

v 31.3162 118.989 -121.775
vt 121.775 98.2594
vn 0.925481 0.378795 3.50092e-018
vt 119.705 98.2594
vt 117.125 92.3384
v 33.559 113.509 -120.734
vt 120.734 92.3384
v 33.559 113.509 -136.842
vt 136.842 92.3384
vt 143.375 92.3384
vt 140.796 98.2594
v 31.3162 118.989 -136.842
vt 136.842 98.2594
f 603/1567/220 595/1568/220 599/1569/220 604/1570/220 605/1571/220 602/1572/220 594/1573/220 606/1574/220 

vt 31.3162 121.775
f 594/1547/30 595/1548/30 603/1575/30

vt 31.3162 136.842
f 594/1547/30 603/1575/30 606/1576/30

vt -33.559 136.842
vt -33.559 120.734
f 599/1560/13 605/1577/13 604/1578/13

f 599/1560/13 602/1562/13 605/1577/13

v 27.8778 113.509 -123.659
f 599/1560/13 607/1537/13 602/1562/13

f 599/1560/13 600/1534/13 607/1537/13

v 18.9456 111.078 -123.659
v 27.8778 111.078 -123.659
f 600/711/12 608/712/12 609/713/12 607/714/12 

v 18.9456 111.078 -136.842
f 601/1180/60 610/1181/60 608/1182/60 600/1183/60 

v 27.8778 113.509 -136.842
v 27.8778 111.078 -136.842
f 611/704/14 612/705/14 610/706/14 601/707/14 

f 607/1184/112 609/1185/112 612/1170/112 611/1186/112 

v 30.8028 111.078 -140.205
vt 30.8028 140.205
f 613/1579/30 612/1539/30 609/1540/30

f 613/1579/30 610/1541/30 612/1539/30

v 16.0206 111.078 -140.205
vt 16.0206 140.205
f 614/1580/30 610/1541/30 613/1579/30

f 610/1541/30 614/1580/30 608/1543/30

v 16.0206 111.078 -120.295
vt 16.0206 120.295
f 615/1581/30 608/1543/30 614/1580/30

v 30.8028 111.078 -120.295
vt 30.8028 120.295
f 608/1543/30 615/1581/30 616/1582/30

v 16.0206 109.769 -120.295
v 30.8028 109.769 -120.295
f 615/797/12 617/798/12 618/799/12 616/800/12 

v 16.0206 109.769 -140.205
f 614/1165/60 619/1166/60 617/1167/60 615/1168/60 

v 30.8028 109.769 -140.205
f 613/685/14 620/686/14 619/687/14 614/688/14 

vn 1 0 -3.63973e-016
v 30.8028 111.078 -136.842
v 30.8028 109.769 -136.842
f 613/1169/221 621/1170/221 616/1171/221 618/1172/221 622/1173/221 620/1174/221 

vt 30.8028 136.842
f 613/1579/30 616/1582/30 621/1583/30

f 609/1540/30 616/1582/30 613/1579/30

f 608/1543/30 616/1582/30 609/1540/30

vt -30.8028 120.295
vt -30.8028 140.205
vt -30.8028 136.842
f 618/1584/13 620/1585/13 622/1586/13

v 27.8778 109.769 -123.659
f 618/1584/13 623/1537/13 620/1585/13

v 18.9456 109.769 -123.659
f 618/1584/13 624/1534/13 623/1537/13

vt -16.0206 120.295
f 617/1587/13 624/1534/13 618/1584/13

v 18.9456 109.769 -136.842
f 624/1534/13 617/1587/13 625/1535/13

vt -16.0206 140.205
f 619/1588/13 625/1535/13 617/1587/13

f 625/1535/13 619/1588/13 620/1585/13

v 27.8778 109.769 -136.842
f 625/1535/13 620/1585/13 626/1536/13

f 626/1536/13 620/1585/13 623/1537/13

v 31.4666 56.3735 -140.969
vt 140.969 54.1364
vn 0.997749 0.0670611 -3.89829e-016
vt 136.842 107.652
vt 123.659 107.652
v 31.4666 56.3735 -119.532
vt 119.532 54.1364
v 31.4666 56.3735 -136.842
vt 136.842 54.1364
f 627/1589/222 626/1590/222 623/1591/222 628/1592/222 629/1593/222 

vt -27.8778 98.8969
vt -31.4666 45.3422
v 15.3568 56.3735 -140.969
vt -15.3568 45.3422
vt -18.9456 98.8969
f 626/1594/58 627/1595/58 630/1596/58 625/1597/58 

vt -31.4666 124.437
v 27.8778 50.0787 -136.842
vt -27.8778 116.91
v 18.9456 50.0787 -136.842
vt -18.9456 116.91
vt -15.3568 124.437
f 627/1598/59 631/1599/59 632/1600/59 630/1601/59 

vt 140.969 64.5584
vn 0.868731 -0.495284 -3.83564e-016
vt 136.842 64.5584
vt 119.532 64.5584
v 27.8778 50.0787 -123.659
vt 123.659 57.3123
v 27.8778 50.0787 -126.954
vt 126.954 57.3123
v 27.8778 50.0787 -130.25
vt 130.25 57.3123
v 27.8778 50.0787 -133.546
vt 133.546 57.3123
vt 136.842 57.3123
f 627/1602/223 629/1603/223 628/1604/223 633/1605/223 634/1606/223 635/1607/223 636/1608/223 631/1609/223 

v 15.3568 56.3735 -119.532
vt 15.3568 -18.3951
vn -6.84808e-018 -0.548301 0.836281
v 18.9456 50.0787 -123.659
vt 18.9456 -25.9223
vt 27.8778 -25.9223
vt 31.4666 -18.3951
f 637/1610/224 638/1611/224 633/1612/224 628/1613/224 

vt -140.969 41.3675
vt -136.842 34.1215
v 18.9456 50.0787 -133.546
vt -133.546 34.1215
v 18.9456 50.0787 -130.25
vt -130.25 34.1215
v 18.9456 50.0787 -126.954
vt -126.954 34.1215
vt -123.659 34.1215
vt -119.532 41.3675
f 630/1614/179 632/1615/179 639/1616/179 640/1617/179 641/1618/179 638/1619/179 637/1620/179 

v 18.9456 4.301 -136.842
v 18.9456 4.301 -133.546
f 642/1286/60 643/1287/60 639/1288/60 632/1289/60 

vt -136.842 19.301
vn -0.108769 0.994067 -3.97361e-019
v 18.2759 4.22772 -137.612
vt -137.612 18.6273
vn -0.21849 0.975839 -2.17865e-019
v 18.2759 4.22772 -122.889
vt -122.889 18.6273
v 18.9456 4.301 -123.659
vt -123.659 19.301
v 18.9456 4.301 -126.954
vt -126.954 19.301
v 18.9456 4.301 -130.25
vt -130.25 19.301
vt -133.546 19.301
f 642/1621/225 644/1622/226 645/1623/226 646/1624/225 647/1625/225 648/1626/225 643/1627/225 

v 27.8778 4.301 -136.842
vt -27.8778 -135.819
v 28.5475 4.22772 -137.612
vt -28.5475 -136.593
vn 2.18363e-021 0.98146 -0.191669
vt -18.2759 -136.593
vt -18.9456 -135.819
f 649/1628/51 650/1629/227 644/1630/227 642/1631/51 

vt 137.612 -27.9183
vn 0.21849 0.975839 -1.68155e-016
vt 136.842 -27.2446
vn 0.108769 0.994067 -1.21654e-016
v 27.8778 4.301 -133.546
vt 133.546 -27.2446
v 27.8778 4.301 -130.25
vt 130.25 -27.2446
v 27.8778 4.301 -126.954
vt 126.954 -27.2446
v 27.8778 4.301 -123.659
vt 123.659 -27.2446
v 28.5475 4.22772 -122.889
vt 122.889 -27.9183
v 28.5475 4.22772 -136.842
vt 136.842 -27.9183
f 650/1632/228 649/1633/229 651/1634/229 652/1635/229 653/1636/229 654/1637/229 655/1638/228 656/1639/228 

vn 1 7.31006e-033 -2.15595e-015
f 631/1309/230 636/1310/230 651/1311/230 649/1312/230 

f 652/1313/20 651/1311/20 636/1310/20 635/1314/20 

vn 1 1.03882e-046 -2.15595e-015
f 635/1314/231 634/1315/231 653/1316/231 652/1313/231 

f 654/1317/55 653/1316/55 634/1315/55 633/1318/55 

f 638/450/12 646/451/12 654/452/12 633/453/12 

f 638/1319/60 641/1320/60 647/1321/60 646/1322/60 

f 648/1323/60 647/1321/60 641/1320/60 640/1324/60 

f 640/1324/60 639/1288/60 643/1287/60 648/1323/60 

vt 18.9456 123.51
vt 18.2759 122.737
vt 28.5475 122.737
vt 27.8778 123.51
f 646/1640/62 645/1641/63 655/1642/63 654/1643/62 

vt 18.2759 118.939
v 17.6519 4.01289 -122.171
vt 17.6519 118.19
vn 5.48751e-019 0.921606 0.388126
v 29.1715 4.01289 -122.171
vt 29.1715 118.19
vt 28.5475 118.939
f 645/1644/63 657/1645/232 658/1646/232 655/1647/63 

vt -137.612 18.6568
v 17.6519 4.01289 -138.329
vt -138.329 17.9968
vn -0.43463 0.900609 -3.3615e-019
vt -122.171 17.9968
vt -122.889 18.6568
f 644/1648/226 659/1649/233 657/1650/233 645/1651/226 

vt -28.5475 -130.619
v 29.1715 4.01289 -138.329
vt -29.1715 -131.368
vn 1.00056e-019 0.921606 -0.388126
vt -17.6519 -131.368
vt -18.2759 -130.619
f 650/1652/227 660/1653/234 659/1654/234 644/1655/227 

vt 137.612 -25.6166
vt 136.842 -25.6166
vt 122.889 -25.6166
vt 122.171 -26.2766
vn 0.43463 0.900609 -2.10544e-016
v 29.1715 4.01289 -136.842
vt 136.842 -26.2766
vt 138.329 -26.2766
f 650/1656/228 656/1657/228 655/1658/228 658/1659/235 661/1660/235 660/1661/235 

vt 138.329 -22.4379
vt 136.842 -22.4379
vt 122.171 -22.4379
v 29.7074 3.67113 -121.555
vt 121.555 -23.0735
vn 0.641531 0.767097 -1.97979e-016
v 29.7074 3.67113 -136.842
vt 136.842 -23.0735
v 29.7074 3.67113 -138.946
vt 138.946 -23.0735
f 660/1662/235 661/1663/235 658/1664/235 662/1665/236 663/1666/236 664/1667/236 

vt 17.6519 108.788
v 17.116 3.67113 -121.555
vt 17.116 108.084
vn 6.61779e-019 0.8075 0.589868
vt 29.7074 108.084
vt 29.1715 108.788
f 657/1668/232 665/1669/237 662/1670/237 658/1671/232 

vt -138.329 17.0407
v 17.116 3.67113 -138.946
vt -138.946 16.4051
vn -0.641531 0.767097 -7.49332e-019
vt -121.555 16.4051
vt -122.171 17.0407
f 659/1672/233 666/1673/238 665/1674/238 657/1675/233 

vt -29.1715 -119.027
vt -29.7074 -119.732
vn 2.95226e-019 0.8075 -0.589868
vt -17.116 -119.732
vt -17.6519 -119.027
f 660/1676/234 664/1677/239 666/1678/239 659/1679/234 

vt -29.7074 -98.6294
v 30.1186 3.22575 -139.419
vt -30.1186 -99.279
vn -3.3852e-019 0.619328 -0.785132
v 16.7048 3.22575 -139.419
vt -16.7048 -99.279
vt -17.116 -98.6294
f 664/1680/239 667/1681/240 668/1682/240 666/1683/239 

vt 138.946 -17.4547
vt 136.842 -17.4547
vt 121.555 -17.4547
v 30.1186 3.22575 -121.082
vt 121.082 -18.0609
vn 0.823107 0.567886 -2.07325e-016
v 30.1186 3.22575 -136.842
vt 136.842 -18.0609
vt 139.419 -18.0609
f 664/1684/236 663/1685/236 662/1686/236 669/1687/241 670/1688/241 667/1689/241 

vt 17.116 91.0035
v 16.7048 3.22575 -121.082
vt 16.7048 90.3539
vt 30.1186 90.3539
vt 29.7074 91.0035
f 665/1690/237 671/1691/74 669/1692/74 662/1693/237 

vt -138.946 14.308
vt -139.419 13.7018
vn -0.823107 0.567886 -1.58352e-019
vt -121.082 13.7018
vt -121.555 14.308
f 666/1694/238 668/1695/242 671/1696/242 665/1697/238 

vt -139.419 10.3383
v 16.4463 2.70709 -139.716
vt -139.716 9.75884
vn -0.952417 0.304799 4.20091e-019
v 16.4463 2.70709 -120.785
vt -120.785 9.75884
vt -121.082 10.3383
f 668/1698/242 672/1699/243 673/1700/243 671/1701/242 

vt -30.1186 -66.5286
v 30.3771 2.70709 -139.716
vt -30.3771 -67.1264
vn -3.61771e-019 0.343193 -0.939265
vt -16.4463 -67.1264
vt -16.7048 -66.5286
f 667/1702/240 674/1703/244 672/1704/244 668/1705/240 

vt 139.419 -10.5476
vt 136.842 -10.5476
vt 121.082 -10.5476
v 30.3771 2.70709 -120.785
vt 120.785 -11.1271
vn 0.952417 0.304799 -2.05666e-016
v 30.3771 2.70709 -136.842
vt 136.842 -11.1271
vt 139.716 -11.1271
f 667/1706/241 670/1707/241 669/1708/241 675/1709/245 676/1710/245 674/1711/245 

vt 16.7048 63.0078
vt 16.4463 62.41
vt 30.3771 62.41
vt 30.1186 63.0078
f 671/1712/74 673/1713/79 675/1714/79 669/1715/74 

vt 16.4463 24.3099
v 16.3581 2.1505 -120.683
vt 16.3581 23.7441
vn 1.02903e-019 -5.78353e-016 1
v 30.4653 2.1505 -120.683
vt 30.4653 23.7441
vt 30.3771 24.3099
f 673/1716/79 677/1717/246 678/1718/246 675/1719/79 

vt -139.716 5.24685
v 16.3581 2.1505 -139.817
vt -139.817 4.68332
vn -1 -5.1988e-016 9.90654e-020
vt -120.683 4.68332
vt -120.785 5.24685
f 672/1720/243 679/1721/247 677/1722/247 673/1723/243 

vt -30.3771 -22.3762
v 30.4653 2.1505 -139.817
vt -30.4653 -22.9419
vt -16.3581 -22.9419
vt -16.4463 -22.3762
f 674/1724/244 680/1725/82 679/1726/82 672/1727/244 

vt 139.716 -2.07889
vt 136.842 -2.07889
vt 120.785 -2.07889
vt 120.683 -2.64242
vn 1 -5.0583e-016 -1.85416e-016
v 30.4653 2.1505 -136.842
vt 136.842 -2.64242
vt 139.817 -2.64242
f 674/1728/245 676/1729/245 675/1730/245 678/1731/248 681/1732/248 680/1733/248 

vt 139.817 6.89045
vt 136.842 6.89045
vt 120.683 6.89045
v 30.3771 1.59391 -120.785
vt 120.785 6.32692
vn 0.952417 -0.304799 -2.05772e-016
v 30.3771 1.59391 -136.842
vt 136.842 6.32692
v 30.3771 1.59391 -139.716
vt 139.716 6.32692
f 680/1734/248 681/1735/248 678/1736/248 682/1737/249 683/1738/249 684/1739/249 

vt 16.3581 -19.5128
v 16.4463 1.59391 -120.785
vt 16.4463 -20.0785
vn -4.52461e-019 -0.343193 0.939265
vt 30.3771 -20.0785
vt 30.4653 -19.5128
f 677/1740/246 685/1741/250 682/1742/250 678/1743/246 

vt -139.817 -0.435288
v 16.4463 1.59391 -139.716
vt -139.716 -0.998818
vn -0.952417 -0.304799 2.26038e-019
vt -120.785 -0.998818
vt -120.683 -0.435288
f 679/1744/247 686/1745/251 685/1746/251 677/1747/247 

vt -30.4653 27.1733
vt -30.3771 26.6076
vn -3.05911e-019 -0.343193 -0.939265
vt -16.4463 26.6076
vt -16.3581 27.1733
f 680/1748/82 684/1749/252 686/1750/252 679/1751/82 

vt -30.3771 70.858
v 30.1186 1.07525 -139.419
vt -30.1186 70.2602
vn -4.00562e-020 -0.619328 -0.785132
v 16.7048 1.07525 -139.419
vt -16.7048 70.2602
vt -16.4463 70.858
f 684/1752/252 687/1753/253 688/1754/253 686/1755/252 

vt 139.716 14.9765
vt 136.842 14.9765
vt 120.785 14.9765
v 30.1186 1.07525 -121.082
vt 121.082 14.397
vn 0.823107 -0.567886 -2.06608e-016
v 30.1186 1.07525 -136.842
vt 136.842 14.397
vt 139.419 14.397
f 684/1756/249 683/1757/249 682/1758/249 689/1759/254 690/1760/254 687/1761/254 

vt 16.4463 -58.6784
v 16.7048 1.07525 -121.082
vt 16.7048 -59.2762
vn -8.21308e-019 -0.619328 0.785132
vt 30.1186 -59.2762
vt 30.3771 -58.6784
f 685/1762/250 691/1763/255 689/1764/255 682/1765/250 

vt -139.716 -5.90943
vt -139.419 -6.48893
vn -0.823107 -0.567886 5.56297e-019
vt -121.082 -6.48893
vt -120.785 -5.90943
f 686/1766/251 688/1767/256 691/1768/256 685/1769/251 

vt -139.419 -10.5417
v 17.116 0.629867 -138.946
vt -138.946 -11.1478
v 17.116 0.629867 -121.555
vt -121.555 -11.1478
vt -121.082 -10.5417
f 688/1770/256 692/1771/204 693/1772/204 691/1773/256 

vt -30.1186 102.228
v 29.7074 0.629867 -138.946
vt -29.7074 101.578
vn -4.07451e-020 -0.8075 -0.589868
vt -17.116 101.578
vt -16.7048 102.228
f 687/1774/253 694/1775/257 692/1776/257 688/1777/253 

vt 139.419 21.221
vt 136.842 21.221
vt 121.082 21.221
v 29.7074 0.629867 -121.555
vt 121.555 20.6148
vn 0.641531 -0.767097 -1.96886e-016
v 29.7074 0.629867 -136.842
vt 136.842 20.6148
vt 138.946 20.6148
f 687/1778/254 690/1779/254 689/1780/254 695/1781/258 696/1782/258 694/1783/258 

vt 16.7048 -87.405
vt 17.116 -88.0546
vn -8.27413e-019 -0.8075 0.589868
vt 29.7074 -88.0546
vt 30.1186 -87.405
f 691/1784/255 693/1785/259 695/1786/259 689/1787/255 

vt 17.116 -105.998
v 17.6519 0.288112 -122.171
vt 17.6519 -106.702
vn -4.57185e-019 -0.921606 0.388126
v 29.1715 0.288112 -122.171
vt 29.1715 -106.702
vt 29.7074 -105.998
f 693/1788/259 697/1789/260 698/1790/260 695/1791/259 

vt -138.946 -14.0925
v 17.6519 0.288112 -138.329
vt -138.329 -14.728
vt -122.171 -14.728
vt -121.555 -14.0925
f 692/1792/204 699/1793/208 697/1794/208 693/1795/204 

vt -29.7074 121.818
v 29.1715 0.288112 -138.329
vt -29.1715 121.113
vn -2.35256e-019 -0.921606 -0.388126
vt -17.6519 121.113
vt -17.116 121.818
f 694/1796/257 700/1797/261 699/1798/261 692/1799/257 

vt 138.946 25.3861
vt 136.842 25.3861
vt 121.555 25.3861
vt 122.171 24.7505
vn 0.43463 -0.900609 -2.10413e-016
v 29.1715 0.288112 -136.842
vt 136.842 24.7505
vt 138.329 24.7505
f 694/1800/258 696/1801/258 695/1802/258 698/1803/262 701/1804/262 700/1805/262 

vt 138.329 27.6766
vt 136.842 27.6766
vt 122.171 27.6766
v 28.5475 0.0732765 -122.889
vt 122.889 27.0166
vn 0.21849 -0.975839 -1.68148e-016
v 28.5475 0.0732765 -136.842
vt 136.842 27.0166
v 28.5475 0.0732765 -137.612
vt 137.612 27.0166
f 700/1806/262 701/1807/262 698/1808/262 702/1809/263 703/1810/263 704/1811/263 

vt 17.6519 -116.957
v 18.2759 0.0732765 -122.889
vt 18.2759 -117.706
vn -2.14723e-019 -0.98146 0.191669
vt 28.5475 -117.706
vt 29.1715 -116.957
f 697/1812/260 705/1813/264 702/1814/264 698/1815/260 

vt -138.329 -16.5968
v 18.2759 0.0732765 -137.612
vt -137.612 -17.2568
vt -122.889 -17.2568
vt -122.171 -16.5968
f 699/1816/208 706/1817/212 705/1818/212 697/1819/208 

vt -29.1715 132.602
vt -28.5475 131.853
vn 2.18363e-021 -0.98146 -0.191669
vt -18.2759 131.853
vt -17.6519 132.602
f 700/1820/261 704/1821/265 706/1822/265 699/1823/261 

vt -28.5475 137
v 27.8778 0 -136.842
vt -27.8778 136.226
v 18.9456 0 -136.842
vt -18.9456 136.226
vt -18.2759 137
f 704/1824/265 707/1825/104 708/1826/104 706/1827/265 

vt 137.612 28.3861
vt 136.842 28.3861
vt 122.889 28.3861
v 27.8778 0 -123.659
vt 123.659 27.7124
vn 0.108769 -0.994067 -1.21395e-016
vt 136.842 27.7124
f 704/1828/263 703/1829/263 702/1830/263 709/1831/266 707/1832/266 

vt 18.2759 -122.329
v 18.9456 0 -123.659
vt 18.9456 -123.103
vn -4.27386e-019 -0.995504 0.0947182
vt 27.8778 -123.103
vt 28.5475 -122.329
f 705/1833/264 710/1834/267 709/1835/267 702/1836/264 

vt -137.612 -18.1595
vt -136.842 -18.8332
vt -123.659 -18.8332
vt -122.889 -18.1595
f 706/1837/212 708/1838/215 710/1839/215 705/1840/212 

f 709/1537/13 710/1534/13 708/1535/13 707/1536/13 

f 631/429/14 649/430/14 642/431/14 632/432/14 

vt -136.842 110.792
vn -0.997749 0.0670611 -2.00047e-019
vt -140.969 57.2765
vt -119.532 57.2765
vt -123.659 110.792
f 625/1841/268 630/1842/268 637/1843/268 624/1844/268 

vt 18.9456 118.972
vt 15.3568 65.4175
vt 31.4666 65.4175
vt 27.8778 118.972
f 624/1845/109 637/1846/109 628/1847/109 623/1848/109 

f 611/1536/13 602/1562/13 607/1537/13

f 601/1535/13 602/1562/13 611/1536/13

f 583/1538/30 586/1545/30 590/1549/30

f 583/1538/30 577/1540/30 586/1545/30

f 575/1543/30 586/1545/30 577/1540/30

