{
	"name": "coinstone",
	"title": "Coinstone",
	"description": "",
	"version": "0.1.3",
	"author": "Zen",
	"authors": [
		{
			"name": "",
			"email": "",
			"url": ""
		}
	],
	"scripts": [],
	"esmodules": [
		"dist/coinstone.js"
	],
	"styles": ["dist/coinstone.css"],
	"packs": [
		{
			"name": "classes",
			"label": "Classes",
			"path": "packs/classes.db",
			"entity": "Item",
			"module": "coinstone"
		},
		{
			"name": "features",
			"label": "Class Features",
			"path": "packs/features.db",
			"entity": "Item",
			"module": "coinstone"
		},
		{
			"name": "spells",
			"label": "Spells",
			"path": "packs/spells.db",
			"entity": "Item",
			"module": "coinstone"
		},
		{
			"name": "items",
			"label": "Magic Items",
			"path": "packs/items.db",
			"entity": "Item",
			"module": "coinstone"
		},
		{
			"name": "macros",
			"label": "Macros",
			"path": "packs/macros.db",
			"entity": "Macro",
			"module": "coinstone"
		}
	],
	"languages": [],
	"minimumCoreVersion": "0.6.0",
	"compatibleCoreVersion": "0.7.4",
	"url": "https://gitlab.com/linden.dg/coinstone-module",
	"manifest": "https://gitlab.com/linden.dg/coinstone-module/raw/master/package/module.json",
	"download": "https://gitlab.com/linden.dg/coinstone-module/raw/master/package/coinstone-v0.1.3.zip",
	"license": "",
	"readme": "",
	"bugs": "",
	"changelog": ""
}