{
    "version": "0.0.1",
    "summary": "SPA for jointpay",
    "repository": "https://github.com/grrinchas/dg-elm-starter-kit.git",
    "license": "MIT",
    "source-directories": [
        "src/app/"
    ],
    "exposed-modules": [],
    "dependencies": {
        "elm-lang/core": "5.1.1 <= v < 6.0.0",
        "elm-lang/html": "2.0.0 <= v < 3.0.0",
        "ohanhi/lorem": "1.0.0 <= v < 2.0.0",
        "elm-lang/navigation": "2.0.0 <= v < 3.0.0",
        "evancz/url-parser": "2.0.0 <= v < 3.0.0",
        "NoRedInk/elm-decode-pipeline": "3.0.0 <= v < 4.0.0",
        "krisajenkins/remotedata": "4.0.0 <= v < 5.0.0",
        "elm-lang/http": "1.0.0 <= v < 2.0.0",
        "debois/elm-mdl": "8.0.0 <= v < 9.0.0",
        "kkpoon/elm-auth0-urlparser": "2.0.0 <= v < 3.0.0",
        "simonh1000/elm-jwt": "5.0.0 <= v < 6.0.0"
    },
    "elm-version": "0.18.0 <= v < 0.19.0"
}
