%YAML 1.1
%TAG !u! tag:unity3d.com,2011:
--- !u!114 &11400000
MonoBehaviour:
  m_ObjectHideFlags: 0
  m_CorrespondingSourceObject: {fileID: 0}
  m_PrefabInstance: {fileID: 0}
  m_PrefabAsset: {fileID: 0}
  m_GameObject: {fileID: 0}
  m_Enabled: 1
  m_EditorHideFlags: 0
  m_Script: {fileID: 11500000, guid: d35feba6f73a8b744b8478e1565b83d1, type: 3}
  m_Name: 1BF19CC0-B487-4F28-848D-896D846DF500
  m_EditorClassIdentifier: 
  objectName: Play_roomtone_camera_height
  id: 3600701587
  guid: 1BF19CC0-B487-4F28-848D-896D846DF500
