[api-updater (non-obsolete-error-filter)] 8/8/2022 12:39:34 PM : Starting C:/Program Files/Unity/Hub/Editor/2020.3.36f1/Editor/Data/Tools/ScriptUpdater/APIUpdater.NonObsoleteApiUpdaterDetector.exe
[api-updater (non-obsolete-error-filter)] 
----------------------------------
jit/startup time      : 1297.0618ms
moved types parse time: 80ms
candidates parse time : 1ms
C# parse time         : 934ms
candidates check time : 73ms
console write time    : 0ms

[api-updater (non-obsolete-error-filter)] 8/8/2022 1:38:34 PM : Starting C:/Program Files/Unity/Hub/Editor/2020.3.36f1/Editor/Data/Tools/ScriptUpdater/APIUpdater.NonObsoleteApiUpdaterDetector.exe
[api-updater (non-obsolete-error-filter)] 
----------------------------------
jit/startup time      : 286.0964ms
moved types parse time: 88ms
candidates parse time : 1ms
C# parse time         : 230ms
candidates check time : 38ms
console write time    : 0ms

[api-updater (non-obsolete-error-filter)] 8/8/2022 1:52:26 PM : Starting C:/Program Files/Unity/Hub/Editor/2020.3.36f1/Editor/Data/Tools/ScriptUpdater/APIUpdater.NonObsoleteApiUpdaterDetector.exe
[api-updater (non-obsolete-error-filter)] 
----------------------------------
jit/startup time      : 117.9375ms
moved types parse time: 74ms
candidates parse time : 1ms
C# parse time         : 220ms
candidates check time : 36ms
console write time    : 0ms

[api-updater (non-obsolete-error-filter)] 8/8/2022 1:52:36 PM : Starting C:/Program Files/Unity/Hub/Editor/2020.3.36f1/Editor/Data/Tools/ScriptUpdater/APIUpdater.NonObsoleteApiUpdaterDetector.exe
[api-updater (non-obsolete-error-filter)] 
----------------------------------
jit/startup time      : 99.8149ms
moved types parse time: 74ms
candidates parse time : 1ms
C# parse time         : 228ms
candidates check time : 39ms
console write time    : 0ms

[api-updater (non-obsolete-error-filter)] 8/8/2022 1:52:42 PM : Starting C:/Program Files/Unity/Hub/Editor/2020.3.36f1/Editor/Data/Tools/ScriptUpdater/APIUpdater.NonObsoleteApiUpdaterDetector.exe
[api-updater (non-obsolete-error-filter)] 
----------------------------------
jit/startup time      : 101.2053ms
moved types parse time: 77ms
candidates parse time : 1ms
C# parse time         : 234ms
candidates check time : 37ms
console write time    : 0ms

[api-updater (non-obsolete-error-filter)] 8/8/2022 2:07:47 PM : Starting C:/Program Files/Unity/Hub/Editor/2020.3.36f1/Editor/Data/Tools/ScriptUpdater/APIUpdater.NonObsoleteApiUpdaterDetector.exe
[api-updater (non-obsolete-error-filter)] 
----------------------------------
jit/startup time      : 105.6987ms
moved types parse time: 72ms
candidates parse time : 2ms
C# parse time         : 257ms
candidates check time : 50ms
console write time    : 0ms

[api-updater (non-obsolete-error-filter)] 8/8/2022 2:28:51 PM : Starting C:/Program Files/Unity/Hub/Editor/2020.3.36f1/Editor/Data/Tools/ScriptUpdater/APIUpdater.NonObsoleteApiUpdaterDetector.exe
[api-updater (non-obsolete-error-filter)] 
----------------------------------
jit/startup time      : 114.2167ms
moved types parse time: 81ms
candidates parse time : 1ms
C# parse time         : 251ms
candidates check time : 61ms
console write time    : 0ms

[api-updater (non-obsolete-error-filter)] 8/8/2022 3:23:30 PM : Starting C:/Program Files/Unity/Hub/Editor/2020.3.36f1/Editor/Data/Tools/ScriptUpdater/APIUpdater.NonObsoleteApiUpdaterDetector.exe
[api-updater (non-obsolete-error-filter)] 
----------------------------------
jit/startup time      : 141.4367ms
moved types parse time: 74ms
candidates parse time : 1ms
C# parse time         : 250ms
candidates check time : 44ms
console write time    : 0ms

[api-updater (non-obsolete-error-filter)] 8/8/2022 3:23:58 PM : Starting C:/Program Files/Unity/Hub/Editor/2020.3.36f1/Editor/Data/Tools/ScriptUpdater/APIUpdater.NonObsoleteApiUpdaterDetector.exe
[api-updater (non-obsolete-error-filter)] 
----------------------------------
jit/startup time      : 109.9536ms
moved types parse time: 73ms
candidates parse time : 2ms
C# parse time         : 238ms
candidates check time : 40ms
console write time    : 0ms

[api-updater (non-obsolete-error-filter)] 8/18/2022 4:40:47 PM : Starting C:/Program Files/Unity/Hub/Editor/2020.3.36f1/Editor/Data/Tools/ScriptUpdater/APIUpdater.NonObsoleteApiUpdaterDetector.exe
[api-updater (non-obsolete-error-filter)] 
----------------------------------
jit/startup time      : 249.268ms
moved types parse time: 71ms
candidates parse time : 1ms
C# parse time         : 440ms
candidates check time : 107ms
console write time    : 0ms

[api-updater (non-obsolete-error-filter)] 8/18/2022 4:40:49 PM : Starting C:/Program Files/Unity/Hub/Editor/2020.3.36f1/Editor/Data/Tools/ScriptUpdater/APIUpdater.NonObsoleteApiUpdaterDetector.exe
[api-updater (non-obsolete-error-filter)] 
----------------------------------
jit/startup time      : 102.1093ms
moved types parse time: 76ms
candidates parse time : 1ms
C# parse time         : 234ms
candidates check time : 53ms
console write time    : 0ms

[api-updater (non-obsolete-error-filter)] 8/18/2022 4:40:53 PM : Starting C:/Program Files/Unity/Hub/Editor/2020.3.36f1/Editor/Data/Tools/ScriptUpdater/APIUpdater.NonObsoleteApiUpdaterDetector.exe
[api-updater (non-obsolete-error-filter)] 
----------------------------------
jit/startup time      : 109.8228ms
moved types parse time: 114ms
candidates parse time : 1ms
C# parse time         : 272ms
candidates check time : 63ms
console write time    : 0ms

