<?xml version="1.0" encoding="utf-8"?>
<!-- Generator: Adobe Illustrator 22.0.0, SVG Export Plug-In . SVG Version: 6.00 Build 0)  -->
<svg version="1.1" id="cable_tv" xmlns="http://www.w3.org/2000/svg" xmlns:xlink="http://www.w3.org/1999/xlink" x="0px" y="0px"
	 viewBox="0 0 65.3 48.7" style="enable-background:new 0 0 65.3 48.7;" xml:space="preserve">
<style type="text/css">
	.st0{fill:#0D89AD;}
	.st1{fill:#19BEDF;}
	.st2{fill:#FFFFFF;}
</style>
<g>
	<path class="st0" d="M5,1v1h55.3c1.7,0,3,1.3,3,3v28c0,1.7-1.3,3-3,3H5c-1.7,0-3-1.3-3-3V5c0-1.7,1.3-3,3-3V1V0C2.2,0,0,2.2,0,5v28
		c0,2.8,2.2,5,5,5h55.3c2.8,0,5-2.2,5-5V5c0-2.8-2.2-5-5-5H5V1z"/>
	<rect x="29.7" y="35.6" class="st1" width="8.3" height="13.1"/>
	<polygon class="st0" points="30.7,36.6 30.7,37.6 36,37.6 36,46.7 31.7,46.7 31.7,36.6 30.7,36.6 30.7,37.6 30.7,36.6 29.7,36.6 
		29.7,48.7 38,48.7 38,35.6 29.7,35.6 29.7,36.6 	"/>
	<path class="st2" d="M19,46.3h29.7c0.7,0,1.2,0.5,1.2,1.2v0c0,0.7-0.5,1.2-1.2,1.2H19c-0.7,0-1.2-0.5-1.2-1.2v0
		C17.8,46.8,18.3,46.3,19,46.3z"/>
	<path class="st0" d="M19,46.8v0.5h29.7c0.1,0,0.2,0.1,0.2,0.2v0c0,0.1-0.1,0.2-0.2,0.2H19c-0.1,0-0.2-0.1-0.2-0.2l0,0
		c0-0.1,0.1-0.2,0.2-0.2V46.8v-0.5c-0.7,0-1.2,0.5-1.2,1.2v0c0,0.7,0.5,1.2,1.2,1.2h29.7c0.7,0,1.2-0.5,1.2-1.2l0,0
		c0-0.7-0.5-1.2-1.2-1.2H19V46.8z"/>
	<polyline class="st0" points="1.8,33.2 63.5,33.2 63.5,32.2 1.8,32.2 	"/>
	<g>
		<path class="st1" d="M29.9,11.8c0.1,0.1,0.2,0.3,0.2,0.5s-0.1,0.4-0.2,0.5c-0.1,0.1-0.3,0.2-0.5,0.2h-2.7v8.4
			c0,0.2-0.1,0.4-0.2,0.5c-0.1,0.1-0.3,0.2-0.5,0.2s-0.4-0.1-0.5-0.2c-0.1-0.1-0.2-0.3-0.2-0.5V13h-2.7c-0.2,0-0.4-0.1-0.5-0.2
			s-0.2-0.3-0.2-0.5c0-0.2,0.1-0.4,0.2-0.5s0.3-0.2,0.5-0.2h6.9C29.6,11.6,29.8,11.7,29.9,11.8z"/>
		<path class="st1" d="M40.2,11.8c0.1,0.1,0.2,0.3,0.2,0.5c0,0.1,0,0.2-0.1,0.3l-3.8,9c-0.1,0.2-0.2,0.3-0.3,0.3s-0.3,0.1-0.4,0.1
			c-0.1,0-0.3-0.1-0.4-0.1c-0.1-0.1-0.2-0.2-0.3-0.3l-3.8-9.1c0-0.1-0.1-0.2-0.1-0.3c0-0.2,0.1-0.4,0.2-0.5s0.3-0.2,0.5-0.2
			c0.3,0,0.5,0.2,0.7,0.5l3.3,7.7l3.1-7.7c0.1-0.1,0.2-0.3,0.3-0.3c0.1-0.1,0.2-0.1,0.4-0.1C39.8,11.6,40,11.7,40.2,11.8z"/>
	</g>
</g>
</svg>
