<?xml version="1.0" encoding="utf-8"?>
<!-- Generator: Adobe Illustrator 22.0.0, SVG Export Plug-In . SVG Version: 6.00 Build 0)  -->
<svg version="1.1" id="Layer_1" xmlns="http://www.w3.org/2000/svg" xmlns:xlink="http://www.w3.org/1999/xlink" x="0px" y="0px"
	 viewBox="0 0 68.3 52.2" style="enable-background:new 0 0 68.3 52.2;" xml:space="preserve">
<style type="text/css">
	.st0{fill:#19BEDF;}
	.st1{fill:#0D89AD;}
</style>
<g>
	<path class="st0" d="M34.1,37.6c4,0,7.3,3.3,7.3,7.3c0,4-3.3,7.3-7.3,7.3c-4,0-7.3-3.3-7.3-7.3C26.8,40.9,30,37.6,34.1,37.6z"/>
	<path class="st1" d="M34.1,38.6v1c1.5,0,2.8,0.6,3.7,1.6c1,1,1.6,2.3,1.6,3.7c0,1.5-0.6,2.8-1.6,3.7c-1,1-2.3,1.6-3.7,1.6
		c-1.5,0-2.8-0.6-3.7-1.6c-1-1-1.6-2.3-1.6-3.7c0-1.5,0.6-2.8,1.6-3.7c1-1,2.3-1.6,3.7-1.6V38.6v-1c-4,0-7.3,3.3-7.3,7.3
		c0,4,3.3,7.3,7.3,7.3c4,0,7.3-3.3,7.3-7.3c0-4-3.3-7.3-7.3-7.3V38.6z"/>
	<path class="st1" d="M20.4,35.5c3.2-4.6,8.2-6.9,13.4-6.9c5.2,0,10.4,2.3,13.8,7c0.4,0.6,1.2,0.7,1.7,0.3c0.6-0.4,0.7-1.2,0.3-1.7
		c-3.9-5.3-9.9-8-15.8-8c-5.9,0-11.8,2.7-15.4,8c-0.4,0.6-0.2,1.3,0.3,1.7C19.2,36.2,20,36,20.4,35.5L20.4,35.5z"/>
	<path class="st1" d="M10.5,26.4c2.1-3.1,5.4-5.8,9.5-7.8c4.1-2,9-3.2,14.1-3.2c8.2,0,16.9,3.1,23.8,11.1c0.5,0.5,1.2,0.6,1.8,0.1
		c0.5-0.5,0.6-1.2,0.1-1.8c-7.4-8.6-16.9-12-25.7-12c-5.5,0-10.7,1.3-15.2,3.4c-4.5,2.1-8.2,5.1-10.5,8.7c-0.4,0.6-0.2,1.3,0.3,1.7
		C9.4,27.1,10.1,26.9,10.5,26.4L10.5,26.4z"/>
	<path class="st1" d="M2.2,17.9C9.7,8,21.4,2.5,33.5,2.5C45,2.5,56.8,7.3,66.1,18c0.5,0.5,1.2,0.6,1.8,0.1c0.5-0.5,0.6-1.2,0.1-1.8
		C58.3,5.2,45.7,0,33.5,0C20.6,0,8.2,5.8,0.3,16.4c-0.4,0.6-0.3,1.3,0.2,1.8S1.8,18.5,2.2,17.9L2.2,17.9z"/>
</g>
</svg>
