{
  "kind": "collectionType",
  "collectionName": "etapes",
  "info": {
    "singularName": "etape",
    "pluralName": "etapes",
    "displayName": "Etape"
  },
  "options": {
    "draftAndPublish": true
  },
  "pluginOptions": {},
  "attributes": {
    "title": {
      "type": "string"
    },
    "content": {
      "type": "richtext"
    },
    "service": {
      "type": "relation",
      "relation": "manyToOne",
      "target": "api::service.service",
      "inversedBy": "etapes"
    }
  }
}
