{
  "kind": "collectionType",
  "collectionName": "q_and_as",
  "info": {
    "singularName": "q-and-a",
    "pluralName": "q-and-as",
    "displayName": "Q&A"
  },
  "options": {
    "draftAndPublish": true
  },
  "pluginOptions": {},
  "attributes": {
    "title": {
      "type": "string"
    },
    "content": {
      "type": "richtext"
    },
    "service": {
      "type": "relation",
      "relation": "manyToOne",
      "target": "api::service.service",
      "inversedBy": "q_and_as"
    }
  }
}
