EESchema Schematic File Version 2
LIBS:power
LIBS:device
LIBS:transistors
LIBS:conn
LIBS:linear
LIBS:regul
LIBS:74xx
LIBS:cmos4000
LIBS:adc-dac
LIBS:memory
LIBS:xilinx
LIBS:special
LIBS:microcontrollers
LIBS:dsp
LIBS:microchip
LIBS:analog_switches
LIBS:motorola
LIBS:texas
LIBS:intel
LIBS:audio
LIBS:interface
LIBS:digital-audio
LIBS:philips
LIBS:display
LIBS:cypress
LIBS:siliconi
LIBS:opto
LIBS:atmel
LIBS:contrib
LIBS:valves
LIBS:microchip1
LIBS:UND2916B
LIBS:LB1836M
LIBS:vrpi
LIBS:sd-cache
EELAYER 27 0
EELAYER END
$Descr A4 11693 8268
encoding utf-8
Sheet 5 6
Title ""
Date "10 nov 2017"
Rev ""
Comp ""
Comment1 ""
Comment2 ""
Comment3 ""
Comment4 ""
$EndDescr
Connection ~ 6950 3400
Wire Wire Line
	6950 3400 6950 4200
Wire Wire Line
	6950 4200 7500 4200
Wire Wire Line
	7050 4600 7500 4600
Wire Wire Line
	7050 3800 7500 3800
Wire Wire Line
	8300 3500 8550 3500
Wire Wire Line
	8550 3500 8550 3350
Connection ~ 8700 4300
Wire Wire Line
	8700 3600 8700 5450
Wire Wire Line
	8700 4000 8300 4000
Wire Wire Line
	8700 3600 8300 3600
Wire Wire Line
	8300 3700 8350 3700
Wire Wire Line
	8300 3800 8350 3800
Wire Wire Line
	8700 4300 8300 4300
Connection ~ 8700 4000
Wire Wire Line
	8300 3400 8550 3400
Connection ~ 8550 3400
Wire Wire Line
	6900 3400 7500 3400
Text GLabel 8300 4600 2    60   Input ~ 0
GPIO07
Text GLabel 8300 4500 2    60   Input ~ 0
GPIO08
Text GLabel 8300 4200 2    60   Input ~ 0
GPIO24
Text GLabel 8300 4400 2    60   Input ~ 0
GPIO25
Text GLabel 8300 4100 2    60   Input ~ 0
GPIO23
Text GLabel 8300 3900 2    60   Input ~ 0
GPIO18
Text GLabel 7500 4500 0    60   Input ~ 0
GPIO11
Text GLabel 7500 4400 0    60   Input ~ 0
GPIO09
Text GLabel 7500 4300 0    60   Input ~ 0
GPIO10
Text GLabel 7500 4100 0    60   Input ~ 0
GPIO22
Text GLabel 7500 4000 0    60   Input ~ 0
GPIO27
Text GLabel 7500 3900 0    60   Input ~ 0
GPIO17
Text GLabel 7500 3700 0    60   Input ~ 0
GPIO04
Text GLabel 6900 3400 0    60   Input ~ 0
3V3
Text GLabel 8350 3800 2    60   Input ~ 0
Tx
Text GLabel 8350 3700 2    60   Input ~ 0
Rx
$Comp
L GNDRP #PWR047
U 1 1 50AF4738
P 7050 5550
F 0 "#PWR047" H 7050 5550 40  0001 C CNN
F 1 "GNDRP" H 7050 5480 50  0000 C CNN
F 2 "" H 7050 5550 60  0001 C CNN
F 3 "" H 7050 5550 60  0001 C CNN
	1    7050 5550
	1    0    0    -1  
$EndComp
$Comp
L CONN_20X2 P15
U 1 1 5405C70F
P 7900 4350
F 0 "P15" H 7900 5400 60  0000 C CNN
F 1 "RPi Connection" V 7900 4350 50  0000 C CNN
F 2 "" H 7900 4350 60  0000 C CNN
F 3 "" H 7900 4350 60  0000 C CNN
	1    7900 4350
	1    0    0    -1  
$EndComp
Wire Wire Line
	8700 5450 7050 5450
Connection ~ 7050 5450
Wire Wire Line
	7050 3800 7050 5550
Connection ~ 7050 4600
Text GLabel 7500 4700 0    60   Input ~ 0
ID_SD
Text GLabel 8300 4700 2    60   Input ~ 0
ID_SC
Text GLabel 7500 4800 0    60   Input ~ 0
GPIO05
Text GLabel 7500 4900 0    60   Input ~ 0
GPIO06
Text GLabel 7500 5000 0    60   Input ~ 0
GPIO13
Text GLabel 7500 5100 0    60   Input ~ 0
GPIO19
Text GLabel 7500 5200 0    60   Input ~ 0
GPIO26
Wire Wire Line
	7500 5300 7500 5450
Connection ~ 7500 5450
Wire Wire Line
	8300 4800 8700 4800
Connection ~ 8700 4800
Text GLabel 8300 4900 2    60   Input ~ 0
GPIO12
Wire Wire Line
	8300 5000 8700 5000
Connection ~ 8700 5000
Text GLabel 8300 5100 2    60   Input ~ 0
GPIO16
Text GLabel 8300 5200 2    60   Input ~ 0
GPIO20
Text GLabel 8300 5300 2    60   Input ~ 0
GPIO21
Text GLabel 7500 3500 0    60   Input ~ 0
GPIO02
Text GLabel 7500 3600 0    60   Input ~ 0
GPIO03
$Comp
L CAT24C32 U4
U 1 1 5408B482
P 3950 4550
F 0 "U4" H 3950 4650 60  0000 C CNN
F 1 "CAT24C32" H 3950 4750 60  0000 C CNN
F 2 "~" H 3950 4550 60  0000 C CNN
F 3 "~" H 3950 4550 60  0000 C CNN
	1    3950 4550
	1    0    0    -1  
$EndComp
Wire Wire Line
	3400 4550 3600 4550
Wire Wire Line
	3600 4650 3400 4650
Connection ~ 3400 4650
Wire Wire Line
	3600 4750 3400 4750
Connection ~ 3400 4750
Wire Wire Line
	3600 4850 3400 4850
Connection ~ 3400 4850
Wire Wire Line
	3400 5050 3400 4550
$Comp
L GND3V3 #PWR048
U 1 1 5408B52A
P 3400 5050
F 0 "#PWR048" H 3400 5050 40  0001 C CNN
F 1 "GND3V3" H 3400 4980 50  0000 C CNN
F 2 "~" H 3400 5050 60  0000 C CNN
F 3 "~" H 3400 5050 60  0000 C CNN
	1    3400 5050
	1    0    0    -1  
$EndComp
$Comp
L +3.3V #PWR049
U 1 1 5408B539
P 4400 4000
F 0 "#PWR049" H 4400 3960 30  0001 C CNN
F 1 "+3.3V" H 4400 4110 30  0000 C CNN
F 2 "" H 4400 4000 60  0000 C CNN
F 3 "" H 4400 4000 60  0000 C CNN
	1    4400 4000
	1    0    0    -1  
$EndComp
Wire Wire Line
	4400 4000 4400 4550
Wire Wire Line
	4400 4550 4300 4550
$Comp
L C C10
U 1 1 5408B56D
P 4100 4150
F 0 "C10" H 4100 4250 40  0000 L CNN
F 1 "0.1uF" H 4106 4065 40  0000 L CNN
F 2 "~" H 4138 4000 30  0000 C CNN
F 3 "~" H 4100 4150 60  0000 C CNN
	1    4100 4150
	0    -1   -1   0   
$EndComp
Wire Wire Line
	4300 4150 5100 4150
Connection ~ 4400 4150
$Comp
L GND3V3 #PWR050
U 1 1 5408B5B2
P 3550 4200
F 0 "#PWR050" H 3550 4200 40  0001 C CNN
F 1 "GND3V3" H 3550 4130 50  0000 C CNN
F 2 "~" H 3550 4200 60  0000 C CNN
F 3 "~" H 3550 4200 60  0000 C CNN
	1    3550 4200
	1    0    0    -1  
$EndComp
Wire Wire Line
	3550 4200 3550 4150
Wire Wire Line
	3550 4150 3900 4150
$Comp
L R R16
U 1 1 5408B5EB
P 4600 4400
F 0 "R16" V 4680 4400 40  0000 C CNN
F 1 "1k" V 4607 4401 40  0000 C CNN
F 2 "~" V 4530 4400 30  0000 C CNN
F 3 "~" H 4600 4400 30  0000 C CNN
	1    4600 4400
	1    0    0    -1  
$EndComp
$Comp
L R R17
U 1 1 5408B5FA
P 4850 4400
F 0 "R17" V 4930 4400 40  0000 C CNN
F 1 "3.9k" V 4857 4401 40  0000 C CNN
F 2 "~" V 4780 4400 30  0000 C CNN
F 3 "~" H 4850 4400 30  0000 C CNN
	1    4850 4400
	1    0    0    -1  
$EndComp
$Comp
L R R18
U 1 1 5408B609
P 5100 4400
F 0 "R18" V 5180 4400 40  0000 C CNN
F 1 "3.9k" V 5107 4401 40  0000 C CNN
F 2 "~" V 5030 4400 30  0000 C CNN
F 3 "~" H 5100 4400 30  0000 C CNN
	1    5100 4400
	1    0    0    -1  
$EndComp
Connection ~ 4600 4150
Connection ~ 4850 4150
Wire Wire Line
	4300 4650 4600 4650
Wire Wire Line
	4300 4750 4850 4750
Wire Wire Line
	4300 4850 5100 4850
Text GLabel 4850 4950 3    60   Input ~ 0
ID_SC
Text GLabel 5100 4950 3    60   Input ~ 0
ID_SD
Wire Wire Line
	5100 4650 5100 4950
Wire Wire Line
	4850 4650 4850 4950
$Comp
L CONN_2 P13
U 1 1 5408BCA4
P 4100 5750
F 0 "P13" V 4050 5750 40  0000 C CNN
F 1 "JP WP" V 4150 5750 40  0000 C CNN
F 2 "" H 4100 5750 60  0000 C CNN
F 3 "" H 4100 5750 60  0000 C CNN
	1    4100 5750
	-1   0    0    1   
$EndComp
Wire Wire Line
	4600 4650 4600 5650
$Comp
L GND3V3 #PWR051
U 1 1 5408BCF6
P 4600 6000
F 0 "#PWR051" H 4600 6000 40  0001 C CNN
F 1 "GND3V3" H 4600 5930 50  0000 C CNN
F 2 "~" H 4600 6000 60  0000 C CNN
F 3 "~" H 4600 6000 60  0000 C CNN
	1    4600 6000
	1    0    0    -1  
$EndComp
Wire Wire Line
	4600 5850 4600 6000
Text Notes 3850 3650 0    60   ~ 0
EEPROM
$Comp
L CONN_2 P14
U 1 1 540A0138
P 5100 5750
F 0 "P14" V 5050 5750 40  0000 C CNN
F 1 "PP WP" V 5150 5750 40  0000 C CNN
F 2 "" H 5100 5750 60  0000 C CNN
F 3 "" H 5100 5750 60  0000 C CNN
	1    5100 5750
	1    0    0    -1  
$EndComp
Wire Wire Line
	4450 5650 4750 5650
Connection ~ 4600 5650
Wire Wire Line
	4450 5850 4750 5850
Connection ~ 4600 5850
Connection ~ 4850 4750
Connection ~ 5100 4850
$Comp
L VRPI #PWR052
U 1 1 54803F51
P 8550 3350
F 0 "#PWR052" H 8550 3450 30  0001 C CNN
F 1 "VRPI" H 8550 3450 30  0000 C CNN
F 2 "~" H 8550 3350 60  0000 C CNN
F 3 "~" H 8550 3350 60  0000 C CNN
	1    8550 3350
	1    0    0    -1  
$EndComp
$EndSCHEMATC
