EESchema Schematic File Version 2
LIBS:power
LIBS:device
LIBS:transistors
LIBS:conn
LIBS:linear
LIBS:regul
LIBS:74xx
LIBS:cmos4000
LIBS:adc-dac
LIBS:memory
LIBS:xilinx
LIBS:special
LIBS:microcontrollers
LIBS:dsp
LIBS:microchip
LIBS:analog_switches
LIBS:motorola
LIBS:texas
LIBS:intel
LIBS:audio
LIBS:interface
LIBS:digital-audio
LIBS:philips
LIBS:display
LIBS:cypress
LIBS:siliconi
LIBS:opto
LIBS:atmel
LIBS:contrib
LIBS:valves
LIBS:microchip1
LIBS:UND2916B
LIBS:LB1836M
LIBS:PIC18F67J94
LIBS:sd-cache
EELAYER 27 0
EELAYER END
$Descr A4 11693 8268
encoding utf-8
Sheet 2 6
Title ""
Date "2 sep 2014"
Rev ""
Comp ""
Comment1 ""
Comment2 ""
Comment3 ""
Comment4 ""
$EndDescr
Text GLabel 7900 5500 2    60   Input ~ 0
CLK_SS
$Comp
L GND #PWR01
U 1 1 51D540AC
P 8400 6800
F 0 "#PWR01" H 8400 6800 30  0001 C CNN
F 1 "GND" H 8400 6730 30  0001 C CNN
F 2 "" H 8400 6800 60  0001 C CNN
F 3 "" H 8400 6800 60  0001 C CNN
	1    8400 6800
	1    0    0    -1  
$EndComp
$Comp
L +5V #PWR02
U 1 1 51D540A9
P 8700 6650
F 0 "#PWR02" H 8700 6740 20  0001 C CNN
F 1 "+5V" H 8700 6740 30  0000 C CNN
F 2 "" H 8700 6650 60  0001 C CNN
F 3 "" H 8700 6650 60  0001 C CNN
	1    8700 6650
	1    0    0    -1  
$EndComp
$Comp
L GND3V3 #PWR03
U 1 1 51D53DC5
P 2000 5350
F 0 "#PWR03" H 2000 5350 40  0001 C CNN
F 1 "GND3V3" H 2000 5280 50  0000 C CNN
F 2 "" H 2000 5350 60  0001 C CNN
F 3 "" H 2000 5350 60  0001 C CNN
	1    2000 5350
	1    0    0    -1  
$EndComp
$Comp
L R R14
U 1 1 51D53DB3
P 2000 5050
F 0 "R14" V 2080 5050 50  0000 C CNN
F 1 "3.3k" V 2000 5050 50  0000 C CNN
F 2 "" H 2000 5050 60  0001 C CNN
F 3 "" H 2000 5050 60  0001 C CNN
	1    2000 5050
	1    0    0    -1  
$EndComp
Text GLabel 6350 7150 3    60   Input ~ 0
SW
Text GLabel 9250 3500 2    60   Input ~ 0
SW
$Comp
L GND3V3 #PWR04
U 1 1 51925BDE
P 8450 3600
F 0 "#PWR04" H 8450 3600 40  0001 C CNN
F 1 "GND3V3" H 8450 3530 50  0000 C CNN
F 2 "" H 8450 3600 60  0001 C CNN
F 3 "" H 8450 3600 60  0001 C CNN
	1    8450 3600
	1    0    0    -1  
$EndComp
$Comp
L +3.3V #PWR05
U 1 1 51925BD5
P 9100 2900
F 0 "#PWR05" H 9100 2860 30  0001 C CNN
F 1 "+3.3V" H 9100 3010 30  0000 C CNN
F 2 "" H 9100 2900 60  0001 C CNN
F 3 "" H 9100 2900 60  0001 C CNN
	1    9100 2900
	1    0    0    -1  
$EndComp
$Comp
L R R13
U 1 1 51925BD1
P 9100 3200
F 0 "R13" V 9180 3200 50  0000 C CNN
F 1 "3.3k" V 9100 3200 50  0000 C CNN
F 2 "" H 9100 3200 60  0001 C CNN
F 3 "" H 9100 3200 60  0001 C CNN
	1    9100 3200
	1    0    0    -1  
$EndComp
$Comp
L SW_PUSH SW3
U 1 1 51925BCB
P 8750 3500
F 0 "SW3" H 8900 3610 50  0000 C CNN
F 1 "SW_PUSH" H 8750 3420 50  0000 C CNN
F 2 "" H 8750 3500 60  0001 C CNN
F 3 "" H 8750 3500 60  0001 C CNN
	1    8750 3500
	1    0    0    -1  
$EndComp
$Comp
L CONN_2 P14
U 1 1 518CBC52
P 1300 1400
F 0 "P14" V 1250 1400 40  0000 C CNN
F 1 "Jumper I2C" V 1350 1400 40  0000 C CNN
F 2 "" H 1300 1400 60  0001 C CNN
F 3 "" H 1300 1400 60  0001 C CNN
	1    1300 1400
	-1   0    0    1   
$EndComp
Entry Wire Line
	5250 2700 5350 2800
$Comp
L +3.3V #PWR06
U 1 1 518B765F
P 7900 2500
F 0 "#PWR06" H 7900 2460 30  0001 C CNN
F 1 "+3.3V" H 7900 2610 30  0000 C CNN
F 2 "" H 7900 2500 60  0001 C CNN
F 3 "" H 7900 2500 60  0001 C CNN
	1    7900 2500
	1    0    0    -1  
$EndComp
$Comp
L R R6
U 1 1 518B7659
P 7900 2850
F 0 "R6" V 7980 2850 50  0000 C CNN
F 1 "3.3k" V 7900 2850 50  0000 C CNN
F 2 "" H 7900 2850 60  0001 C CNN
F 3 "" H 7900 2850 60  0001 C CNN
	1    7900 2850
	1    0    0    -1  
$EndComp
$Comp
L +5VRP #PWR07
U 1 1 50C6D12F
P 1650 2700
F 0 "#PWR07" H 1650 2790 20  0001 C CNN
F 1 "+5VRP" H 1650 2790 30  0000 C CNN
F 2 "" H 1650 2700 60  0001 C CNN
F 3 "" H 1650 2700 60  0001 C CNN
	1    1650 2700
	1    0    0    -1  
$EndComp
$Comp
L GNDRP #PWR08
U 1 1 50C6D12B
P 1450 2200
F 0 "#PWR08" H 1450 2200 40  0001 C CNN
F 1 "GNDRP" H 1450 2130 50  0000 C CNN
F 2 "" H 1450 2200 60  0001 C CNN
F 3 "" H 1450 2200 60  0001 C CNN
	1    1450 2200
	1    0    0    -1  
$EndComp
Text GLabel 6650 7150 3    60   Input ~ 0
Tx
Text GLabel 1700 4900 2    60   Input ~ 0
Tx
$Comp
L C C9
U 1 1 50B49071
P 8650 5150
F 0 "C9" H 8700 5250 50  0000 L CNN
F 1 "0.1uF" H 8350 5150 50  0000 L CNN
F 2 "" H 8650 5150 60  0001 C CNN
F 3 "" H 8650 5150 60  0001 C CNN
	1    8650 5150
	1    0    0    -1  
$EndComp
$Comp
L +3.3V #PWR09
U 1 1 4FB621DE
P 8400 5350
F 0 "#PWR09" H 8400 5310 30  0001 C CNN
F 1 "+3.3V" H 8400 5460 30  0000 C CNN
F 2 "" H 8400 5350 60  0001 C CNN
F 3 "" H 8400 5350 60  0001 C CNN
	1    8400 5350
	1    0    0    -1  
$EndComp
$Comp
L GND3V3 #PWR010
U 1 1 50AF414E
P 8400 5000
F 0 "#PWR010" H 8400 5000 40  0001 C CNN
F 1 "GND3V3" H 8400 4930 50  0000 C CNN
F 2 "" H 8400 5000 60  0001 C CNN
F 3 "" H 8400 5000 60  0001 C CNN
	1    8400 5000
	1    0    0    -1  
$EndComp
$Comp
L C C7
U 1 1 50B48F1E
P 5950 7550
F 0 "C7" H 6000 7650 50  0000 L CNN
F 1 "0.1uF" H 6000 7450 50  0000 L CNN
F 2 "" H 5950 7550 60  0001 C CNN
F 3 "" H 5950 7550 60  0001 C CNN
	1    5950 7550
	0    -1   -1   0   
$EndComp
Text HLabel 7900 4800 2    60   Input ~ 0
MD42
Text HLabel 7900 4700 2    60   Input ~ 0
MD41
Text HLabel 7900 4500 2    60   Input ~ 0
MD32
Text HLabel 7900 4600 2    60   Input ~ 0
MD31
Text HLabel 7900 4400 2    60   Input ~ 0
M2
Text HLabel 6350 2900 1    60   Input ~ 0
MD21
Text HLabel 6250 2900 1    60   Input ~ 0
MD22
Text HLabel 5850 2900 1    60   Input ~ 0
MD12
Text HLabel 6150 2900 1    60   Input ~ 0
MD11
Text HLabel 5650 2900 1    60   Input ~ 0
M1
Entry Wire Line
	5450 2700 5550 2800
Entry Wire Line
	3450 5200 3550 5300
Entry Wire Line
	3450 4900 3550 5000
Entry Wire Line
	3450 4700 3550 4800
$Comp
L GND3V3 #PWR011
U 1 1 50AF40D3
P 2650 6350
F 0 "#PWR011" H 2650 6350 40  0001 C CNN
F 1 "GND3V3" H 2650 6280 50  0000 C CNN
F 2 "" H 2650 6350 60  0001 C CNN
F 3 "" H 2650 6350 60  0001 C CNN
	1    2650 6350
	1    0    0    -1  
$EndComp
$Comp
L LED D3
U 1 1 4FBC70C8
P 2350 6300
F 0 "D3" H 2350 6400 50  0000 C CNN
F 1 "LED" H 2350 6200 50  0000 C CNN
F 2 "" H 2350 6300 60  0001 C CNN
F 3 "" H 2350 6300 60  0001 C CNN
	1    2350 6300
	1    0    0    -1  
$EndComp
$Comp
L R R5
U 1 1 4FBC70C7
P 1800 6300
F 0 "R5" V 1880 6300 50  0000 C CNN
F 1 "460" V 1800 6300 50  0000 C CNN
F 2 "" H 1800 6300 60  0001 C CNN
F 3 "" H 1800 6300 60  0001 C CNN
	1    1800 6300
	0    -1   -1   0   
$EndComp
Text GLabel 1450 6300 0    60   Input ~ 0
LED2
Text GLabel 1850 2550 2    60   Input ~ 0
SDA
Text GLabel 1850 2450 2    60   Input ~ 0
SCL
Text GLabel 7900 5700 2    60   Input ~ 0
SCL
Text GLabel 7900 5600 2    60   Input ~ 0
SDA
Text GLabel 3850 5700 0    60   Input ~ 0
D-
Text GLabel 3850 5600 0    60   Input ~ 0
D+
$Comp
L CONN_4 P1
U 1 1 50AF52FD
P 1200 2500
F 0 "P1" V 1150 2500 50  0000 C CNN
F 1 "I2C" V 1250 2500 50  0000 C CNN
F 2 "" H 1200 2500 60  0001 C CNN
F 3 "" H 1200 2500 60  0001 C CNN
	1    1200 2500
	-1   0    0    -1  
$EndComp
$Comp
L R R1
U 1 1 50AF52FC
P 1650 1900
F 0 "R1" V 1730 1900 50  0000 C CNN
F 1 "3.3k" V 1650 1900 50  0000 C CNN
F 2 "" H 1650 1900 60  0001 C CNN
F 3 "" H 1650 1900 60  0001 C CNN
	1    1650 1900
	1    0    0    -1  
$EndComp
$Comp
L R R2
U 1 1 50AF52FB
P 1800 1900
F 0 "R2" V 1880 1900 50  0000 C CNN
F 1 "3.3k" V 1800 1900 50  0000 C CNN
F 2 "" H 1800 1900 60  0001 C CNN
F 3 "" H 1800 1900 60  0001 C CNN
	1    1800 1900
	1    0    0    -1  
$EndComp
$Comp
L +3.3V #PWR012
U 1 1 50AF52FA
P 1650 1200
F 0 "#PWR012" H 1650 1160 30  0001 C CNN
F 1 "+3.3V" H 1650 1310 30  0000 C CNN
F 2 "" H 1650 1200 60  0001 C CNN
F 3 "" H 1650 1200 60  0001 C CNN
	1    1650 1200
	1    0    0    -1  
$EndComp
Text GLabel 5750 2900 1    60   Input ~ 0
INF
Text GLabel 8650 7000 0    60   Input ~ 0
INF
$Comp
L CONN_3 K10
U 1 1 50AF50FA
P 9050 6900
F 0 "K10" V 9000 6900 50  0000 C CNN
F 1 "Infrared" V 9100 6900 40  0000 C CNN
F 2 "" H 9050 6900 60  0001 C CNN
F 3 "" H 9050 6900 60  0001 C CNN
	1    9050 6900
	1    0    0    1   
$EndComp
Text HLabel 6250 7100 3    60   Input ~ 0
SS8
Text HLabel 5950 7100 3    60   Input ~ 0
SS7
Text HLabel 5850 7100 3    60   Input ~ 0
SS6
Text HLabel 5750 7100 3    60   Input ~ 0
SS5
$Comp
L GND3V3 #PWR014
U 1 1 50AF4174
P 1650 5050
F 0 "#PWR014" H 1650 5050 40  0001 C CNN
F 1 "GND3V3" H 1650 4980 50  0000 C CNN
F 2 "" H 1650 5050 60  0001 C CNN
F 3 "" H 1650 5050 60  0001 C CNN
	1    1650 5050
	1    0    0    -1  
$EndComp
$Comp
L GND3V3 #PWR015
U 1 1 50AF4154
P 8700 6200
F 0 "#PWR015" H 8700 6200 40  0001 C CNN
F 1 "GND3V3" H 8700 6130 50  0000 C CNN
F 2 "" H 8700 6200 60  0001 C CNN
F 3 "" H 8700 6200 60  0001 C CNN
	1    8700 6200
	1    0    0    -1  
$EndComp
$Comp
L GND3V3 #PWR016
U 1 1 50AF4110
P 1750 3900
F 0 "#PWR016" H 1750 3900 40  0001 C CNN
F 1 "GND3V3" H 1750 3830 50  0000 C CNN
F 2 "" H 1750 3900 60  0001 C CNN
F 3 "" H 1750 3900 60  0001 C CNN
	1    1750 3900
	1    0    0    -1  
$EndComp
$Comp
L GND3V3 #PWR017
U 1 1 50AF40F6
P 9750 4800
F 0 "#PWR017" H 9750 4800 40  0001 C CNN
F 1 "GND3V3" H 9750 4730 50  0000 C CNN
F 2 "" H 9750 4800 60  0001 C CNN
F 3 "" H 9750 4800 60  0001 C CNN
	1    9750 4800
	0    -1   -1   0   
$EndComp
$Comp
L GND3V3 #PWR018
U 1 1 50AF40EF
P 9750 5500
F 0 "#PWR018" H 9750 5500 40  0001 C CNN
F 1 "GND3V3" H 9750 5430 50  0000 C CNN
F 2 "" H 9750 5500 60  0001 C CNN
F 3 "" H 9750 5500 60  0001 C CNN
	1    9750 5500
	0    -1   -1   0   
$EndComp
$Comp
L GND3V3 #PWR019
U 1 1 50AF40D1
P 2650 6100
F 0 "#PWR019" H 2650 6100 40  0001 C CNN
F 1 "GND3V3" H 2650 6030 50  0000 C CNN
F 2 "" H 2650 6100 60  0001 C CNN
F 3 "" H 2650 6100 60  0001 C CNN
	1    2650 6100
	1    0    0    -1  
$EndComp
$Comp
L GND3V3 #PWR020
U 1 1 50AF40CF
P 5700 7600
F 0 "#PWR020" H 5700 7600 40  0001 C CNN
F 1 "GND3V3" H 5700 7530 50  0000 C CNN
F 2 "" H 5700 7600 60  0001 C CNN
F 3 "" H 5700 7600 60  0001 C CNN
	1    5700 7600
	1    0    0    -1  
$EndComp
$Comp
L GND3V3 #PWR021
U 1 1 50AF40C9
P 5250 7650
F 0 "#PWR021" H 5250 7650 40  0001 C CNN
F 1 "GND3V3" H 5250 7580 50  0000 C CNN
F 2 "" H 5250 7650 60  0001 C CNN
F 3 "" H 5250 7650 60  0001 C CNN
	1    5250 7650
	1    0    0    -1  
$EndComp
$Comp
L GND3V3 #PWR022
U 1 1 50AF40C0
P 3650 5250
F 0 "#PWR022" H 3650 5250 40  0001 C CNN
F 1 "GND3V3" H 3650 5180 50  0000 C CNN
F 2 "" H 3650 5250 60  0001 C CNN
F 3 "" H 3650 5250 60  0001 C CNN
	1    3650 5250
	1    0    0    -1  
$EndComp
$Comp
L GND3V3 #PWR023
U 1 1 50AF40A8
P 7200 2750
F 0 "#PWR023" H 7200 2750 40  0001 C CNN
F 1 "GND3V3" H 7200 2680 50  0000 C CNN
F 2 "" H 7200 2750 60  0001 C CNN
F 3 "" H 7200 2750 60  0001 C CNN
	1    7200 2750
	1    0    0    -1  
$EndComp
$Comp
L GND3V3 #PWR024
U 1 1 50AF409E
P 6200 2600
F 0 "#PWR024" H 6200 2600 40  0001 C CNN
F 1 "GND3V3" H 6200 2530 50  0000 C CNN
F 2 "" H 6200 2600 60  0001 C CNN
F 3 "" H 6200 2600 60  0001 C CNN
	1    6200 2600
	1    0    0    -1  
$EndComp
Text Label 3850 4400 0    60   ~ 0
DIG.4
Text Label 3850 4300 0    60   ~ 0
G
Text Label 5550 2900 1    60   ~ 0
C
Text Label 5450 2900 1    60   ~ 0
DP
Text Label 3850 4800 0    60   ~ 0
F
Text Label 3850 5000 0    60   ~ 0
A
Text Label 4000 5300 0    60   ~ 0
DIG.1
Entry Wire Line
	5350 2700 5450 2800
Text Label 3550 600  0    60   ~ 0
E
Text Label 3550 700  0    60   ~ 0
D
Text Label 3550 800  0    60   ~ 0
DP
Text Label 3550 900  0    60   ~ 0
C
Text Label 3550 1000 0    60   ~ 0
G
Text Label 3550 1100 0    60   ~ 0
DIG.4
Text Label 3550 1200 0    60   ~ 0
B
Text Label 3550 1300 0    60   ~ 0
DIG.3
Text Label 3550 1400 0    60   ~ 0
DIG.2
Text Label 3550 1500 0    60   ~ 0
F
Text Label 3550 1600 0    60   ~ 0
A
Text Label 3550 1700 0    60   ~ 0
DIG.1
Text Label 5250 2900 1    60   ~ 0
E
Text Label 5350 2900 1    60   ~ 0
D
Text Label 3850 4500 0    60   ~ 0
B
Text Label 3850 4600 0    60   ~ 0
DIG.3
Text Label 3850 4700 0    60   ~ 0
DIG.2
Text GLabel 6550 7150 3    60   Input ~ 0
LED2
Text GLabel 1450 6050 0    60   Input ~ 0
LED1
$Comp
L R R4
U 1 1 4FBC7073
P 1800 6050
F 0 "R4" V 1880 6050 50  0000 C CNN
F 1 "460" V 1800 6050 50  0000 C CNN
F 2 "" H 1800 6050 60  0001 C CNN
F 3 "" H 1800 6050 60  0001 C CNN
	1    1800 6050
	0    -1   -1   0   
$EndComp
$Comp
L LED D2
U 1 1 4FBC7072
P 2350 6050
F 0 "D2" H 2350 6150 50  0000 C CNN
F 1 "LED" H 2350 5950 50  0000 C CNN
F 2 "" H 2350 6050 60  0001 C CNN
F 3 "" H 2350 6050 60  0001 C CNN
	1    2350 6050
	1    0    0    -1  
$EndComp
Entry Wire Line
	5150 2700 5250 2800
Entry Wire Line
	3450 4600 3550 4700
Entry Wire Line
	3450 4500 3550 4600
Entry Wire Line
	3450 4400 3550 4500
Entry Wire Line
	3450 4300 3550 4400
Entry Wire Line
	3450 4200 3550 4300
Entry Wire Line
	3450 1800 3550 1700
Entry Wire Line
	3450 1700 3550 1600
Entry Wire Line
	3450 1600 3550 1500
Entry Wire Line
	3450 1500 3550 1400
Entry Wire Line
	3450 1400 3550 1300
Entry Wire Line
	3450 1300 3550 1200
Entry Wire Line
	3450 1200 3550 1100
Entry Wire Line
	3450 1100 3550 1000
Entry Wire Line
	3450 1000 3550 900 
Entry Wire Line
	3450 900  3550 800 
Entry Wire Line
	3450 800  3550 700 
Entry Wire Line
	3450 700  3550 600 
$Comp
L 7SEGMENTSX4 S2
U 1 1 4FBC6DF7
P 5550 1250
F 0 "S2" H 4500 2000 60  0000 C CNN
F 1 "7SEGMENTSX4" H 5800 500 60  0000 C CNN
F 2 "" H 5550 1250 60  0001 C CNN
F 3 "" H 5550 1250 60  0001 C CNN
	1    5550 1250
	1    0    0    -1  
$EndComp
Text GLabel 6750 7150 3    60   Input ~ 0
Rx
$Comp
L SPEAKER SP1
U 1 1 4FBC6991
P 9100 5900
F 0 "SP1" H 9000 6150 70  0000 C CNN
F 1 "SPEAKER" H 9000 5650 70  0000 C CNN
F 2 "" H 9100 5900 60  0001 C CNN
F 3 "" H 9100 5900 60  0001 C CNN
	1    9100 5900
	1    0    0    -1  
$EndComp
Text HLabel 5650 7100 3    60   Input ~ 0
SS4
Text HLabel 4050 5800 0    60   Input ~ 0
SS3
Text HLabel 4050 5500 0    60   Input ~ 0
SS2
Text HLabel 4050 5400 0    60   Input ~ 0
SS1
Text GLabel 6450 7150 3    60   Input ~ 0
LED1
$Comp
L SW_PUSH SW1
U 1 1 4FBC63BD
P 7500 2550
F 0 "SW1" H 7650 2660 50  0000 C CNN
F 1 "SW_PUSH" H 7500 2470 50  0000 C CNN
F 2 "" H 7500 2550 60  0001 C CNN
F 3 "" H 7500 2550 60  0001 C CNN
	1    7500 2550
	1    0    0    -1  
$EndComp
Text GLabel 7900 5400 2    60   Input ~ 0
PGD
Text GLabel 7900 4900 2    60   Input ~ 0
PGC
$Comp
L R R3
U 1 1 4FBC6344
P 2250 3500
F 0 "R3" V 2330 3500 50  0000 C CNN
F 1 "3.3k" V 2250 3500 50  0000 C CNN
F 2 "" H 2250 3500 60  0001 C CNN
F 3 "" H 2250 3500 60  0001 C CNN
	1    2250 3500
	-1   0    0    1   
$EndComp
$Comp
L +3.3V #PWR025
U 1 1 4FBC6343
P 2250 3200
F 0 "#PWR025" H 2250 3160 30  0001 C CNN
F 1 "+3.3V" H 2250 3310 30  0000 C CNN
F 2 "" H 2250 3200 60  0001 C CNN
F 3 "" H 2250 3200 60  0001 C CNN
	1    2250 3200
	1    0    0    -1  
$EndComp
$Comp
L CONN_5 P4
U 1 1 4FBC6342
P 1200 3650
F 0 "P4" V 1150 3650 50  0000 C CNN
F 1 "ICSP" V 1250 3650 50  0000 C CNN
F 2 "" H 1200 3650 60  0001 C CNN
F 3 "" H 1200 3650 60  0001 C CNN
	1    1200 3650
	-1   0    0    1   
$EndComp
Text GLabel 1700 3550 2    60   Input ~ 0
PGD
Text GLabel 1700 3450 2    60   Input ~ 0
PGC
$Comp
L +3.3V #PWR026
U 1 1 4FBC6340
P 2050 3400
F 0 "#PWR026" H 2050 3360 30  0001 C CNN
F 1 "+3.3V" H 2050 3510 30  0000 C CNN
F 2 "" H 2050 3400 60  0001 C CNN
F 3 "" H 2050 3400 60  0001 C CNN
	1    2050 3400
	1    0    0    -1  
$EndComp
Text GLabel 2500 3850 2    60   Input ~ 0
MCLR
Text GLabel 2100 4800 2    60   Input ~ 0
Rx
$Comp
L CONN_4 P2
U 1 1 4FBC633D
P 1200 4850
F 0 "P2" V 1150 4850 50  0000 C CNN
F 1 "UART" V 1250 4850 50  0000 C CNN
F 2 "" H 1200 4850 60  0001 C CNN
F 3 "" H 1200 4850 60  0001 C CNN
	1    1200 4850
	-1   0    0    1   
$EndComp
NoConn ~ 1550 4700
$Comp
L CRYSTAL X1
U 1 1 4FB621F1
P 9100 5150
F 0 "X1" H 9100 5300 60  0000 C CNN
F 1 "CRYSTAL" H 9100 5000 60  0000 C CNN
F 2 "" H 9100 5150 60  0001 C CNN
F 3 "" H 9100 5150 60  0001 C CNN
	1    9100 5150
	0    1    -1   0   
$EndComp
$Comp
L C C10
U 1 1 4FB621EF
P 9450 4800
F 0 "C10" H 9500 4900 50  0000 L CNN
F 1 "22pF" H 9500 4700 50  0000 L CNN
F 2 "" H 9450 4800 60  0001 C CNN
F 3 "" H 9450 4800 60  0001 C CNN
	1    9450 4800
	0    1    -1   0   
$EndComp
$Comp
L C C11
U 1 1 4FB621EE
P 9450 5500
F 0 "C11" H 9500 5600 50  0000 L CNN
F 1 "22pF" H 9500 5400 50  0000 L CNN
F 2 "" H 9450 5500 60  0001 C CNN
F 3 "" H 9450 5500 60  0001 C CNN
	1    9450 5500
	0    1    -1   0   
$EndComp
Text GLabel 3800 4900 0    60   Input ~ 0
MCLR
$Comp
L C C5
U 1 1 4FB621E6
P 3900 5200
F 0 "C5" H 3950 5300 50  0000 L CNN
F 1 "10uF" H 3950 5100 50  0000 L CNN
F 2 "" H 3900 5200 60  0001 C CNN
F 3 "" H 3900 5200 60  0001 C CNN
	1    3900 5200
	0    -1   -1   0   
$EndComp
$Comp
L C C6
U 1 1 4FB621E4
P 5250 7400
F 0 "C6" H 5300 7500 50  0000 L CNN
F 1 "0.1uF" H 5300 7300 50  0000 L CNN
F 2 "" H 5250 7400 60  0001 C CNN
F 3 "" H 5250 7400 60  0001 C CNN
	1    5250 7400
	1    0    0    -1  
$EndComp
$Comp
L +3.3V #PWR027
U 1 1 4FB621E2
P 5100 7050
F 0 "#PWR027" H 5100 7010 30  0001 C CNN
F 1 "+3.3V" H 5100 7160 30  0000 C CNN
F 2 "" H 5100 7050 60  0001 C CNN
F 3 "" H 5100 7050 60  0001 C CNN
	1    5100 7050
	1    0    0    -1  
$EndComp
$Comp
L +3.3V #PWR028
U 1 1 4FB621E0
P 6250 7550
F 0 "#PWR028" H 6250 7510 30  0001 C CNN
F 1 "+3.3V" H 6250 7660 30  0000 C CNN
F 2 "" H 6250 7550 60  0001 C CNN
F 3 "" H 6250 7550 60  0001 C CNN
	1    6250 7550
	1    0    0    -1  
$EndComp
$Comp
L C C8
U 1 1 4FB621DD
P 6000 2400
F 0 "C8" H 6050 2500 50  0000 L CNN
F 1 "1uF" H 6050 2300 50  0000 L CNN
F 2 "" H 6000 2400 60  0001 C CNN
F 3 "" H 6000 2400 60  0001 C CNN
	1    6000 2400
	0    1    1    0   
$EndComp
$Comp
L +3.3V #PWR029
U 1 1 4FB621DC
P 5750 2300
F 0 "#PWR029" H 5750 2260 30  0001 C CNN
F 1 "+3.3V" H 5750 2410 30  0000 C CNN
F 2 "" H 5750 2300 60  0001 C CNN
F 3 "" H 5750 2300 60  0001 C CNN
	1    5750 2300
	1    0    0    -1  
$EndComp
Wire Wire Line
	8700 6200 8700 6000
Wire Wire Line
	2000 5300 2000 5350
Wire Wire Line
	5450 7150 5100 7150
Wire Wire Line
	5450 7150 5450 7050
Connection ~ 9100 3500
Wire Wire Line
	9100 3450 9100 3500
Wire Wire Line
	9100 2900 9100 2950
Wire Wire Line
	6350 7150 6350 7050
Wire Wire Line
	1650 1200 1650 1300
Wire Wire Line
	7900 3100 7900 4300
Wire Wire Line
	5350 2950 5350 2800
Wire Wire Line
	1750 3900 1750 3650
Wire Wire Line
	8150 5350 8650 5350
Wire Wire Line
	8150 4950 8650 4950
Connection ~ 6150 7550
Connection ~ 5700 7550
Wire Wire Line
	6050 7050 6050 7400
Wire Wire Line
	6050 7400 5700 7400
Wire Wire Line
	5700 7400 5700 7600
Wire Wire Line
	6250 7550 6150 7550
Wire Wire Line
	5850 7050 5850 7100
Wire Wire Line
	6350 2900 6350 2950
Wire Wire Line
	6150 2900 6150 2950
Wire Wire Line
	5650 2900 5650 2950
Wire Wire Line
	7850 4700 7900 4700
Wire Wire Line
	7850 4500 7900 4500
Wire Wire Line
	4050 5800 4150 5800
Wire Wire Line
	5550 2800 5550 2950
Wire Wire Line
	4050 5400 4150 5400
Wire Wire Line
	3550 5000 4150 5000
Wire Wire Line
	6550 7050 6550 7150
Wire Wire Line
	5750 2900 5750 2950
Wire Wire Line
	2650 6350 2650 6300
Wire Wire Line
	2650 6300 2550 6300
Wire Wire Line
	1450 6300 1550 6300
Wire Wire Line
	2050 6300 2150 6300
Wire Wire Line
	7850 5700 7900 5700
Connection ~ 1650 1600
Wire Wire Line
	1800 1650 1800 1600
Wire Wire Line
	1800 1600 1650 1600
Wire Wire Line
	1550 2350 1550 2150
Wire Wire Line
	1550 2150 1450 2150
Wire Wire Line
	1450 2150 1450 2200
Connection ~ 1650 2550
Wire Wire Line
	1650 2150 1650 2550
Wire Wire Line
	1550 2550 1850 2550
Wire Wire Line
	1550 2450 1850 2450
Wire Wire Line
	1800 2150 1800 2450
Connection ~ 1800 2450
Wire Wire Line
	8400 6800 8400 6700
Wire Wire Line
	8400 6700 8550 6700
Wire Wire Line
	8550 6700 8550 6900
Wire Wire Line
	8550 6900 8700 6900
Wire Wire Line
	3750 1700 3550 1700
Wire Wire Line
	3750 1500 3550 1500
Wire Wire Line
	3750 1300 3550 1300
Wire Wire Line
	3750 1100 3550 1100
Wire Wire Line
	3750 900  3550 900 
Wire Wire Line
	3750 700  3550 700 
Wire Wire Line
	4150 4300 3550 4300
Wire Wire Line
	4150 4500 3550 4500
Wire Wire Line
	4150 4700 3550 4700
Wire Wire Line
	4150 5200 4100 5200
Wire Wire Line
	6750 7050 6750 7150
Wire Wire Line
	7850 5800 8800 5800
Wire Wire Line
	8150 5350 8150 5300
Wire Wire Line
	8150 5300 7850 5300
Wire Wire Line
	8150 4950 8150 5000
Wire Wire Line
	8150 5000 7850 5000
Wire Wire Line
	1550 5000 1650 5000
Wire Wire Line
	1600 3750 2050 3750
Wire Wire Line
	1600 3450 1700 3450
Wire Wire Line
	1600 3550 1700 3550
Wire Wire Line
	1750 3650 1600 3650
Wire Wire Line
	2250 3750 2250 3850
Wire Wire Line
	1550 4900 1700 4900
Wire Wire Line
	2500 3850 1600 3850
Connection ~ 2250 3850
Wire Wire Line
	6200 2550 6050 2550
Wire Wire Line
	6050 2550 6050 2950
Wire Wire Line
	5800 2400 5750 2400
Wire Wire Line
	5100 7150 5100 7050
Wire Wire Line
	3850 5600 4150 5600
Wire Wire Line
	4150 4900 3800 4900
Wire Wire Line
	9650 4800 9750 4800
Connection ~ 9100 4800
Wire Wire Line
	9100 4850 9100 4800
Wire Wire Line
	9100 5450 9100 5500
Connection ~ 9100 5500
Wire Wire Line
	9750 5500 9650 5500
Wire Wire Line
	3850 5700 4150 5700
Wire Wire Line
	5250 7200 5250 7050
Connection ~ 5250 7150
Wire Wire Line
	5750 2300 5750 2550
Wire Wire Line
	5750 2550 5950 2550
Wire Wire Line
	5950 2550 5950 2950
Connection ~ 5750 2400
Wire Wire Line
	6200 2600 6200 2400
Connection ~ 6200 2550
Wire Wire Line
	7850 4900 7900 4900
Wire Wire Line
	7850 5400 7900 5400
Wire Wire Line
	5250 7650 5250 7600
Wire Wire Line
	8700 6000 8800 6000
Wire Wire Line
	6650 7050 6650 7150
Wire Wire Line
	4150 5100 3650 5100
Wire Wire Line
	3650 5100 3650 5250
Wire Wire Line
	3700 5200 3650 5200
Connection ~ 3650 5200
Wire Wire Line
	4150 4600 3550 4600
Wire Wire Line
	4150 4400 3550 4400
Wire Wire Line
	3750 600  3550 600 
Wire Wire Line
	3750 800  3550 800 
Wire Wire Line
	3750 1000 3550 1000
Wire Wire Line
	3750 1200 3550 1200
Wire Wire Line
	3750 1400 3550 1400
Wire Wire Line
	3750 1600 3550 1600
Wire Wire Line
	5250 2950 5250 2800
Wire Wire Line
	2050 6050 2150 6050
Wire Wire Line
	1450 6050 1550 6050
Wire Wire Line
	2550 6050 2650 6050
Wire Wire Line
	2650 6050 2650 6100
Wire Wire Line
	5450 2800 5450 2950
Wire Wire Line
	1650 5000 1650 5050
Wire Wire Line
	8650 7000 8700 7000
Wire Wire Line
	8700 6650 8700 6800
Wire Wire Line
	7850 5600 7900 5600
Wire Wire Line
	4150 4800 3550 4800
Wire Wire Line
	6450 7050 6450 7150
Wire Wire Line
	3550 5300 4150 5300
Wire Wire Line
	4050 5500 4150 5500
Wire Wire Line
	7850 4400 7900 4400
Wire Wire Line
	7850 4600 7900 4600
Wire Wire Line
	7850 4800 7900 4800
Wire Wire Line
	5850 2900 5850 2950
Wire Wire Line
	6250 2900 6250 2950
Wire Wire Line
	5750 7050 5750 7100
Wire Wire Line
	5950 7050 5950 7100
Wire Wire Line
	6150 7550 6150 7050
Wire Wire Line
	5750 7550 5700 7550
Wire Wire Line
	5650 7050 5650 7100
Wire Wire Line
	7900 4300 7850 4300
Wire Wire Line
	6250 7050 6250 7100
Wire Wire Line
	1550 2650 1550 2700
Wire Wire Line
	1550 2700 1650 2700
Wire Wire Line
	2050 3750 2050 3400
Wire Wire Line
	1650 1500 1650 1650
Wire Wire Line
	9250 3500 9050 3500
Wire Wire Line
	8450 3500 8450 3600
Wire Wire Line
	2250 3200 2250 3250
Wire Wire Line
	5550 7050 5550 7600
Wire Wire Line
	5550 7600 5250 7600
Connection ~ 5250 7600
Wire Wire Line
	1550 4800 2100 4800
Connection ~ 2000 4800
Wire Wire Line
	7900 5500 7850 5500
Wire Wire Line
	9000 4800 9250 4800
Wire Wire Line
	9000 5500 9250 5500
Text GLabel 7900 5100 2    60   Input ~ 0
OSC2
Connection ~ 8400 5350
Wire Wire Line
	8400 5000 8400 4950
Connection ~ 8400 4950
Wire Wire Line
	7850 5100 7900 5100
Text GLabel 7900 5200 2    60   Input ~ 0
OSC1
Wire Wire Line
	7850 5200 7900 5200
Text GLabel 9000 4800 0    60   Input ~ 0
OSC2
Text GLabel 9000 5500 0    60   Input ~ 0
OSC1
$Comp
L PIC18F67J94 U?
U 1 1 54046439
P 5950 5000
F 0 "U?" H 6350 5100 60  0000 C CNN
F 1 "PIC18F67J94" H 6000 5100 60  0000 C CNN
F 2 "~" H 5500 4850 60  0000 C CNN
F 3 "~" H 5500 4850 60  0000 C CNN
	1    5950 5000
	1    0    0    -1  
$EndComp
Wire Wire Line
	7900 2500 7900 2600
Wire Wire Line
	7800 2550 7900 2550
Connection ~ 7900 2550
Wire Wire Line
	7200 2550 7200 2750
Wire Bus Line
	3450 700  3450 5200
Wire Bus Line
	3550 2700 5450 2700
Entry Bus Bus
	3450 2600 3550 2700
Text GLabel 6450 2900 1    60   Input ~ 0
RD4
Text GLabel 6550 2900 1    60   Input ~ 0
RD5
Text GLabel 6650 2900 1    60   Input ~ 0
RD6
Text GLabel 6750 2900 1    60   Input ~ 0
RD7
Wire Wire Line
	6450 2950 6450 2900
Wire Wire Line
	6550 2950 6550 2900
Wire Wire Line
	6650 2950 6650 2900
Wire Wire Line
	6750 2950 6750 2900
$EndSCHEMATC
