M48
;DRILL file {Pcbnew (2013-07-07 BZR 4022)-stable} date 10/11/2560 20:38:32
;FORMAT={-:-/ absolute / inch / decimal}
FMAT,2
INCH,TZ
T1C0.020
T2C0.022
T3C0.032
T4C0.036
T5C0.040
T6C0.044
T7C0.048
T8C0.050
%
G90
G05
M72
T1
X4.319Y-3.224
X4.35Y-2.825
X4.4Y-3.12
X4.453Y-3.031
X4.55Y-3.325
X4.5507Y-3.2412
X4.575Y-4.35
X4.601Y-2.636
X4.643Y-3.049
X4.643Y-3.157
X4.684Y-4.57
X4.769Y-3.002
X4.795Y-4.012
X4.8Y-3.121
X4.8Y-3.171
X4.8Y-3.225
X4.8Y-3.31
X4.8719Y-3.365
X4.875Y-2.825
X4.875Y-3.24
X4.925Y-3.24
X4.946Y-2.675
X5.055Y-4.095
X5.131Y-3.251
X5.1734Y-3.7671
X5.1734Y-3.8156
X5.1734Y-3.8641
X5.1734Y-3.9131
X5.178Y-2.676
X5.203Y-3.274
X5.244Y-4.013
X5.25Y-2.825
X5.267Y-4.337
X5.305Y-3.276
X5.328Y-3.9
X5.4111Y-3.4222
X5.427Y-4.301
X5.459Y-3.309
X5.499Y-3.241
X5.506Y-2.636
X5.5376Y-3.7742
X5.5376Y-3.8227
X5.5376Y-3.8712
X5.5376Y-3.9207
X5.548Y-3.069
X5.55Y-3.241
X5.551Y-3.341
X5.6271Y-3.4547
X5.6385Y-4.093
X5.66Y-3.025
X5.7106Y-3.063
X5.7106Y-3.1112
X5.711Y-3.671
X5.726Y-3.788
X5.726Y-3.838
X5.726Y-3.888
X5.75Y-3.321
X5.775Y-2.825
X5.815Y-3.296
X5.815Y-3.345
X5.8425Y-3.4705
X5.843Y-3.519
X5.843Y-3.6215
X5.85Y-2.66
X5.852Y-3.26
X5.863Y-4.329
X5.8635Y-3.8384
X5.873Y-3.403
X5.889Y-3.714
X5.893Y-3.491
X5.8945Y-3.54
X5.91Y-3.622
X5.9125Y-3.8382
X5.959Y-3.391
X5.992Y-3.564
X6.Y-3.714
X6.026Y-3.392
X6.026Y-3.4415
X6.0384Y-3.849
X6.0384Y-3.8979
X6.041Y-3.564
X6.074Y-3.694
X6.102Y-3.435
X6.15Y-3.435
X6.1565Y-3.72
X6.1575Y-3.5475
X6.1875Y-4.2755
X6.191Y-3.782
X6.208Y-3.23
X6.23Y-3.367
X6.233Y-3.817
X6.25Y-3.05
X6.282Y-3.367
X6.282Y-3.9435
X6.29Y-4.256
X6.3Y-3.5345
X6.3Y-3.6
X6.3Y-3.65
X6.3Y-3.7
X6.3Y-3.782
X6.3Y-3.83
X6.322Y-3.4055
X6.322Y-3.4535
X6.33Y-3.9435
X6.355Y-4.257
X6.389Y-2.788
X6.436Y-4.013
X6.436Y-4.084
X6.453Y-3.111
X6.465Y-3.23
X6.5148Y-2.9823
X6.5149Y-2.7587
X6.53Y-3.297
X6.539Y-3.924
X6.546Y-3.23
X6.558Y-4.324
X6.578Y-3.114
X6.622Y-4.197
X6.671Y-4.147
X6.671Y-4.197
X6.675Y-3.3985
X6.675Y-3.45
X6.719Y-4.004
X6.719Y-4.147
X6.731Y-4.318
X6.7345Y-3.23
X6.7368Y-3.8082
X6.76Y-4.173
X6.774Y-3.39
X6.7775Y-3.7145
X6.789Y-4.318
X6.8Y-3.346
X6.8Y-3.4335
X6.8Y-3.85
X6.8075Y-2.675
X6.841Y-4.285
X6.86Y-3.9255
X6.9Y-2.675
X6.9095Y-4.0085
X6.955Y-3.328
X6.9735Y-3.432
X6.987Y-3.154
X6.995Y-3.754
X7.005Y-3.3285
X7.0125Y-2.7145
X7.049Y-4.391
X7.064Y-2.715
X7.071Y-3.231
X7.075Y-4.15
X7.075Y-4.2
X7.075Y-4.25
X7.075Y-4.3
X7.075Y-4.35
X7.0845Y-3.7765
X7.0845Y-3.8255
X7.1025Y-3.4704
X7.103Y-3.409
X7.15Y-2.675
X7.35Y-4.1775
X7.3505Y-4.087
X7.434Y-4.075
T3
X4.35Y-3.96
X4.35Y-4.24
X4.6828Y-3.9761
X4.6828Y-4.0548
X4.6828Y-4.1336
X4.6828Y-4.2123
X4.8219Y-3.4199
X4.8219Y-3.7191
X4.8978Y-3.9761
X4.8978Y-4.0548
X4.8978Y-4.1336
X4.8978Y-4.2123
X4.9219Y-3.4199
X4.9219Y-3.7191
X5.0219Y-3.4199
X5.0219Y-3.7191
X5.1128Y-3.9761
X5.1128Y-4.0548
X5.1128Y-4.1336
X5.1128Y-4.2123
X5.1219Y-3.4199
X5.1219Y-3.7191
X5.2219Y-3.4199
X5.2219Y-3.7191
X5.3219Y-3.4199
X5.3219Y-3.7191
X5.3278Y-3.9761
X5.3278Y-4.0548
X5.3278Y-4.1336
X5.3278Y-4.2123
X5.5428Y-3.9761
X5.5428Y-4.0548
X5.5428Y-4.1336
X5.5428Y-4.2123
X5.7578Y-3.9761
X5.7578Y-4.0548
X5.7578Y-4.1336
X5.7578Y-4.2123
X5.9728Y-3.9761
X5.9728Y-4.0548
X5.9728Y-4.1336
X5.9728Y-4.2123
X6.1878Y-3.9761
X6.1878Y-4.0548
X6.1878Y-4.1336
X6.1878Y-4.2123
X7.04Y-3.4319
X7.04Y-3.5106
X7.04Y-3.5894
X7.04Y-3.6681
X7.145Y-2.8569
X7.145Y-2.9356
X7.145Y-3.0144
X7.145Y-3.0931
X7.365Y-2.8569
X7.365Y-2.9356
X7.365Y-3.0144
X7.365Y-3.0931
T4
X4.44Y-4.375
X4.44Y-4.475
X4.44Y-4.575
T5
X4.25Y-2.8
X4.25Y-2.9
X4.25Y-3.
X4.881Y-4.47
X4.881Y-4.57
X4.975Y-2.8
X4.975Y-2.9
X4.975Y-3.
X5.15Y-2.8
X5.15Y-2.9
X5.15Y-3.
X5.25Y-4.45
X5.25Y-4.55
X5.35Y-4.45
X5.35Y-4.55
X5.45Y-4.45
X5.45Y-4.55
X5.55Y-4.45
X5.55Y-4.55
X5.65Y-4.45
X5.65Y-4.55
X5.75Y-4.45
X5.75Y-4.55
X5.85Y-4.45
X5.85Y-4.55
X5.875Y-2.8
X5.875Y-2.9
X5.875Y-3.
X5.95Y-4.45
X5.95Y-4.55
X6.05Y-4.45
X6.05Y-4.55
X6.1Y-2.735
X6.1Y-3.235
X6.15Y-4.45
X6.15Y-4.55
X6.25Y-4.45
X6.25Y-4.55
X6.3Y-2.735
X6.3Y-3.235
X6.35Y-4.45
X6.35Y-4.55
X6.45Y-4.45
X6.45Y-4.55
X6.55Y-4.45
X6.55Y-4.55
X6.64Y-2.82
X6.64Y-2.92
X6.64Y-3.02
X6.65Y-4.45
X6.65Y-4.55
X6.75Y-4.45
X6.75Y-4.55
X6.84Y-2.88
X6.84Y-2.96
X6.84Y-3.04
X6.85Y-4.45
X6.85Y-4.55
X6.92Y-2.88
X6.92Y-2.96
X6.92Y-3.04
X6.95Y-4.45
X6.95Y-4.55
X7.05Y-4.45
X7.05Y-4.55
X7.15Y-3.975
X7.15Y-4.45
X7.15Y-4.55
X7.225Y-3.35
X7.225Y-3.45
X7.225Y-3.55
X7.225Y-3.65
X7.225Y-3.75
X7.25Y-3.975
X7.35Y-3.975
T6
X4.525Y-2.8
X4.525Y-2.8787
X4.725Y-2.8
X4.725Y-2.8787
X5.425Y-2.8
X5.425Y-2.8787
X5.625Y-2.8
X5.625Y-2.8787
T7
X6.88Y-2.785
X6.88Y-3.135
T8
X5.9911Y-2.57
X6.1289Y-2.57
X6.5611Y-2.57
X6.6989Y-2.57
T2
X6.897Y-2.4793G85X6.897Y-2.5207
G05
X7.153Y-2.4793G85X7.153Y-2.5207
G05
T0
M30
