EESchema Schematic File Version 2
LIBS:power
LIBS:device
LIBS:transistors
LIBS:conn
LIBS:linear
LIBS:regul
LIBS:74xx
LIBS:cmos4000
LIBS:adc-dac
LIBS:memory
LIBS:xilinx
LIBS:special
LIBS:microcontrollers
LIBS:dsp
LIBS:microchip
LIBS:analog_switches
LIBS:motorola
LIBS:texas
LIBS:intel
LIBS:audio
LIBS:interface
LIBS:digital-audio
LIBS:philips
LIBS:display
LIBS:cypress
LIBS:siliconi
LIBS:opto
LIBS:atmel
LIBS:contrib
LIBS:valves
LIBS:microchip1
LIBS:UND2916B
LIBS:LB1836M
LIBS:vrpi
LIBS:sd-cache
EELAYER 27 0
EELAYER END
$Descr A4 11693 8268
encoding utf-8
Sheet 4 6
Title ""
Date "10 nov 2017"
Rev ""
Comp ""
Comment1 ""
Comment2 ""
Comment3 ""
Comment4 ""
$EndDescr
Text GLabel 6300 2050 0    60   Input ~ 0
CLK_SS
$Comp
L GND3V3 #PWR043
U 1 1 51D53EFD
P 6900 6500
F 0 "#PWR043" H 6900 6500 40  0001 C CNN
F 1 "GND3V3" H 6900 6430 50  0000 C CNN
F 2 "" H 6900 6500 60  0001 C CNN
F 3 "" H 6900 6500 60  0001 C CNN
	1    6900 6500
	1    0    0    -1  
$EndComp
$Comp
L CONN_4 P12
U 1 1 51D53ECD
P 7350 6300
F 0 "P12" V 7300 6300 50  0000 C CNN
F 1 "SS8" V 7400 6300 50  0000 C CNN
F 2 "" H 7350 6300 60  0001 C CNN
F 3 "" H 7350 6300 60  0001 C CNN
	1    7350 6300
	1    0    0    -1  
$EndComp
$Comp
L CONN_4 P11
U 1 1 51D53ECB
P 7350 5700
F 0 "P11" V 7300 5700 50  0000 C CNN
F 1 "SS7" V 7400 5700 50  0000 C CNN
F 2 "" H 7350 5700 60  0001 C CNN
F 3 "" H 7350 5700 60  0001 C CNN
	1    7350 5700
	1    0    0    -1  
$EndComp
$Comp
L CONN_4 P10
U 1 1 51D53EC7
P 7350 5100
F 0 "P10" V 7300 5100 50  0000 C CNN
F 1 "SS6" V 7400 5100 50  0000 C CNN
F 2 "" H 7350 5100 60  0001 C CNN
F 3 "" H 7350 5100 60  0001 C CNN
	1    7350 5100
	1    0    0    -1  
$EndComp
$Comp
L CONN_4 P9
U 1 1 51D53EC5
P 7350 4500
F 0 "P9" V 7300 4500 50  0000 C CNN
F 1 "SS5" V 7400 4500 50  0000 C CNN
F 2 "" H 7350 4500 60  0001 C CNN
F 3 "" H 7350 4500 60  0001 C CNN
	1    7350 4500
	1    0    0    -1  
$EndComp
$Comp
L CONN_4 P8
U 1 1 51D53EC1
P 7350 3900
F 0 "P8" V 7300 3900 50  0000 C CNN
F 1 "SS4" V 7400 3900 50  0000 C CNN
F 2 "" H 7350 3900 60  0001 C CNN
F 3 "" H 7350 3900 60  0001 C CNN
	1    7350 3900
	1    0    0    -1  
$EndComp
$Comp
L CONN_4 P7
U 1 1 51D53EBE
P 7350 3300
F 0 "P7" V 7300 3300 50  0000 C CNN
F 1 "SS3" V 7400 3300 50  0000 C CNN
F 2 "" H 7350 3300 60  0001 C CNN
F 3 "" H 7350 3300 60  0001 C CNN
	1    7350 3300
	1    0    0    -1  
$EndComp
$Comp
L CONN_4 P6
U 1 1 51D53EBC
P 7350 2700
F 0 "P6" V 7300 2700 50  0000 C CNN
F 1 "SS2" V 7400 2700 50  0000 C CNN
F 2 "" H 7350 2700 60  0001 C CNN
F 3 "" H 7350 2700 60  0001 C CNN
	1    7350 2700
	1    0    0    -1  
$EndComp
$Comp
L CONN_4 P5
U 1 1 51D53EB7
P 7350 2100
F 0 "P5" V 7300 2100 50  0000 C CNN
F 1 "SS1" V 7400 2100 50  0000 C CNN
F 2 "" H 7350 2100 60  0001 C CNN
F 3 "" H 7350 2100 60  0001 C CNN
	1    7350 2100
	1    0    0    -1  
$EndComp
Text HLabel 5000 3950 1    60   Input ~ 0
SS8
Text HLabel 4900 3950 1    60   Input ~ 0
SS7
Text HLabel 4800 3950 1    60   Input ~ 0
SS6
Text HLabel 4700 3950 1    60   Input ~ 0
SS5
Text HLabel 5000 1600 1    60   Input ~ 0
SS4
Text HLabel 4900 1600 1    60   Input ~ 0
SS3
Text HLabel 4800 1600 1    60   Input ~ 0
SS2
Text HLabel 4700 1600 1    60   Input ~ 0
SS1
$Comp
L +5V #PWR044
U 1 1 5236A525
P 6700 1750
F 0 "#PWR044" H 6700 1840 20  0001 C CNN
F 1 "+5V" H 6700 1840 30  0000 C CNN
F 2 "" H 6700 1750 60  0000 C CNN
F 3 "" H 6700 1750 60  0000 C CNN
	1    6700 1750
	1    0    0    -1  
$EndComp
$Comp
L R_PACK4 RP3
U 1 1 525E706D
P 5300 1900
F 0 "RP3" H 5300 2350 40  0000 C CNN
F 1 "11k" H 5300 1850 40  0000 C CNN
F 2 "" H 5300 1900 60  0000 C CNN
F 3 "" H 5300 1900 60  0000 C CNN
	1    5300 1900
	1    0    0    1   
$EndComp
$Comp
L R_PACK4 RP1
U 1 1 525E707C
P 4400 1900
F 0 "RP1" H 4400 2350 40  0000 C CNN
F 1 "22k" H 4400 1850 40  0000 C CNN
F 2 "" H 4400 1900 60  0000 C CNN
F 3 "" H 4400 1900 60  0000 C CNN
	1    4400 1900
	-1   0    0    1   
$EndComp
$Comp
L R_PACK4 RP4
U 1 1 525E708B
P 5300 4300
F 0 "RP4" H 5300 4750 40  0000 C CNN
F 1 "11k" H 5300 4250 40  0000 C CNN
F 2 "" H 5300 4300 60  0000 C CNN
F 3 "" H 5300 4300 60  0000 C CNN
	1    5300 4300
	1    0    0    1   
$EndComp
$Comp
L R_PACK4 RP2
U 1 1 525E709A
P 4400 4300
F 0 "RP2" H 4400 4750 40  0000 C CNN
F 1 "22k" H 4400 4250 40  0000 C CNN
F 2 "" H 4400 4300 60  0000 C CNN
F 3 "" H 4400 4300 60  0000 C CNN
	1    4400 4300
	-1   0    0    1   
$EndComp
$Comp
L GND #PWR045
U 1 1 525E75DB
P 4100 2100
F 0 "#PWR045" H 4100 2100 30  0001 C CNN
F 1 "GND" H 4100 2030 30  0001 C CNN
F 2 "" H 4100 2100 60  0000 C CNN
F 3 "" H 4100 2100 60  0000 C CNN
	1    4100 2100
	0    1    1    0   
$EndComp
$Comp
L GND #PWR046
U 1 1 525E7FD2
P 4100 4500
F 0 "#PWR046" H 4100 4500 30  0001 C CNN
F 1 "GND" H 4100 4430 30  0001 C CNN
F 2 "" H 4100 4500 60  0000 C CNN
F 3 "" H 4100 4500 60  0000 C CNN
	1    4100 4500
	0    1    1    0   
$EndComp
Wire Wire Line
	5600 6150 7000 6150
Wire Wire Line
	5800 4950 7000 4950
Wire Wire Line
	5600 3750 7000 3750
Wire Wire Line
	5800 2550 7000 2550
Connection ~ 6500 2050
Connection ~ 6500 5050
Wire Wire Line
	6500 5650 7000 5650
Connection ~ 6500 3850
Wire Wire Line
	6500 4450 7000 4450
Connection ~ 6500 2650
Wire Wire Line
	6500 3250 7000 3250
Connection ~ 6700 2150
Wire Wire Line
	6700 1750 6700 6350
Connection ~ 6700 3350
Wire Wire Line
	6700 2750 7000 2750
Connection ~ 6700 4550
Wire Wire Line
	6700 3950 7000 3950
Connection ~ 6700 5750
Wire Wire Line
	6700 5150 7000 5150
Connection ~ 6900 6450
Wire Wire Line
	6900 2250 6900 6500
Connection ~ 6900 5250
Wire Wire Line
	6900 5850 7000 5850
Connection ~ 6900 4050
Wire Wire Line
	6900 4650 7000 4650
Connection ~ 6900 2850
Wire Wire Line
	6900 3450 7000 3450
Wire Wire Line
	6900 2250 7000 2250
Wire Wire Line
	6900 2850 7000 2850
Wire Wire Line
	6900 4050 7000 4050
Connection ~ 6900 3450
Wire Wire Line
	6900 5250 7000 5250
Connection ~ 6900 4650
Wire Wire Line
	6900 6450 7000 6450
Connection ~ 6900 5850
Wire Wire Line
	6700 6350 7000 6350
Wire Wire Line
	6700 5750 7000 5750
Wire Wire Line
	6700 4550 7000 4550
Connection ~ 6700 5150
Wire Wire Line
	6700 3350 7000 3350
Connection ~ 6700 3950
Wire Wire Line
	6700 2150 7000 2150
Connection ~ 6700 2750
Wire Wire Line
	6500 2650 7000 2650
Wire Wire Line
	6500 3850 7000 3850
Connection ~ 6500 3250
Wire Wire Line
	6500 5050 7000 5050
Connection ~ 6500 4450
Wire Wire Line
	6500 2050 6500 6250
Wire Wire Line
	6500 6250 7000 6250
Connection ~ 6500 5650
Wire Wire Line
	6300 2050 7000 2050
Wire Wire Line
	5700 3150 7000 3150
Wire Wire Line
	5700 5550 7000 5550
Wire Wire Line
	5800 2050 5800 2550
Wire Wire Line
	5700 3150 5700 2150
Wire Wire Line
	5600 2250 5600 3750
Wire Wire Line
	4200 1950 4150 1950
Wire Wire Line
	4150 1950 4150 2250
Wire Wire Line
	4150 2050 4200 2050
Wire Wire Line
	4150 2150 4200 2150
Connection ~ 4150 2050
Wire Wire Line
	4150 2250 4200 2250
Connection ~ 4150 2150
Wire Wire Line
	4150 2100 4100 2100
Connection ~ 4150 2100
Wire Wire Line
	5800 4450 5800 4950
Wire Wire Line
	5700 4550 5700 5550
Wire Wire Line
	5600 4650 5600 6150
Wire Wire Line
	4200 4350 4150 4350
Wire Wire Line
	4150 4350 4150 4650
Wire Wire Line
	4150 4450 4200 4450
Wire Wire Line
	4150 4550 4200 4550
Connection ~ 4150 4450
Wire Wire Line
	4150 4650 4200 4650
Connection ~ 4150 4550
Wire Wire Line
	4150 4500 4100 4500
Connection ~ 4150 4500
Wire Wire Line
	4700 3950 4700 4350
Wire Wire Line
	4800 3950 4800 4450
Wire Wire Line
	4900 3950 4900 4550
Wire Wire Line
	5000 3950 5000 4650
Wire Wire Line
	5500 2250 5600 2250
Wire Wire Line
	5700 2150 5500 2150
Wire Wire Line
	5500 2050 5800 2050
Wire Wire Line
	5500 1950 7000 1950
Wire Wire Line
	5000 1600 5000 2250
Wire Wire Line
	4600 2250 5100 2250
Wire Wire Line
	4900 1600 4900 2150
Wire Wire Line
	4600 2150 5100 2150
Wire Wire Line
	4800 1600 4800 2050
Wire Wire Line
	4600 2050 5100 2050
Wire Wire Line
	4700 1600 4700 1950
Wire Wire Line
	4600 1950 5100 1950
Connection ~ 4700 1950
Connection ~ 4800 2050
Connection ~ 4900 2150
Connection ~ 5000 2250
Wire Wire Line
	5500 4350 7000 4350
Wire Wire Line
	5500 4450 5800 4450
Wire Wire Line
	5500 4550 5700 4550
Wire Wire Line
	5500 4650 5600 4650
Wire Wire Line
	4600 4350 5100 4350
Wire Wire Line
	4600 4450 5100 4450
Wire Wire Line
	4600 4550 5100 4550
Wire Wire Line
	4600 4650 5100 4650
Connection ~ 4700 4350
Connection ~ 4800 4450
Connection ~ 4900 4550
Connection ~ 5000 4650
$EndSCHEMATC
