:040000007BEF33F06F
:08000800046ED8CF05F0E0CF33
:1000100006F00001E9CF0CF0EACF07F0E1CF08F0DD
:10002000E2CF09F0D9CF0AF0DACF0BF0F3CF12F01C
:10003000F4CF13F0FACF14F0F5CF15F0F6CF16F099
:10004000F7CF17F000C00EF001C00FF002C010F0A3
:1000500003C011F0F2AA30EF00F0F2B406EF0CF09A
:100060009DA036EF00F09EB086EF0CF09DA23CEF15
:1000700000F09EB23BEF0EF0A0A242EF00F0A1B262
:100080005BEF0EF09DAA48EF00F09EBA04EF0FF070
:10009000A0A04EEF00F0A1B08BEF0EF0A0A854EF9F
:1000A00000F0A1B899EF07F00EC000F00FC001F00A
:1000B00010C002F011C003F00CC0E9FF07C0EAFF56
:1000C000078E08C0E1FF09C0E2FF0AC0D9FF0BC0DC
:1000D000DAFF12C0F3FF13C0F4FF14C0FAFF15C01B
:1000E000F5FF16C0F6FF17C0F7FF045006C0E0FF8B
:1000F00005C0D8FF1000F76A060FF66E010EF72252
:100100000900F55012000003FFFFFFFFFFFFFFFF94
:10011000FFFFFFFFFFFFF76A260FF66E010EF722C3
:100120000900F550120040004000000000000000EF
:1001300000000000000000000000000000000000BF
:10014000000000000000F76A560FF66E010EF7225D
:100150000900F55012000600FF0901A1011901294B
:10016000081580257F7508953F81021901290875BA
:1001700008953F9102C0F76A860FF66E010EF722CE
:100180000900F55012000000F76A980FF66E010E94
:10019000F7220900F55012002000F76AAA0FF66E48
:1001A000010EF7220900F550120009022900010191
:1001B0000080FA0904000002030000000921000188
:1001C00000012220000705810340000A0705010302
:1001D00040000A00F76AE40FF66E010EF7220900EC
:1001E000F55012000100F76AF60FF66E010EF722C5
:1001F0000900F55012001200F76A080FF66E020EA1
:10020000F7220900F5501200120110010000004011
:1002100061042000000101020001F76A2A0FF66E56
:10022000020EF7220900F5501200040309040A0324
:1002300047006F0047006F00160347006F0047003C
:100240006F00200042006F00610072006400659240
:100250000F015C9562A402D06294FCD76298000101
:10026000AAEF07F0400E0401016F040E0E01486F63
:10027000100E48CE03F4E8CF02F4880E0401006F9C
:10028000046B040E076F500E066F000112000F0181
:100290004CA104D00001E6DF0F014C91629A0001ED
:1002A000B6EF07F0636A6292C0EF07F00E01549157
:1002B00053BF5481539F5351100803E2000E016E47
:1002C0001AD054A10DD0036A5351000114DFFF0866
:1002D00002E1000E01D0010E016E0E010CD00BD018
:1002E000036A5351000107DFFF0802E1000E01D04D
:1002F000010E016E0E01000112000E015351550353
:10030000F3CF01F0F4CF00F05603F3500026545120
:100310005503F3500020026E00011200036A0E0123
:1003200052514C0FE96E0F0E0320EA6EEF6A52CE67
:1003300053FE0001BBDF015228E00E01546B52CE88
:1003400053FE566B080E556F0001D7DF0E0101C03A
:10035000E9FF040E0224EA6EEF6A546B52CE53FE9C
:10036000566B080E556F0001C8DF02C054FE01C075
:1003700053FE040E0E015327000E542353CEE9FF03
:10038000040E5425EA6EEF6A00011200010E0E0100
:10039000516F51510F0807E351CE52FE0001BEDFED
:1003A0000E01512BF6D700011200286A276A0E01B0
:1003B000476B47530AE1036A4751290FE96E000E64
:1003C0000320EA6EEF6A472BF4D71B6A010E1C6EFE
:1003D0001A6A00011200629612000F015D6B5C6BDD
:1003E000636A626A5E6B4C6B0001D0DFDEDF160E63
:1003F0000F014C6F62A604D00001EDDF0F01FAD7A8
:100400009F0E5D6F3D0E5C6F659800012BDF030E44
:10041000226ECAEF07F00F015C855C9965820001CE
:10042000D4EF07F0629CDEEF07F04DCE23F0120010
:10043000236812000E014B6B275028103DE04B51F2
:100440003F083AE31D50FC0F25E2040F000168EF5E
:1004500002F026C003F02550A0DEE8CF4CFE0E01CE
:1004600019D026C003F025506EDEE8CF4CFE0E01F9
:1004700011D026C003F02550D0DEE8CF4CFE0E018F
:1004800009D026C003F02550B7DEE8CF4CFE0E01A0
:1004900001D00E01252AD8B4262A2750D8B4280620
:1004A00027064B514B2B500FE96E040EEA6ED8B065
:1004B000EA2A4CCEEFFFC0D72750281004E14B5159
:1004C000400801E01A6A4BCE4DFE0001AEDF12007B
:1004D000E824F76AF736EB0FF66E040EF7220A00EF
:1004E000F550FA6E0800F550F96E52046204720479
:1004F00082040E014A6B266A256A1D6A04011351A3
:10050000010A000109E0030A0DE0010A0FE0220AD6
:100510002BE0030A42E05DD0286A120E276E030E1C
:100520001D6E59D0286A290E276E55D0020E1D6EF9
:100530000E014A6B040112510E014A5D0BE226C006
:1005400003F02550000169DE2526000E26220E014B
:100550004A2BF0D726C003F0255000015EDE036A67
:10056000276E03C028F037D0036A0401125100013E
:100570003ADE036A256E03C026F0253C02D02652DF
:100580000AE026C003F0255008DE036A276E03C088
:1005900028F021D002D04CDF2DD0036A0401145181
:1005A0000001E9DD036A256E03C026F0253C02D078
:1005B00026520DE0010E1D6E036A04011451000164
:1005C000E3DD036A276E03C028F005D002D030DFD8
:1005D00011D02EDF0FD00401175308E1285203E198
:1005E0002750165D03E2286A16C427F0010E1A6E22
:1005F000000120DF12000E01495306E1040E226EB5
:100600000001C4DEEAD00E01050E226E040E4C6F0E
:10061000900E4B6F010E4A6F4A510F08D8A0DDD0E3
:100620004ACE52FE00017ADE0E014D6B036A4A513A
:10063000000161DDFF0867E0040E0E014D6FD890E8
:100640004A35036A000167DD0900F5CF03F00E01AA
:100650004E6F03C04FFE546B4ACE53FE566B080ECE
:10066000556F00014ADE01C051FE010E0E0101244A
:10067000016E000E0220036E01C0E9FF040E032488
:10068000EA6E4ECEEFFF546B4ACE53FE566B080E09
:10069000556F000132DE01C051FE020E0E01012431
:1006A000016E000E0220036E01C0E9FF040E032458
:1006B000EA6E4CCEECFFED524BCEEFFFD8904A35B0
:1006C000036A000128DD0900F5CF03F00E014B2776
:1006D00003504C23880E506F4FA101D050814FA37F
:1006E00001D05083546B4ACE53FE566B080E556FA3
:1006F000000103DE0E0101C0E9FF040E0224EA6ED0
:1007000050CEEFFF0001036A0E014A510001F3DCF5
:10071000FF0848E00E014D83546B4ACE53FE566BE2
:10072000080E556F0001E9DD02C052FE01C051FE06
:10073000040E0E015127000E5223020E5125016EA8
:10074000000E5221036E01C0E9FF040E0324EA6E7D
:100750004CCEECFFED524BCEEFFFD8904A35036AFA
:100760000001D9DC0900F5CF03F00E014B2703503F
:100770004C23546B4ACE53FE566B080E556F000146
:10078000BCDD02C052FE01C051FE040E0E01512715
:10079000000E522351CEE9FF040E5225EA6E400EA0
:1007A000EF6E00010E014D51060802E10E0E4D6F75
:1007B000036A4A5100019FDC010803E00E014D89E4
:1007C0000001036A0E014A514C0FE96E0F0E03201F
:1007D000EA6E4DCEEFFF4A2B1FD7000144EF04F025
:1007E00004011151000A00010DE0010A15E0020A9E
:1007F00021E0060A2CE0030A33E00E0A33E0010A86
:1008000039E049D01CC050F40401516B020E0E01B6
:100810004D6F00010ADE40D00401122D08D0010EF8
:100820001C160E014D6B000100DE03D00401000117
:10083000FFDD32D00401122D07D01C820E014D6B5A
:100840000001F3DD03D004010001F2DD25D0020E2A
:100850001A6E12C424F00E014D6B0001E6DD1CD0AF
:1008600048DE1AD01BC050F4010E0E014D6F00017E
:10087000DCDD12D00401125101080BE312C41BF09D
:1008800012C449FE0001B7D60E014D6B0001CDDD4B
:100890000401000101D0CCDD9FEF05F01BC049FE33
:1008A00004011151000A000107E00A0A0EE0010AE2
:1008B0002EE00D0A42E043D00401506B516B020E52
:1008C0000E014D6F0001B1DD3BD00E0149531CE01C
:1008D000010E495D036A00017DDC016E0401145DB7
:1008E000D8A002D00E0110D0036A1451290FE96E6E
:1008F000000E0320EA6EEFCF50F4010E0E014D6F93
:10090000000193DD03D00E01000192DD19D00E012C
:10091000495310E0036A04011451290FE96E000ED7
:100920000320EA6E12C4EFFF0E014D6B00017DDD66
:1009300003D00E0100017CDD03D0DBDD01D078DDCA
:100940009FEF05F00E014A9149BF4A81499F4AA194
:1009500019D0546B49CE53FE566B080E556F0001EB
:10096000CCDC02C04CFE01C04BFE040E0E014B2736
:10097000000E4C234BCEE9FF040E4C25EA6E880E88
:10098000EF6E0FD0546B49CE53FE566B080E556F69
:100990000001B3DC0E0101C0E9FF040E0224EA6E7F
:1009A000EF6A036A49514C0F016E0F0E032201C01A
:1009B000E9FF03C0EAFFEF9000015FEF05F00E01D1
:1009C0004A9149BF4A81499F4AA119D0546B49CEE7
:1009D00053FE566B080E556F00018FDC02C04CFEB3
:1009E00001C04BFE040E0E014B27000E4C234BCED4
:1009F000E9FF040E4C25EA6E840EEF6E10D0546BA6
:100A000049CE53FE566B080E556F000176DC0E0181
:100A100001C0E9FF040E0224EA6E840EEF6E0001AD
:100A200067EF05F00E014A9149BF4A81499F4AA1EB
:100A300019D0546B49CE53FE566B080E556F00010A
:100A40005CDC02C04DFE01C04CFE040E0E014C27C2
:100A5000000E4D234CCEE9FF040E4D25EA6EEFCF7C
:100A60004BFE10D0546B49CE53FE566B080E556F9B
:100A7000000143DC0E0101C0E9FF040E0224EA6E0E
:100A8000EFCF4BFE4BAF02D04BB502D0000E01D0E2
:100A9000010E016E000173EF05F014C453FE06DC75
:100AA00001522EE004011151010A000105E0020A81
:100AB0000BE0030A11E023D014C449FE43D70E0112
:100AC0004D6B0001B2DC1CD014C449FE78D70E0176
:100AD0004D6B0001AADC14D00401506B516B14C49F
:100AE00049FE00019FD7015204E0010E0401506F3E
:100AF0000001020E0E014D6F000197DC01D098DC61
:100B00009FEF05F004011151000192DC9FEF05F009
:100B10001A6A040110517F0B000A000107E0010A64
:100B200007E0030A07E0230A07E008D059D607D0F8
:100B3000B5D605D0B2D703D0E5D701D079DC39EFEF
:100B400007F00E01546B49CE53FE566B080E556FDD
:100B500000017DEC01F00E0101C0E9FF040E02244A
:100B6000EA6EEFCF4BFE4A51020806E14BAD02D0D0
:100B70004A6B02D0010E4A6F4A5103081CE1840EF1
:100B80004B6F546B49CE53FE566B080E556F0001E8
:100B90007DEC01F002C04FFE01C04EFE040E0E01BE
:100BA0004E27000E4F234ECEE9FF040E4F25EA6E6E
:100BB000840EEF6E07D04A2D03D0C80E4B6F02D0C3
:100BC000880E4B6FD8904935036A00018BEC00F01A
:100BD0000900F5CF03F00E014C6F03C04DFE546BBE
:100BE00049CE53FE566B080E556F00017DEC01F0A7
:100BF00001C04EFE010E0E010124016E000E022006
:100C0000036E01C0E9FF040E0324EA6E4CCEEFFF31
:100C10004DA101D04B814DA301D04B83546B49CEE4
:100C200053FE566B080E556F00017DEC01F00E016E
:100C300001C0E9FF040E0224EA6E4BCEEFFF000173
:100C40001200036A0E014E514C0FE96E0F0E032085
:100C5000EA6EEF521BE0546B4ECE53FE566B080EFD
:100C6000556F00017DEC01F002C050FE01C04FFE47
:100C7000040E0E014F27000E50234FCEE9FF040E45
:100C80005025EA6EEFCF51FE51AF02D0000E01D0D9
:100C9000010E016E0001120049CE4EFED2DF01525C
:100CA000D8B49BD00E01546B49CE53FE566B080E40
:100CB000556F00017DEC01F002C04FFE01C04EFEF9
:100CC000040E0E014E27000E4F23010E4E25016E1D
:100CD000000E4F21036E01C0E9FF040E0324EA6EEB
:100CE0004ACEEFFF4C51020820E1546B49CE53FE2F
:100CF000566B080E556F00017DEC01F002C04FFEEF
:100D000001C04EFE040E0E014E27000E4F234ECEA4
:100D1000E9FF040E4F25EA6EEFCF4DFE4DAD02D038
:100D20004C6B02D0010E4C6F1AD04C51040817E1E5
:100D3000546B49CE53FE566B080E556F00017DEC87
:100D400001F00E0101C0E9FF040E0224EA6EEFCFAC
:100D50004DFE4DAD03D0010E4C6F01D04C6B4C2DB0
:100D600003D0480E4D6F02D0080E4D6F546B49CE24
:100D700053FE566B080E556F00017DEC01F002C06A
:100D80004FFE01C04EFE040E0E014E27000E4F23F3
:100D90004ECEE9FF040E4F25EA6E4DCEEFFF546BA9
:100DA00049CE53FE566B080E556F00017DEC01F0E5
:100DB00002C04FFE01C04EFE040E0E014E27000E73
:100DC0004F234ECEE9FF040E4F25EA6EEF50800907
:100DD000EF6E010E016E04D00001000E016E0E01D7
:100DE000000112000E01495300E1000112004ACE39
:100DF0005EFF0E014A5303E0040E226E02D0020E83
:100E0000226E000109EF07F01B6A1A6A24C04AFE2D
:100E1000EED71AEF07F00E0149530DE11A2C05D059
:100E200000011AEC02F006D00E011A50020803E18C
:100E30000001EAD70E010001120021300E01476FB8
:100E4000473347331F0E471721524EE1040100512B
:100E50003C0B0E01486F430E040100170E01485170
:100E6000340825E104010451800B01E0046B00010A
:100E70004FD66598233C07D00E01496B030E4A6F8D
:100E800000015FDE12D00E01496B020E4A6F0001B5
:100E900058DE2350FE0809E00E01496B4B6B23C05E
:100EA0004AFE040E4C6F0001F7DE1CD00E014851C3
:100EB000040819E1496B000195DF0E01496B020E30
:100EC0004A6F00013EDE2350FE080CE0233C01D0B7
:100ED00009D00E01496B4B6B23C04AFE010E4C6FCB
:100EE0000001DADE0E0122D02150040812E123684D
:100EF000496B000190DF233C01D009D00E01496B02
:100F00004B6B23C04AFE020E4C6F0001C5DE0DD0B4
:100F10000E0121B406D047CE49FE000163DF05D0A3
:100F20000E0147CE49FE000176DF0E010001EDEF14
:100F300007F0A1982252D8B45AD06252D8B457D0F0
:100F400062A408D00F015CB502D0000103D00001FB
:100F500027EF01F065B24BD062AA08D00F015CBB4D
:100F600002D0000103D0000147EF01F062A208D0D7
:100F70000F015CB302D0000103D0000152EF01F079
:100F800062A008D00F015CB102D0000103D00001C3
:100F9000EDEF01F062A808D00F015CB902D00001AA
:100FA00003D000010BEF02F062AC08D00F015CBD72
:100FB00002D0000103D0000112EF02F00E01466BD7
:100FC00062A60DD00F015CB702D00E0108D064CF2D
:100FD00021F00001EBEC01F030D703D00E0106D078
:100FE00000010E014651462B0308EAE2000154EFCE
:100FF00000F049CE5EF248CE5DF247CE5CF246CEBE
:101000005BF2120001012D6B2DC12BF000011200CB
:10101000C69AC69CC69EC68A12000E01E80E4B25D3
:10102000F2CF50FEF29EF86AF76E4ACEF6FF090044
:10103000F5500800F5CF03F0F86A50BFF28E4C6F00
:1010400003C04DFE4D6B4CCE01F0000112000E01AD
:10105000476B466B475102081BE3100E4625016E95
:10106000050E4721036E01C048FE496F47CE4BFE77
:1010700046CE4AFE0001D1DF49CEEAFF48CEE9FF65
:1010800001C0EFFF8B700E01462BD8B4472BE2D77F
:10109000000112000801DF6BDE6B020132910E01CC
:1010A000496B486BE3C847FEE2C846FE0001A1DF7A
:1010B0008B820201566B556B0001A4DF0301AD9FCB
:1010C0000801DD812C6A020132850001A1DF9488CC
:1010D0009486BDDF120002016A6B6B6B6C6B6D6BEB
:1010E000000112000801DF6BDE6B02013291080182
:1010F000DD910301AD8D0001EEDF8B92120008013E
:10110000DDB104D00001C6DF03D008010001EADF31
:101110001200140E0801FD6F000112000E0147516C
:10112000016A465D03E246CE00F00CD0006A080E6C
:10113000486F463700364751005CD8B0006E013624
:10114000482FF7D70001B8EF08F080B81AD0020195
:10115000605315E10001DDDF0201615109080BE375
:10116000622B62C246FE0A0E0E01476F0001D6D7FF
:1011700000C062F20201616B010E606F328503D024
:1011800000010201606B6151090805E3612B6151A7
:101190000A0801E13285000135EF0CF00E014D51D6
:1011A000000A0001D8B4BED0300AD8B4BBD0310A8E
:1011B000D8B4BCD0300AD8B4B9D0330AD8B4BAD075
:1011C000300AD8B4B7D0310AD8B4B8D0300AD8B4BD
:1011D000B5D0370AD8B4B6D0300AD8B4B3D0310AB3
:1011E000D8B4B4D0300AD8B4B1D0330AD8B4B2D05D
:1011F000300AD8B4AFD0310AD8B4B0D0300AD8B49D
:10120000ADD03F0AD8B4AED0300AD8B4ABD0310A92
:10121000D8B4ACD0300AD8B4A9D0330AD8B4AAD044
:101220004B0AD8B4ABD0200AD8B4A8D0230AD8B47B
:10123000A9D0200AD8B4A6D0210AD8B4A7D0200AB1
:10124000D8B4A4D0270AD8B4A5D0200AD8B4A2D044
:10125000210AD8B4A3D0200AD8B4A0D0230AD8B485
:10126000A1D0200AD8B49ED0210AD8B49FD0200A99
:10127000D8B49CD02F0AD8B49DD0200AD8B49AD024
:10128000210AD8B49BD0200AD8B498D0230AD8B465
:1012900099D0200AD8B496D0260AD8B497D0200A7C
:1012A000D8B494D0220AD8B495D0200AD8B492D019
:1012B000210AD8B493D0200AD8B490D03F0AD8B429
:1012C00091D0200AD8B48ED0210AD8B48FD0200A69
:1012D000D8B48CD0230AD8B48DD0200AD8B48AD000
:1012E000210AD8B48BD0200AD8B488D0270AD8B421
:1012F00089D0200AD8B486D0210AD8B487D0200A51
:10130000D8B484D02C0AD8B485D0200AD8B482D0DE
:10131000050AD8B483D05C0AD8B484D0370AD8B4CC
:1013200081D080D03F0E016E80D07FD0060E016E3E
:101330007CD07BD05B0E016E78D077D04F0E016EE3
:1013400074D073D0660E016E70D06FD06D0E016ECA
:101350006CD06BD07D0E016E68D067D0070E016E29
:1013600064D063D07F0E016E60D05FD06F0E016ECF
:101370005CD05BD0000E016E58D057D0770E016E56
:1013800054D053D07C0E016E50D04FD0390E016E28
:101390004CD04BD05E0E016E48D047D0790E016E16
:1013A00044D043D0710E016E40D03FD03D0E016E4F
:1013B0003CD03BD0760E016E38D037D0040E016E93
:1013C00034D033D00E0E016E30D02FD0380E016ED7
:1013D0002CD02BD0540E016E28D027D05C0E016E7D
:1013E00024D023D0730E016E20D01FD0670E016E63
:1013F0001CD01BD0500E016E18D017D06D0E016E90
:1014000014D013D0780E016E10D00FD03E0E016EA6
:101410000CD00BD06E0E016E08D007D0360E016EC8
:1014200004D003D0000E016E00D01200D8900E013F
:101430004935010F036AAE0FE96E030E0320EA6E11
:10144000EFCF4BFE4A6BD8904935010F010F036A6D
:10145000AE0FE96E030E0320EA6EEF504A27000E2E
:101460004B234ACE01F04BCE02F000011200016A7C
:10147000026A006A036A0E01505102E14F5118E0FE
:10148000100E516FD8904D374E37003603365051FD
:10149000035C02E14F51005C07E34F51005ED8A0AE
:1014A00003065051035ED88001360236512FEAD729
:1014B000000112004BCE4EFE4ACE4DFE0E01506B87
:1014C0000A0E4F6F0001D3DF02C04EFE01C04DFE79
:1014D00002C054FE01C053FE0E01566B0A0E556F3A
:1014E00000017DEC01F001500E014A5D4C6F4CCEC5
:1014F0004DFE000153DE01C06AF24BCE4EFE4ACED5
:101500004DFE0E01506B0A0E4F6F0001B0DF02C09E
:101510004BFE01C04AFE0E014A5306E14B5304E163
:1015200002016B6B24D00E014BCE4EFE4ACE4DFE17
:10153000506B0A0E4F6F00019ADF02C04EFE01C0D1
:101540004DFE02C054FE01C053FE0E01566B0A0E42
:10155000556F00017DEC01F001500E014A5D4C6FAA
:101560004CCE4DFE00011ADE01C06BF202014BCEE3
:101570004EFE4ACE4DFE0E01506B0A0E4F6F00011B
:1015800076DF02C04BFE01C04AFE0E014A5306E15F
:101590004B5304E102016C6B24D00E014BCE4EFE86
:1015A0004ACE4DFE506B0A0E4F6F000160DF02C045
:1015B0004EFE01C04DFE02C054FE01C053FE0E019E
:1015C000566B0A0E556F00017DEC01F001500E01C3
:1015D0004A5D4C6F4CCE4DFE0001E0DD01C06CF267
:1015E00002014BCE4EFE4ACE4DFE0E01506B0A0E4E
:1015F0004F6F00013CDF02C04BFE01C04AFE0E01EE
:101600004A5306E14B5304E102016D6B24D00E01F5
:101610004BCE4EFE4ACE4DFE506B0A0E4F6F000170
:1016200026DF02C04EFE01C04DFE02C054FE01C0C6
:1016300053FE0E01566B0A0E556F00017DEC01F052
:1016400001500E014A5D4C6F4CCE4DFE0001A6DDEF
:1016500001C06DF2020132850001120002016351E6
:10166000625D02E132A5A8D062C263F23295615197
:101670000908D8A07CD06251000A000103E0010AE9
:1016800041E05AD0020132A71FD0470E0E014D6F24
:10169000000184DD01C06DF26F0E0E014D6F00017F
:1016A0007DDD01C06CF2470E0E014D6F000176DD4D
:1016B00001C06BF26F0E0E014D6F00016FDD01C0B6
:1016C0006AF2020132971DD0750E0E014D6F0001B6
:1016D00065DD01C06DF2730E0E014D6F00015EDD20
:1016E00001C06CF2650E0E014D6F000157DD01C0A7
:1016F0006BF2720E0E014D6F000150DD01C06AF2F7
:10170000020134D002016D6B6F0E0E014D6F0001AE
:1017100045DD01C06CF2660E0E014D6F00013EDD2D
:1017200001C06BF2660E0E014D6F000137DD01C086
:101730006AF202011BD0000102016A6B010E625DB8
:101740000E01486F4D6F000129DD01C06BF2730E71
:101750000E014D6F000122DD01C06CF2730E0E010F
:101760004D6F00011BDD01C06DF2020124D06251FA
:10177000000A000103E0010A0AE00BD066C26AF227
:1017800067C26BF268C26CF269C26DF213D0A3DC5F
:1017900011D0020E0201625D0E01486F496F000117
:1017A00045DE02C049FE01C048FE02C04BFE01C03A
:1017B0004AFE80DE020127D06251010824E2615115
:1017C000090821E2020E625D0E01486F496F0001B7
:1017D0002DDE02C047FE01C046FE020164510E012B
:1017E000465D05E1020165510E01475D0BE047CE04
:1017F00065F246CE64F247CE4BFE46CE4AFE00016D
:1018000059DE0E010201000136EF0CF0DB0ED76E3F
:10181000610ED66E0801E22BD8B4E32BE42BD8B4CA
:10182000E52BE851E45D08E1E951E55D05E1E62BD2
:10183000D8B4E72BE56BE46BDE5302E1DF5304E041
:10184000DE51D8B4DF07DE0781B009D0DDA501D0B5
:1018500005D0DD73DD85000152DC080103D0DDA574
:1018600001D0DD95EB2B000170D4F8D602016E514A
:10187000270801E36E2BF294000154EF00F048CEEC
:1018800000F00E014951016E04E0D8900032012EA3
:10189000FCD70050010B016E000112000E014C51EB
:1018A000070B006E4C31016E013201321F0E011622
:1018B00001504E25E96E000E4F21EA6E016A012AA1
:1018C000002A01D00136002EFDD74D5303E0015010
:1018D000EF1203D0011E0150EF16000112004ACE94
:1018E0004CFE0E014D6B0F0E4F6F890E4E6F0001B7
:1018F000D5DF12004ACE4CFE010E0E014D6F0F0EC9
:101900004F6F890E4E6F0001C9DF12000801D851D8
:10191000DB5DD8B077D0036ADB51D40FE96E080ED7
:101920000320EA6EEFCF46FE0E01476B47510308D6
:101930004AE346CE48FE47CE49FE0001A0DF0152F1
:101940003FE0C1C848FE47CE49FE99DF012C38D0A0
:10195000BEC848FE47CE49FE92DF015221E1D89031
:101960000E014735036AEE0FE96E030E0320EA6E9F
:10197000ECCF4BFEED52EFCF4AFE0001B0DFD89026
:101980000E014735036AF60FE96E030E0320EA6E77
:10199000ECCF4BFEED52EFCF4AFE0001A0DF10D09E
:1019A000D8900E014735036AF60FE96E030E032047
:1019B000EA6EECCF4BFEED52EFCF4AFE00018FDF17
:1019C0000E01472BB3D70801DB2BD851DB5D12E2A8
:1019D000D890DB35036ACC0FE96E080E0320EA6E5F
:1019E000ECCF49FEED52EFCF48FE49CECFFF48CEB7
:1019F000CEFF07D0DAC8CFFFD9C8CEFF0301AD8B29
:101A00000801E0D00301AD9B0E01476B475103086D
:101A1000D8A0C9D0C1C848FE47CE49FE00012FDF7B
:101A2000012C9ED0036A0E014751C20FE96E080EC9
:101A30000320EA6EEF52D8B473D0BEC848FE47CE3A
:101A400049FE00011CDF015249E1C0C848FE47CEF3
:101A500049FE15DF015221E0D8900E014735036A97
:101A6000EE0FE96E030E0320EA6EECCF4BFEED5253
:101A7000EFCF4AFE00013EDFD8900E014735036AE2
:101A8000F60FE96E030E0320EA6EECCF4BFEED522B
:101A9000EFCF4AFE000123DF20D0D8900E0147355A
:101AA000036AF60FE96E030E0320EA6EECCF4BFEDD
:101AB000ED52EFCF4AFE00011DDFD8900E014735F1
:101AC000036AEE0FE96E030E0320EA6EECCF4BFEC5
:101AD000ED52EFCF4AFE000102DF20D0D8900E0178
:101AE0004735036AF60FE96E030E0320EA6EECCF6A
:101AF0004BFEED52EFCF4AFE0001FCDED8900E0106
:101B00004735036AEE0FE96E030E0320EA6EECCF51
:101B10004BFEED52EFCF4AFE0001ECDE20D00E016D
:101B2000D8904735036AEE0FE96E030E0320EA6E84
:101B3000ECCF4BFEED52EFCF4AFE0001D0DED89045
:101B40000E014735036AF60FE96E030E0320EA6EB5
:101B5000ECCF4BFEED52EFCF4AFE0001C0DE20D0AD
:101B6000D8900E014735036AEE0FE96E030E03208D
:101B7000EA6EECCF4BFEED52EFCF4AFE0001AFDE36
:101B8000D8900E014735036AF60FE96E030E032065
:101B9000EA6EECCF4BFEED52EFCF4AFE00019FDE26
:101BA0000E01472B33D70801D85306E0DB6BCDC8B5
:101BB000CFFFCCC8CEFF06D0690ECF6ECE68030132
:101BC000AD8B08019E90000154EF00F08D928D9432
:101BD0008F968F928F908D9A8F988F94F1EF0DF052
:101BE000F5D702015F5302E18E9E01D08E8E5F2DEC
:101BF00002D08D9601D08D865F51020802E18D984A
:101C000001D08D885F51030802E18D9001D08D8055
:101C10005F53D8B46AC247FE5F2D02D06BC247FE45
:101C20005F510208D8B46CC247FE5F510308D8B4B4
:101C30006DC247FE0E0147A101D08D8247A301D09E
:101C40008D8447A501D08F8647A701D08F8247A9F1
:101C500001D08F8047AB01D08D8A47AD01D08F88EE
:101C600047AF01D08F84010E02015F25030B5F6F28
:101C7000000158EF0EF00301AD870801EC2BE05393
:101C800002E1E15304E0E051D8B4E107E007FD537D
:101C90000DE0FE51FE2B000A03E1320EBC6E06D0B1
:101CA000FE51140803E1BC6AFE6BFD6B000198D77E
:101CB0009E9254EF00F00801DDBF28D0F45302E1FA
:101CC000F5531DE0F8510C081AE1F451F25D03E1FF
:101CD000F551F35D14E0F451950807E1F55305E182
:101CE00000017FEC08F007D00801F5C8F3F8F4C84C
:101CF000F2F8FC8100010801FB6BF56BF46BFB5102
:101D0000FB2B320803E2F36BF26BFB6BDD9FA192BE
:101D1000000154EF00F00801DD8FDDAD0BD0B66A95
:101D2000050EB66EB96ABA6ADD9DB8CFF7F8B7CFBF
:101D3000F6F85AD0B66A040EB66EB96ABA6ADD8D84
:101D4000F751B85C0FE303E1B750F65D0BE2F651D3
:101D5000B75C0E01466F0801F751B8580E01476F86
:101D600011D00801FF0ED880F6550E01486FFF0E06
:101D70000801F7550E01496FB7504825466FB85016
:101D80004921476F47510B080AE303E14651B70861
:101D900006E30801F56BF46BF86B26D00E01475192
:101DA000130808E303E14651870804E30801F82B10
:101DB0001BD00E014751230813E303E146512708C6
:101DC0000FE3010E006E0801F851016E04E0D89097
:101DD0000036012EFCD70050F413F82B05D00E016D
:101DE0000801F56BF46BF86BA190000154EF00F063
:101DF0009EAAFED7ACCF2AF0AFCF01F02AA202D024
:101E0000AC98AC8805EF0FF0F3D701C046FE030194
:101E1000305322E0302D0BD00E0146515408D8B477
:101E200002D0030104D0020E0301306F12D03051F2
:101E300002080DE10E014651FE08D8B402D003019C
:101E400006D00301306B0201328D04D00301010E74
:101E5000306F020153D00301020132AD10D046CEE3
:101E600032F303013251020803E13F0E336F04D015
:101E70003251070801E1AD810201329D20D00301FA
:101E8000ADA104D046CE33F3AD9118D033512F5DC0
:101E900015E10E0146510301315D05E18B70020130
:101EA000327B6E6B0301316B2F6B010E306F325141
:101EB000070803E10201328F03011FD0020132AB98
:101EC0000DD003012F512F2B036AB10FE96E020EC3
:101ED0000320EA6E46CEEFFF0CD0020103012F5122
:101EE0002F2B036AF00FE96E020E0320EA6E46CE36
:101EF000EFFF0E0146510301312702019E9A0001B6
:101F000054EF00F00A0EEA6E340EE96EEF500EE068
:101F10000F0E016E006A002EFED7012EFBD78F0E2A
:101F2000006E002EFED70000EF2EF2D7120008013F
:101F3000BB6B010E0301FE6F0801DD912B6A0101ED
:101F40002D6B2C6A020E0301BF6F510EC06F2C0E59
:101F5000C26FF2CF82F9F29EF86AF90EF76EF00EB8
:101F6000F66E0900F5500800F5CF03F0F86A090194
:101F700082BFF28E0201536F03C054F2000164EF7E
:101F800034F08D9C8A920901846B856B845103081F
:101F90002EE3D8908435036AEE0FE96E030E03201A
:101FA000EA6EECCF4BFEED52EFCF4AFE196AF2BE5D
:101FB000198EF29E000193DC19BEF28ED8900901B1
:101FC0008435036AF60FE96E030E0320EA6EECCF48
:101FD0004BFEED52EFCF4AFE196AF2BE198EF29E09
:101FE00000017DDC19BEF28E0901842BCFD70001E0
:101FF0001200948694888DEF10F0320EBC6E8B82A6
:102000000A01346F00017EDFBC6A8B92960E0A01D2
:10201000346F000177DF320EBC6E8B800A01346FA3
:10202000000170DFBC6A320E0A01346F00016ADF02
:102030008B90320EBC6E8B800A01346F000162DF20
:10204000BC6A320E0A01346F00015CDF8B908EEFA8
:1020500010F06592656A0F015C6B080E5F6F975018
:1020600018090901976E226A196AF2BE198EF29E4A
:102070000001D5EC01F019BEF28E40EF10F0E9D767
:102080008FEF10F00301C46B3F0E926E010E936E42
:10209000900E946E000E956E800E966E7C0E976E6E
:1020A000000E986EC150C00B0609C16EC18EC28071
:1020B000C18CC282C2B2FED7C19C0801BD6B000EAA
:1020C000016EC250C30B0110C26E00015ADF860EB2
:1020D000D56EDB0ED76E610ED66EF28AA10ECD6E76
:1020E0009D80CF6ACE6A380E0609CA6EFF0ECB6E8F
:1020F0009D829D0E796E7B6A7A6AA082B66A040E12
:10210000B66EB96ABA6AA0808B940C0EBB6EBE6ABA
:10211000BF6A9D8AC00EF2126CD76FD7B0D766EF38
:1021200034F0020E0201B16FF06F000168EF34F07D
:102130001B50016ED4EF1AF0036A0A0126514C0FAE
:10214000E96E0F0E0320EA6EEF521EE0196AF2BE2E
:10215000198EF29E0E01546B26CA53FE566B080E62
:10216000556F00017DEC01F019BEF28E02C028FA15
:1021700001C027FA0A0101C0E9FF040E0224EA6E39
:10218000EFCF29FA29AF02D0000E01D0010E016E67
:102190000001DDEF1AF0196AF2BE198EF29E0E01EF
:1021A000546B2BCA53FE566B080E556F00017DEC25
:1021B00001F019BEF28E01C035FA020E0A010124A7
:1021C000016E000E0220036E01C0E9FF040E03241D
:1021D000EA6EECCF31FAED52EFCF30FA196AF2BE67
:1021E000198EF29E0E01546B2BCA53FE566B080ECD
:1021F000556F00017DEC01F019BEF28E01C035FA79
:10220000010E0A010124016E000E0220036E01C0BE
:10221000E9FF040E0324EA6E346BEFCF33FA196A38
:10222000F2BE198EF29E0E01546B2BCA53FE566BF2
:10223000080E556F00017DEC01F019BEF28E0A0107
:1022400001C0E9FF040E0224EA6EEFCF32FA32A198
:1022500001D0348132A301D0348334512F5D08E39F
:1022600003E12E51335D04E234CA2FFA33CA2EFA49
:102270002DCAEAFF2CCAE9FF31CAE2FF30CAE1FFEA
:102280002FCA02F02ECA01F0015202E0022A02D047
:10229000025206E0E6CFEEFF012EFCD7022EFAD75F
:1022A0002ECA01F02FCA02F0000162EF11F026CA17
:1022B0002BFA28CA2DFA27CA2CFA2ACA2FFA29CAB9
:1022C0002EFA69D702C02AFA01C029FA196AF2BEA9
:1022D000198EF29E26CA49FE020E0E014A6F0001B7
:1022E000A1EC05F019BEF28E0A0129CA01F02ACA32
:1022F00002F00001EDEF1AF02ECA03F00A012DCA18
:10230000E9FF03C0EAFF010E006E2F51016E04E0E9
:10231000D8900036012EFCD70050FF0AEF14EF6E64
:10232000000112002DCA03F00A012CCAE9FF03C004
:10233000EAFF010E006E2E51016E04E0D8900036C7
:10234000012EFCD70050EF10EF6E000112000A01C1
:10235000296B2951030823E3C4C300F02951016EFE
:1023600004E0D8900032012EFCD70050010B15E09C
:1023700028530AE1080E2E6FBE0E2D6F29CA2FFAC0
:102380000001BADF09D00A01080E2D6FBE0E2C6FB6
:1023900029CA2EFA0001C6DF0A01292BDAD700016B
:1023A0001200D8900A012E372E5302E18D8C01D0F5
:1023B0008A8200011200D8900A012B312C6F2E6FF7
:1023C0000001EFDF080E0A012D6FC10E2C6F2BCA22
:1023D0002EFA0001A7DF1200D8900A012835036AFF
:1023E000EE0FE96E030E0320EA6EECCF2CFAED52ED
:1023F000EFCF2BFAD8902835036AF60FE96E030E5B
:102400000320EA6EECCF2AFAED52EFCF29FA196ACF
:10241000F2BE198EF29E2ACA4BFE29CA4AFE00015C
:102420007AEC0CF019BEF28E196AF2BE198EF29E89
:102430002CCA4BFE2BCA4AFE7AEC0CF019BEF28E67
:10244000080E0A012E6FC10E2D6F28CA2FFA000147
:1024500053DFD8900A0128312D6F2E6F0001A1DFC4
:10246000CAEF12F0196AF2BE198EF29EC0C848FE79
:1024700028CA49FE3FEC0CF019BEF28E01520AE068
:10248000080E0A012E6FC00E2D6F28CA2FFA000108
:1024900033DF09D0080E0A012D6FC00E2C6F28CA39
:1024A0002EFA00013FDFCFEF12F0080E0A012D6F68
:1024B000C00E2C6F2BCA2EFA000134DF1200080E5A
:1024C0000A012E6FC00E2D6F28CA2FFA000114DFEB
:1024D000D9EF12F0D8900A012A372A5302E18D9CD5
:1024E00001D08A920001A2EF12F0080E0A012E6FAD
:1024F000C10E2D6F28CA2FFA0001FEDE0A012851F5
:10250000020B016EC1C800F0015204E0D890003205
:10251000012EFCD70050010B16E12851020B010FD0
:10252000016EC1C800F0015204E0D8900032012EC3
:10253000FCD70050010B07E1D8902831296F2A6F92
:102540000001C8D70A010001DEEF12F00A01276B73
:102550002751030838E3C4C300F02751016E04E09B
:10256000D8900032012EFCD70050010B2AE0286BD6
:102570000001EDDE0A012651FA0F23E2060F0001E9
:10258000E5EF12F027CA2BFA16DF0A011AD027CA84
:1025900028FA22D70A0115D027CA28FA63D70A01D8
:1025A00010D027CA2BFA81DF0A010BD027CA28FADC
:1025B00086D70A0106D027CA28FA97D70A0101D080
:1025C0000A01272BC5D700011200E824F76AF73665
:1025D000E50FF66E250EF7220A00F550FA6E080098
:1025E000F550F96E84258E259825A225AC25B625B3
:1025F0008E0E006E29CA01F028CA02F0036A015249
:1026000009E102C001F0026A080E005E015202E117
:10261000006A08D0D89001BE04D002360136000608
:10262000F9D7019E12000A012C51D8B4A5D0386FF9
:102630003051D8B4A1D0385F05E37F0E3827D8B029
:102640009BD006D0810E385FD8A096D0D8B494D055
:1026500038CA00F0016A026A036A376B2DCA36FA7B
:10266000368F2ECA35FA2FCA34FA190E386F335105
:10267000345F0DE2010E355F0AE2365F08E2375F34
:1026800006E2372B362B352B3351342728D03251E5
:10269000355F12E2010E365F0FE2375F0DE2372B36
:1026A000362B325135273351342719E3352B17E1B7
:1026B000362B15E1372B13D031518009365F0EE2EE
:1026C000010E375F0BE2372B31518009362732512B
:1026D0003527E9E3362BE7E1372BE5D70380382FA1
:1026E00001D00BD0D8903437353736373737D890BC
:1026F0000336023601363937BAD739A106D0D89019
:10270000013202320332393302D0000635E039BFDC
:102710001ED0D89034373537363737373351345F9A
:1027200007E2010E355F04E2365F02E2375F1AE32B
:102730003251355F05E2010E365F02E2375F12E388
:1027400031518009365F03E2010E375F0BE3032A44
:1027500009E1022A07E1012A05E1002A0DE0013220
:10276000023203322DCA38FA3151381B38AF02D049
:10277000018E06D0019E04D0006A016A026A036AD3
:10278000000112000A012C51D8B471D0006E3051F2
:10279000D8B46DD0002604E3810E002668E204D090
:1027A0007F0E005E64E363E02DCA34FA3151341BBE
:1027B0002D8F318F2F513303F4CF36FA2E51320340
:1027C000F4CF03F0F3CF35FA3303F3503627F45048
:1027D0003523000E03222F513203F3503627F450D5
:1027E0003523000E026A032202222D513303F350D7
:1027F0003527F4500322000E02222D513203F350EC
:102800000326F4500222000E016A01222F513103E7
:10281000F3503527F4500322000E022201222E51DC
:102820003103F3500326F4500222000E01222D51F1
:102830003103F3500226F4500122002A01BE05D0D4
:1028400035370336023601360006000E35AF0AD0A2
:10285000032A02220122015005E1025003E1035044
:1028600001E1002A34BF018E34AF019E04D0006A1A
:10287000016A026A036A000112008E0E006E0A01EC
:102880002851005E29CA02F02ACA01F0028E0052C5
:1028900009E0D890025202E1015204E00232013212
:1028A000002EF7D729AF05D0011E021E012AD8B489
:1028B000022A000112000A012A6B2A5103084CE384
:1028C000C4C300F02A51016E04E0D8900032012EFA
:1028D000FCD70050010B3EE0292D1DD0BEC800F0F2
:1028E0002A51016E04E0D8900032012EFCD700502E
:1028F000010B11E12ACA2BFA00015DDD2ACA2BFA6D
:10290000D4DD080E0A012D6FBE0E2C6F2ACA2EFAD6
:10291000000108DD0A01036A2A51C20FE96E080EA0
:102920000320EA6E28CAEFFF036A2A51C70FE96E37
:10293000080E0320EA6EEF50285D0CE00301AD891C
:10294000036A0A012A51C70FE96E080E0320EA6ED6
:1029500028CAEFFF2A2BB1D7000112000A01296B08
:1029600027CA28FA000144DE03C02BFA02C02AFA63
:1029700001C029FA00C028FA03C02FFA02C02EFABB
:1029800001C02DFA00C02CFA0A01336B326B480EDD
:10299000316F850E306F000146DE03C02BFA02C096
:1029A0002AFA01C029FA00C028FA03C02FFA02C08F
:1029B0002EFA01C02DFA00C02CFA0A01336B326BDB
:1029C0007F0E316F860E306F0001DCDE03C02BFA04
:1029D00002C02AFA01C029FA00C028FA4EDF01C05D
:1029E00027FA27CA28FA0A01296B000164DF1200BE
:1029F00026CAC4F31200C4C300F00A012651016EB6
:102A000004E0D8900032012EFCD700A00FD0010EB8
:102A1000006E2651016E04E0D8900036012EFCD7DE
:102A20000050FF0A0301C4170DD00A01010E006E09
:102A30002651016E04E0D8900036012EFCD70050DC
:102A40000301C4130001A3EF1CF02FCA43F92ECADF
:102A500042F90901426BFC0E431742510A012E5DF7
:102A60000901406F43510A012F590901416F456B1C
:102A7000446B000112003CCE01F03BCE00F000663A
:102A8000012A0900F5CFEEFF002EFBD7012EF9D762
:102A9000F86A95EF15F0F250036EF29EA6840F01CE
:102AA000550EA76EAA0EA76EA68200000350F21262
:102AB00000011200F6503F0B006EC00EF6160A0021
:102AC0003FCE01F000660BD0F650010F08E1000E7A
:102AD000F720030B04E1A6880900DDDF0A00006689
:102AE00007D0EECFF5FF015204E00F00010603D03E
:102AF00000060B000C003F0EF6143F0AE3E1CBDFAB
:102B00000166E0D7F86A31EF16F00E013A81F86AF3
:102B10002DCAF7FF2CCAF6FF0A0EEA6E340EE96ED4
:102B2000040E3C6F3B6B0001A6D7000ED8800A0153
:102B30002E55006E040E2F55036E00C001F0035099
:102B4000315D10E303E13051015C0CE2000ED880EE
:102B50002E550E01386F040E0A012F550E01396FE4
:102B600006D00A0131CA39FE30CA38FE0E012FCA1A
:102B700035FE2ECA34FE376B366B3751395D2AE38A
:102B800003E13851365D26E2340E3425016E0A0E1B
:102B9000352101C03BFE3C6F36510A013225016EE2
:102BA0000E0137510A01332101C0E9FFEA6EEFCF70
:102BB0003DFE0E013CCEEAFF3BCEE9FF3DCEEFFFEE
:102BC00035CE03F03451342BD8B4352B362BD8B452
:102BD000372BD3D7F29CF29EF2BEFDD7356B346B08
:102BE000355344E134510F0841E33435026E353535
:102BF000036E0236033602360336023603360236D9
:102C0000033602360336C00E021602500A012C2586
:102C10000E013B6F03500A012D210E013C6F34352C
:102C2000026E3535036E023603360236033602363F
:102C300003360236033602360336C00E0216025041
:102C4000340F3D6F0A0E03203E6FF86A3CCEF7FF4B
:102C50003BCEF6FFEA6E3DCEE9FF400E3F6F00012E
:102C600029D70E01342BD8B4352BBAD7C00EF212A7
:102C70000A0130512E250E013B6F0A0131512F21DF
:102C80000E013C6F030822E2FF0A03E13B510008FA
:102C90001DE2040E0A012D27000ED8802E55006E6D
:102CA000040E2F55036E0050305F0350315B000E51
:102CB000D8802E55006E040E2F55036E005032271B
:102CC000035033232F6B2E6B03D00E013A910A0170
:102CD0008B700E013AB11BD7000186EF16F0090187
:102CE000445302E145532BE043C92DFA42C92CFA63
:102CF00041C92FFA40C92EFA45C931FA44C930FA00
:102D0000090E0A01336F326B0001FFD609014051F1
:102D100042250A012C6F0901415143210A012D6FFF
:102D2000090144510A012C27090145510A012D23AB
:102D30002DCA2FFA2CCA2EFA000187DE09010001E4
:102D40001200090145C903F04451442BD8B4452B66
:102D50000A01E96E090E0324EA6E2ACAEFFF09018F
:102D6000455303E144513F0803E20001B8DF090184
:102D70000001120029CA2BFA28CA2AFAE2DFAFDFC3
:102D800012000A0126530EE0F90E2F6FF20E2E6F7D
:102D900000015BDE0A01296B010E286F0001EADFEA
:102DA0000CD00A01F90E2F6FF20E2E6F00014DDECE
:102DB0000A01296B286B0001DDDFA3EF1CF0C69E22
:102DC0009E9635CAC9FF020EC6BE05D09EA6FED786
:102DD000000EC5BC010E016E1200C69CC586C5B6AC
:102DE000FED700B0C59A00A0C58AC588C5B8FED771
:102DF000C9CF01F01200C6BC04D0C6BE02D0000E7E
:102E000001D0010E016E66EF17F0C580C5B0FED788
:102E10002ECA34FA2ECA35FA0001D1DF015205E07C
:102E200008EC08F0000E016E57D02FCA35FAC7DF44
:102E3000015205E008EC08F0000E016E4DD0C5828D
:102E4000C5B2FED70A012E510109346F356F00015A
:102E5000B6DF015205E008EC08F0000E016E3CD030
:102E6000020E0A01346F000182EC0FF00A01336B8D
:102E70003051335D26E2010E305D335D10E1335198
:102E80003125016E000E3221036E01C0E9FFEA6EAA
:102E9000006A0001A2DF01C0EFFF10D00A01335128
:102EA0003125016E000E3221036E01C0E9FFEA6E8A
:102EB000010E006E000191DF01C0EFFF0A01332B0C
:102EC000D7D7C584C5B4FED7000195D70152D8A481
:102ED00008EC08F0010E016E7BEF17F02ACA2EFAFB
:102EE0002BCA2FFA010E0A01306F2DCA32FA2CCAF2
:102EF00031FA00018AD71200C580C5B0FED72DCAAD
:102F000033FA2DCA35FA00015ADF015205E008EC08
:102F100008F0000E016E2CD02ECA35FA50DF015297
:102F200005E008EC08F0000E016E22D00A01326BB9
:102F30002F51325D17E232513025016E000E3121E2
:102F4000036E01C0E9FFEA6EEFCF35FA000137DF0B
:102F5000015205E008EC08F0000E016E09D00A01EC
:102F6000322BE6D7C584C5B4FED7010E016E000131
:102F700012002ACA2DFA2BCA2EFA010E0A012F6F4F
:102F80000A0E316F2C0E306F0001B6DF1200036A9B
:102F90000A0126CAE9FF03C0EAFFEFCF2CFAD00EE0
:102FA0002A6F2B6B2D6B000199DF0A01269F130EF0
:102FB000006E002EFED700D0D00E2A6F2B6B26CAD3
:102FC0002CFA0001D6DF036A0A0126CAE9FF03C012
:102FD000EAFFEFCF2CFAD00E2A6F020E2B6F2D6B6B
:102FE00000017CDF0A01269D130E006E002EFED725
:102FF00000D0D00E2A6F020E2B6F26CA2CFA0001C9
:10300000B8DFD00E0A012A6F070E2B6F100E2C6F3F
:103010000001AFDF120029CA2AFA0A012B6B2A51DC
:10302000090805E20A0E2A5F100E2B2703D02A5149
:103030002B2701D0F4D72BCA01F0000123EF18F0A1
:1030400028CA29FAE8D701C029FAD00E0A012A6F46
:1030500027CA2BFA01C02CFA00018BDFD7EF1BF037
:103060002ACA2BFAD8900A012B33780E2B172B3152
:10307000006E00323F0E001600502B252C6F2A5197
:103080000F0B2C25016E00015AEF18F0D00E0A012B
:103090002A6F28CA2BFA0A0E2D6F290E2C6F0001F9
:1030A0001DDF012C01D003D0640E016E04D029CAAB
:1030B0002AFAD6D70150120030CA03F00A012FCAEB
:1030C000E9FF03C0EAFFEFCF4DFE196AF2BE198E89
:1030D000F29E0001CEEC08F019BEF28E01C069F23A
:1030E000010E0A012F25016E000E3021036E01C072
:1030F000E9FFEA6EEFCF4DFE196AF2BE198EF29E1D
:103100000001CEEC08F019BEF28E01C068F2020E8A
:103110000A012F25016E000E3021036E01C0E9FF68
:10312000EA6EEFCF4DFE196AF2BE198EF29E0001D3
:10313000CEEC08F019BEF28E01C067F2030E0A0150
:103140002F25016E000E3021036E01C0E9FFEA6EEB
:10315000EFCF4DFE196AF2BE198EF29E0001CEEC41
:1031600008F019BEF28E01C066F20201328500013C
:1031700003EF19F00A01296B2A6B296B29BF03D0D1
:10318000295103083AE3036A2951006EE8BE030699
:103190002725E96E28510320EA6EEF5213E12951E9
:1031A000292B006EE8BE03D0005003080AE3036A2F
:1031B00029512B0FE96E0A0E0320EA6E200EEF6EE6
:1031C000EED719D0036A29512B0F016E0A0E032284
:1031D00003C030FA036A2951E8BE03062725E96EC9
:1031E00028510320EA6EEFCF31FA30CAEAFF01C05E
:1031F000E9FF31CAEFFF292BC1D70A0E306F2B0E22
:103200002F6F000159D70801ED51B40802E0000EFC
:1032100001D0010E0A012F6F0801ED51B60802E03E
:10322000000E01D0010E0A012F1102E0050E266FDB
:10323000C580C5B0FED7EDC835FA0001C0DD01502C
:1032400001E066D026CA35FABADD0A012651050822
:1032500029E1296B036A2951006EE8BE0306272580
:10326000E96E28510320EA6EEF5217E029BF04D01F
:1032700029511F0801E211D0036A2951006EE8BEEE
:1032800003062725E96E28510320EA6EEFCF35FAB1
:10329000000195DD0A01292BDDD7356B00018FDD9B
:1032A00034D00A01296B29BF03D0295103082CE32C
:1032B000036A2951006EE8BE03062725E96E2851EE
:1032C0000320EA6EEF520FE12951292B006EE8BE70
:1032D00003D00050030806E3200E356F00016FDDB8
:1032E0000A01F2D70FD0036A2951006EE8BE030627
:1032F0002725E96E28510320EA6EEFCF35FA000149
:103300005EDD0A01292BCFD70001C584C5B4FED7E5
:103310001200C580C5B0FED7EDC835FA50DD060EE7
:103320000A01356F00014BDDC584C5B4FED712001C
:10333000196AF2BE198EF29ED5EC01F019BEF28E1A
:103340006592656A658C00D000D00000659C140E03
:103350000F015F6F5C6B6586010E226E0001B4EF9A
:1033600019F065B601D0E4D7222C0DD065BA0BD088
:10337000626A0F015C6BA088C00EF212110E5C6FC6
:10338000020E226E000112009EA8FED7AE6E120041
:10339000196AF2BE198EF29E2ECA4EFE21EC06F07C
:1033A00019BEF28E015254E0196AF2BE198EF29ED5
:1033B0000E01546B2ECA53FE566B080E556F00015A
:1033C0007DEC01F019BEF28E02C037FA01C036FA68
:1033D000040E0A013627000E3723020E3625016E31
:1033E000000E3721036E01C0E9FF040E0324EA6ECC
:1033F000ECCF35FAED52EFCF34FA35CAEAFF34CAD2
:10340000E9FF30CAE2FF2FCAE1FF32CA02F031CA37
:1034100001F0015202E0022A02D0025206E0E6CF99
:10342000EEFF012EFCD7022EFAD7196AF2BE198ED2
:10343000F29E2ECA49FE32CA4BFE31CA4AFE33CA38
:103440004CFE00014CEC06F019BEF28E015002D089
:10345000000E016E12000301ED51ED2B036A100FF7
:10346000E96E080E0320EA6E2DCAEFFF0A012D5106
:103470000A0805E00301ED513F0816E20A01010EBA
:103480000801106FEDC311F80A012E6F080E306F9E
:10349000100E2F6F326B3F0E316F020E336F000133
:1034A00077DF020E0301ED6F000167EF1AF00901EB
:1034B000462D06D00A012C51000166DF08D0090113
:1034C0004651020805E12CCA2DFA0001C4D70901B2
:1034D000000112000A0129CA2BFA2851D8B4290781
:1034E00028072A6F2A5302E12B5326E027CA2BFA1A
:1034F0002651262BD8B4272B2A6FD8902A35026E56
:103500002B35036EE80E03242B6FF2CF2CFAF29EBC
:10351000F86AF76E02C0F6FF0900F5500800F5CF13
:1035200003F0F86A2CBFF28E2A6F03C02BFA2C6FBF
:103530000001BDDFCFD70A0100010FEF1DF002012E
:1035400032B912D0036AAF516F0FE96E020E032039
:10355000EA6E27CAEFFFAF2BAF513F0801E2AF6B16
:10356000B051AF5D01E1328900011200050E0A0180
:10357000276F0001E4DF12000D0E0A01276F000122
:10358000DEDF0A0E0A01276F0001D9DF1200EEDF2D
:1035900026CA27FAD4DFF0DF1200090183810A016D
:1035A000036B000198EF10F00152D8B43BD3010E29
:1035B0000A01266F00019CEF10F00152D8B432D3FB
:1035C000010E0A01266F090E286FC40E276F2A6BA1
:1035D0003F0E296F000157EF11F00901C453D8A421
:1035E000B4D1C5C903FA0A010351020A000145E03A
:1035F000010A54E0070AD8B463D0020AD8B467D0ED
:103600000F0AD8B46ED00E0AD8B477D00F0AD8B447
:1036100079D0030AD8B47BD0070AD8B47BD0010A8A
:10362000D8B47DD0070AD8B4A4D0380AD8B4ABD067
:10363000010AD8B4C1D00F0AD8B4DDD0010AD8B479
:10364000DAD0030AD8B416D1780AD8B415D1010A51
:10365000D8B41DD10F0AD8B425D1010AD8B42DD1C0
:10366000030AD8B439D1440AD8B441D1010AD8B434
:103670004DD16B0AD8B466D166D10901C72D07D0E8
:103680000A01266B0001A6EC12F007D00901010E19
:103690000A01266F0001A6EC12F055D10901C72DD1
:1036A00008D0030E0A01266F0001A6EC12F007D025
:1036B0000901040E0A01266F0001A6EC12F043D1A5
:1036C000020E0A01266F0001A6EC12F03CD1000E9A
:1036D0000901C8250A01266F276F0001AEEC14F01E
:1036E00032D1000E0901C8250A01266F286F010E8C
:1036F000296F00015BEC14F026D1C6C926FAF8EC5C
:1037000014F021D1C6C926FAFBEF14F01CD189ECC4
:1037100008F019D1C6C926FAC1EF16F014D1090173
:10372000C6530BE1196AF2BE198EF29E000172ECCB
:1037300008F019BEF28E1AD00901C62D0BD0196AF5
:10374000F2BE198EF29E00014AEC08F019BEF28E0C
:103750000DD00901C65102080AE1196AF2BE198E9C
:10376000F29E00017FEC08F019BEF28E0901000103
:10377000EAD00901C751010B010802E18B8001D099
:103780008B900001E0D003DC0901846B84510608B2
:1037900011E3020E8425036AC40FE96E090E0320AB
:1037A000EA6EEFCF28FA84C927FA000149D409014B
:1037B000842BECD70001C7D00901846B8451060823
:1037C00018E3240E8425036AAE0F016E030E032254
:1037D00001C026FA03C027FA84C928FA000156DC82
:1037E00027CAEAFF26CAE9FF01C0EFFF0901842BBF
:1037F000E5D70001A8D00901846B036A8451050F45
:10380000016E0A0E032203C027FA020E0901842565
:10381000036AC40FE96E090E0320EA6EEFCF28FA9F
:103820000A0127CAEAFF01C0E9FF28CAEFFF090120
:103830008451842B020F036AC40FE96E090E032022
:10384000EA6EEF52DAE10A0103513C080AE1030E85
:10385000266F0A0E286F050E276F00018BDC09D03A
:103860000A01050E266F0A0E286F050E276F00014C
:1038700081DC69D04EDD67D0B80E0A012A6F010ED7
:103880002B6F060E2C6F0001B9EC17F05CD0B80E50
:103890000A012A6F010E2B6F090E2C6F0001B9EC83
:1038A00017F051D0B80E0A012A6F010E2B6F120EBD
:1038B0002C6F0001B9EC17F046D0300E0901C62577
:1038C0000A01266FB80E2A6F030E2B6F26CA2CFA38
:1038D0000001B9EC17F037D0B80E0A012A6F010EBB
:1038E0002B6F0C0E2C6F0001B9EC17F02CD0C6C951
:1038F0002DFAC7C92EFAC8C92FFA090E0A01316F6D
:10390000C90E306F00017CEC17F01DD0080E0801C5
:103910004F6FC6C92DFAC7C92EFAC8C92FFA0A01B6
:10392000316F510E306F00017CEC17F0012C03D089
:10393000C8C950F803D00801506B00010801FC878A
:10394000000101D0FF006ED10901C42D6DD0C5C9A1
:1039500003FA196AF2BE198EF29E000172EC08F0A9
:1039600019BEF28E010E0A01035DFC0F5BE2040F2B
:10397000000117EF1EF00A01276BC6C926FA26CAF6
:1039800027FA266B0901C7510A0126250201556F46
:10399000000E0A0127210201566F0A01032D0DD0E6
:1039A00055C22EFAE80E020156250A01276F2F6F25
:1039B000000125EC15F008D00A0156C22FFA55C2B5
:1039C0002EFA000125EC15F00A012CD00901846BB8
:1039D000C651845D13E2030E8425036AC40FE96EA9
:1039E000090E0320EA6EEFCF2AFA0A012B6B0001C1
:1039F000A1EC16F0B6DC0901842BEAD700016FECCC
:103A000016F00A010FD0C6C904FA56C227FA55C2E9
:103A100026FA0A01296B04CA28FA00015BD50A01BB
:103A200001D00A0100D10901C4510208D8A4FCD078
:103A3000C5C903FA010E0A01035DE60FD8B0F3D041
:103A40001A0F000128EF1EF0DD0E0A01266F00019B
:103A50009EDD0A01E8D0DC0E0A01266F000197DD29
:103A60000A01E1D083DDDA0E0A01276F000167DD6C
:103A70000901846BC651845D0FE2030E8425036A3D
:103A8000C40FE96E090E0320EA6EEFCF27FA00019A
:103A900056DD0901842BEED700016EDD0A01C3D08B
:103AA000DB0E0A01266F000172DD0A01BCD009019C
:103AB000C65307E1C90E0A01266F000168DD06D072
:103AC0000901C80E0A01266F000161DD0A01ABD0B1
:103AD0000901C65307E1CB0E0A01266F000157DD2D
:103AE00006D00901CA0E0A01266F000150DD0A0145
:103AF0009AD00901C65307E1D00E0A01266F0001D2
:103B000046DD06D00901CD0E0A01266F00013FDD1A
:103B10000A0189D02BDDE10E0A01276F00010FDDBC
:103B20000901846BC651845D0FE2030E8425036A8C
:103B3000C40FE96E090E0320EA6EEFCF27FA0001E9
:103B4000FEDC0901842BEED7000116DD0A016BD0E3
:103B50000DDDE20E0A01276F0001F1DC0901846B23
:103B6000C651845D0FE2030E8425036AC40FE96E1B
:103B7000090E0320EA6EEFCF27FA0001E0DC09010D
:103B8000842BEED70001F8DC0A014DD0EFDCD30E18
:103B90000A01276F0001D3DC0901846BC651845DE3
:103BA0000FE2030E8425036AC40FE96E090E032099
:103BB000EA6EEFCF27FA0001C2DC0901842BEED7B1
:103BC0000001DADC0A012FD00901C62D07D0E30E6F
:103BD0000A01266F0001DBDC08D00901C65306E1AB
:103BE000E40E0A01266F0001D2DC09010A011BD094
:103BF0000901C65307E1E50E0A01266F0001C7DC83
:103C00000ED00901C62D0CD00001B0DCE70E0A0170
:103C1000276F000194DCC7C927FA91DCADDC0901EC
:103C20000A0101D00A01090100018CEF34F0E824F7
:103C3000F76AF736490FF66E3C0EF7220A00F55088
:103C4000FA6E0800F550F96E76397639CC39063AB5
:103C5000E824F76AF7366B0FF66E3C0EF7220A007F
:103C6000F550FA6E0800F550F96E483A563A243C81
:103C7000243C243C243C243C243C243CAE3AD03A12
:103C8000F23A243C243C643AA03A143B503B8C3B2F
:103C9000243C243C243C243C243CC83BF03B030112
:103CA000ADA748D0C282C2B2FED7C4CF83F9090102
:103CB000C3CF82F9D8900801BC35010F036AAE0F5B
:103CC000E96E030E0320EA6E09018351EF6ED8906E
:103CD0000801BC35010F010F036AAE0FE96E030E38
:103CE0000320EA6E090182C900F000C0EFFF010E57
:103CF0000801BC25070BBC6FBC5302E1FC8505D055
:103D0000BC51040802E1010EFF6F036ABC51B30FFE
:103D1000E96E080E0320EA6EEFCF84F909018435BD
:103D2000006E0036FC0E0016C250C30B0010C26EAF
:103D30000301AD9700018EEF34F00801DDAB01D037
:103D400011D0FCA301D00ED0EB510A080BE2DDA983
:103D500009D0ED5302E0010E01D0000EDD97E8B06E
:103D6000DD87EB6B000190EF34F00901826B836B10
:103D7000846B8669876B886B0801DB6B0901825154
:103D80000F08D8B48CD0836B835103084CE3196AB5
:103D9000F2BE198EF29E82C948FE83C949FE000117
:103DA0003FEC0CF019BEF28E015201E039D0036AEB
:103DB00009018351C20FE96E080E0320EA6EEFCFAE
:103DC00085F9853D01D002D085530CE1090E0A0129
:103DD0002D6F820E2C6F83C92EFA000192EC11F028
:103DE0001FD009018651855D0CE285C986F9010E57
:103DF000876F8351016E04E0D8908737012EFCD77E
:103E00000ED08651855D0BE1010E006E8351016E6F
:103E100004E0D8900036012EFCD700508713000133
:103E20000901832BB1D787518213863D01D036D04B
:103E3000D8908435036ACC0FE96E080E0320EA6E31
:103E40008851865D8C6B8B6F196AF2BE198EF29E5B
:103E50008CC954FEE8CF53FE0E01566B960E556F7B
:103E600000017DEC01F019BEF28E02C003F001509A
:103E7000FF08006EFF0E035600C0EFFF03C0ECFF0B
:103E8000036A09018451D40FE96E080E0320EA6E1B
:103E900087C9EFFF86C988F98669842B70D784C9E2
:103EA000D8F884531FE08A6B88C989F9196AF2BE71
:103EB000198EF29E8AC954FE88C953FE0E01566BB4
:103EC000960E556F00017DEC01F019BEF28E02C016
:103ED00003F00150FF0F0801D96F690E0220DA6F5D
:103EE00005D00901690E0801DA6FD969000180EF78
:103EF0001FF00301ADAB06D0ADA904D0000135D74A
:103F00000301AD99000192EF34F0C1C8C5F3C0C8F8
:103F1000C6F3C2C8C7F3C3C8C8F3C4C8C9F3C5C889
:103F2000CAF3F2C8CFF30301D06B82B0D02BD16BB0
:103F300081B0D12B000194EF34F00201B051AF5D9C
:103F400002E0000E01D0010E016E0001120002011C
:103F5000AF51B05D0BE10901866B85C903F084C9DF
:103F6000E9FF03C0EAFFEF6A20D0020185C903F030
:103F7000090103C088F9036A0201B0516F0FE96EAD
:103F8000020E0320EA6EEFCF89F9090188C9EAFF22
:103F900084C9E9FF89C9EFFF0201B02BB0513F0886
:103FA00001E2B06B010E0901866F86C901F00001C4
:103FB000E1EF1FF0090E0901856F830E846F000188
:103FC000C6D7090183C901F00001F4EF1FF0090110
:103FD000826B8251040812E30001AFDF015203E05B
:103FE00009010CD00001E6D701C083F90901835112
:103FF0000001C4EC19F00901822BEBD700015CEF42
:1040000021F0CBC903F00901CAC9E9FF03C0EAFFE7
:10401000EFCFCEF9CDC903F0CCC9E9FF03C0EAFF69
:10402000EF50CE5D17E1CBC903F0CAC9E9FF03C069
:10403000EAFFEF5203E1000E016E21D0CBC903F07D
:10404000CA51CA2BD8B4CB2BCC2BD8B4CD2B000162
:10405000D8D70901CBC903F0CAC9E9FF03C0EAFFF9
:10406000EFCFCEF9CDC903F0CCC9E9FF03C0EAFF19
:10407000EF50CE5D02E2FF0E01D0010E016E000195
:1040800012000901C76BC751030820E3C7510C0D8B
:10409000F350036A340F016E030E032201C0C8F906
:1040A00003C0C9F903C0CBF901C0CAF9C6C9CDF92B
:1040B000C5C9CCF90001A5DF015205E10901C7C955
:1040C00001F006D000010901C72BDDD7FF0E016EFC
:1040D00000011200006A016A0901C351D890C4B1FD
:1040E000002600320132C4B3002600320132C4B5CA
:1040F000002600320132C4B7002600320132C4B9B2
:10410000002600320132C4BB002600320132C4BD99
:10411000002600320132C4BF002600320132000105
:1041200012000901846B856B866B876B886B896BCA
:104130008A6B8B6B8C6B8D6B8E6B8F6B906B926BBA
:10414000020132AB07D0020E0901836FF00E826FBD
:1041500006D00201020E0901836FB10E826F020EBA
:104160008227000E8323906B90518225016E000EF2
:104170008321036E01C0E9FFEA6EEF502C081CE0BA
:10418000036A9051840F016E090E032201C093F956
:1041900003C094F990518225016E000E832101C065
:1041A000E9FFEA6EEFCF95F994C9EAFF93C9E9FFF9
:1041B00095C9EFFF902BD8D7090EC66F840EC56F37
:1041C00000015FDF01C092F909019251FF0834E15B
:1041D0000301AC2B030EAC17ACC392F90901916B30
:1041E00092C9C3F90C0EC46F000174DF01500901BC
:1041F000946B936F036A91519325016E945103223E
:104200000150340F016E030E032201C093F903C065
:1042100094F9036A9151840FE96E090E0320EA6E46
:10422000EFCF95F994C9EAFF01C0E9FF95C9EFFF07
:10423000955302E0912BD4D7916B92C9C3F90C0E20
:10424000C46F000147DF01500901946B936F036A4B
:1042500091519325016E945103220150640F016E18
:10426000030E032201C093F903C094F990518225F3
:10427000956F000E8321966F91519527000E96231E
:10428000010E9525016E000E9621036E01C0E9FF17
:10429000EA6EEFCF95F994C9EAFF93C9E9FF95C992
:1042A000EFFF955302E0912BC8D7000161EF21F099
:1042B00044DE015201E18BD6020132AF04D000018D
:1042C00030D70201329F000196EF34F0020132A193
:1042D00005D03291330E016E14D013D056C203F0C4
:1042E0005551552BD8B4562B0901926F03C093F941
:1042F000100E9225E96E050E0320EA6EEFCF01F055
:10430000020100011200196AF2BE198EF29E72ECCF
:1043100008F019BEF28E89EC08F0640E0A01346FC1
:10432000000182EC0FF089EC08F012002B5210E033
:104330002B06D8902B34036A2D0FE96E000E032054
:10434000EA6EEFCF01F0EE52EDCF02F003D002D0D3
:104350002C82D9DF120001012D517F0812E32D516B
:104360002D2B006ED89000360050036A2E0FE96E98
:10437000010E0320EA6E93C9ECFFED5292C9EFFFE4
:1043800004D00001C0DF2C840101000112002B5079
:104390007F0812E32B502B2A006ED8900036005075
:1043A000036A2D0FE96E000E0320EA6EC6C9ECFF0A
:1043B000ED52C5C9EFFF02D0A6DF2C80120001012B
:1043C0002D5310E02D07D8902D35036A2E0FE96E7E
:1043D000010E0320EA6EEFCF01F0EE52EDCF02F0B6
:1043E00005D004D02C8600018EDF010100011200EF
:1043F000010E0901C05F0DE3090EEA6EC00EE96E01
:10440000EF5007E0020E006E002EFED700D0EF2E18
:10441000F9D7000112000901C76BC86B010EC96F03
:10442000DA6AD96A090ECC6FBF0ECB6F090EEA6E3D
:10443000C30EE96ECCC9E2FFCBC9E1FFC9C9CAF915
:10444000D890E550EE02F350C723F450C823CA2F8A
:10445000F7D7C7C9DEFFC8C9C7F9C86BD8B0C82B22
:10446000CB2BD8B4CC2BC92BC9510508DFE10001F7
:104470004DEF22F05EC2C2F95DC2C1F95CC2C0F963
:104480005BC2BFF9410E0901C66FC60EC56F4E0E65
:10449000C46F6D0EC36F0001BED7390E0901002431
:1044A00002015B6F300E0901012002015C6F000EFA
:1044B0000901022002015D6F000E090103200201C3
:1044C0005E6F5DC200F05EC201F0026A036A01C065
:1044D000C1F900C0C0F9196AF2BE198EF29E01C07E
:1044E0004EFE00C04DFE0E0150694F69000137ECD1
:1044F0000AF019BEF28E00C001F003C002F035EFE1
:104500002BF00901C16BC151030824E3C4C300F0BF
:10451000C151016E04E0D8900032012EFCD700504A
:10452000010B16E0036AC151C20F016E080E03228F
:1045300003C0C3F9036AC151C20FE96E080E03201C
:10454000EA6EC051EF24C3C9EAFF01C0E9FFEF6E74
:10455000C12BD9D70301AD8900011200196AF2BE3F
:10456000198EF29EC6C94EFEC5C94DFE0E01506B96
:104570000A0E4F6F000137EC0AF019BEF28E02C02E
:10458000C9F901C0C8F9196AF2BE198EF29E02C0BB
:1045900054FE01C053FE0E01566B0A0E556F00010A
:1045A0007DEC01F019BEF28E01500901C55DC76FA7
:1045B000196AF2BE198EF29EC7C94DFE0001CEECFB
:1045C00008F019BEF28E01C066F2196AF2BE198EA9
:1045D000F29EC6C94EFEC5C94DFE0E01506B0A0EB5
:1045E0004F6F000137EC0AF019BEF28E02C0C6F917
:1045F00001C0C5F90901C55306E1C65304E1020132
:10460000676B39D00901196AF2BE198EF29EC6C9CC
:104610004EFEC5C94DFE0E01506B0A0E4F6F0001D4
:1046200037EC0AF019BEF28E02C0C9F901C0C8F910
:10463000196AF2BE198EF29E02C054FE01C053FEEA
:104640000E01566B0A0E556F00017DEC01F019BE8C
:10465000F28E01500901C55DC76F196AF2BE198E4D
:10466000F29EC7C94DFE0001CEEC08F019BEF28ED5
:1046700001C067F20201196AF2BE198EF29EC6C924
:104680004EFEC5C94DFE0E01506B0A0E4F6F000164
:1046900037EC0AF019BEF28E02C0C6F901C0C5F9A6
:1046A0000901C55306E1C65304E10201686B39D024
:1046B0000901196AF2BE198EF29EC6C94EFEC5C91D
:1046C0004DFE0E01506B0A0E4F6F000137EC0AF0E1
:1046D00019BEF28E02C0C9F901C0C8F9196AF2BE4A
:1046E000198EF29E02C054FE01C053FE0E01566B9D
:1046F0000A0E556F00017DEC01F019BEF28E0150DB
:104700000901C55DC76F196AF2BE198EF29EC7C94D
:104710004DFE0001CEEC08F019BEF28E01C068F229
:104720000201196AF2BE198EF29EC6C94EFEC5C9B3
:104730004DFE0E01506B0A0E4F6F000137EC0AF070
:1047400019BEF28E02C0C6F901C0C5F90901C553F0
:1047500006E1C65304E10201696B39D00901196A07
:10476000F2BE198EF29EC6C94EFEC5C94DFE0E019F
:10477000506B0A0E4F6F000137EC0AF019BEF28E33
:1047800002C0C9F901C0C8F9196AF2BE198EF29EB9
:1047900002C054FE01C053FE0E01566B0A0E556F47
:1047A00000017DEC01F019BEF28E01500901C55DDA
:1047B000C76F196AF2BE198EF29EC7C94DFE00017D
:1047C000CEEC08F019BEF28E01C069F2020132850A
:1047D0000001F0EF23F0C2C9C6F9C1C9C5F9BED6C0
:1047E000C580C5B0FED7EDC835FADFEC16F0015034
:1047F00003E008EC08F01DD0020E0A01356F00013D
:10480000DFEC16F00901C251036AC56FE8CF35FA33
:104810000001DFEC16F00901C1C900F0036A00C015
:10482000C5F900C035FA0001DFEC16F0C584C5B447
:10483000FED7A4EF2EF00901BF6BC580C5B0FED72F
:104840000801ED5101090901C06FE8CF35FA0001F7
:10485000DFEC16F0006AEDEC16F001C0BFF90901BB
:10486000BF2BC584C5B4FED7BFC901F00001FEEF60
:104870002EF0C580C5B0FED7EDC835FADFEC16F0D6
:10488000080E0A01356F0001DFEC16F0C1C935FAD8
:10489000DFEC16F0C584C5B4FED713EF2FF002018C
:1048A00032AB0DD0036A0901C451F00FE96E020E5C
:1048B0000320EA6EEFCF01F00CD00BD00201036AA7
:1048C0000901C451B10FE96E020E0320EA6EEFCF69
:1048D00001F000011200120E0901C46F0001DFDFB8
:1048E0000901C39101B0C381000EC3B1010E016E75
:1048F000000145EF27F0120E0901C46F0001CFDF60
:104900000901C39101B2C381000EC3B1010E016E52
:1049100000015EEF27F0120E0901C46F0001BFDF36
:104920000901C39101B4C381000EC3B1010E016E30
:10493000000169EF27F0FADC01C0C3F9010E09019B
:10494000C46FC451C35D0DE30001F0DC02C0C6F9C1
:1049500001C0C5F901C027FA9FEC1AF00901C42B68
:10496000F0D700011200B6EC1AF0140E0A01276FFE
:1049700000019FEC1AF0C4C927FA9FEC1AF0C5C9D0
:1049800027FA9FEC1AF0BCEC1AF0ECEF24F0036A63
:104990000901C451F00FE96E020E0320EA6EC5C989
:1049A000EFFF036AC451B10FE96E020E0320EA6EF5
:1049B000C5C9EFFF0001F2EF24F0140E0901C46F26
:1049C00000016DDF01C0C3F90901C3530CE0140EEF
:1049D000C46FC56B0001C7D7140E0901C46FC56B46
:1049E0000001D5D70901C3C901F00001E1EF27F0AB
:1049F0000901CA6BCB6BCC6BCD6BCE6BCF6B196ADD
:104A0000F2BE198EF29EC8C94EFEC7C94DFE0E01F8
:104A1000506B0A0E4F6F000137EC0AF019BEF28E90
:104A200002C0D1F901C0D0F9196AF2BE198EF29E06
:104A300002C054FE01C053FE0E01566B0A0E556FA4
:104A400000017DEC01F019BEF28E01500901C75D35
:104A5000C96F196AF2BE198EF29EC8C94EFEC7C947
:104A60004DFE0E01506B0A0E4F6F000137EC0AF03D
:104A700019BEF28E02C0C8F901C0C7F90901CF51B1
:104A8000CF2B036ACA0FE96E090E0320EA6EC9C96B
:104A9000EFFFC753B4E1C853B2E1CF07036ACF5168
:104AA000CA0FE96E090E0320EA6EEF50300FD06F87
:104AB000E8CF27FA00019FEC1AF00901CF53EDE18E
:104AC000000168EF25F0C6C9C8F9C5C9C7F990D774
:104AD00012001D0E0901C46F0001E1DE015061EFFB
:104AE00028F01C0E0901C46F0001D9DE01C0C3F912
:104AF000000E090101B2010E016E00017FEF28F0E6
:104B00001C0E0901C46F0001CADE01C0C3F9000E0A
:104B1000090101B0010E016E00018AEF28F0C4C93D
:104B2000C6F9C3C9C5F941EC20F0015012000901D2
:104B3000CE51D019800BD26FCEAF05D0CD1FCE1F76
:104B4000CD2BD8B4CE2BD0AF05D0CF1FD01FCF2BBD
:104B5000D8B4D02BCD51CF03F3CF01F0F4CF00F078
:104B6000D003F3500026CE51CF03F3500020026E45
:104B7000D2AF05D0011E021E012AD8B4022A0001BC
:104B80002FEF26F00901CB6BC96B0A0ECA6FC86BF9
:104B9000C76BC551C61104E1000E016E026EE2D072
:104BA000CB51CB2BC525E96E000EC621EA6EEFCFA7
:104BB000CCF9CC512D080CE1010EC96FCB51CB2B98
:104BC000C525E96E000EC621EA6EEFCFCCF90CD0F8
:104BD000CC512B0809E1CB51CB2BC525E96E000E3A
:104BE000C621EA6EEFCFCCF9CC512F08D8B0ACD0AB
:104BF000CC513908D8A0A8D0CC5130081EE1CB51F7
:104C0000C525E96E000EC621EA6EEF50780809E06E
:104C1000CB51C525E96E000EC621EA6EEF5058084B
:104C20000CE1100ECA6FCB2BCB51CB2BC525E96EF7
:104C3000000EC621EA6EEFCFCCF9CA510A0822E174
:104C4000CC512F081EE2CC5139081BE3CE6B0A0E63
:104C5000CD6FC8C9D0F9C7C9CFF9000168D7300EE8
:104C60000901CC5D0124C76F000E0220C86FCB5133
:104C7000CB2BC525E96E000EC621EA6EEFCFCCF92D
:104C8000DFD762D0CA5110085FE1CC51600806E25C
:104C9000CC517A0803E3CC51DF0B01D0CC51CC6F5F
:104CA000CC512F0803E2CC51390806E2CC51400820
:104CB0004BE2CC51460848E3CC512F081AE2CC51C4
:104CC000390817E3C735CD6FC835CE6FCD37CE372E
:104CD000CD37CE37CD37CE37F00ECD17300ECC5D79
:104CE000CD25016E000ECE21036E01C0C7F9C86F3D
:104CF00016D0C735CD6FC835CE6FCD37CE37CD374F
:104D0000CE37CD37CE37F00ECD17410ECC5D0A0F22
:104D1000CD25016E000ECE2101C0C7F9C86FCB5161
:104D2000CB2BC525E96E000EC621EA6EEFCFCCF97C
:104D3000CC51600806E2CC517A0803E3CC51DF0B7A
:104D400001D0CC51CC6FACD7CA510A0807E1C92DAC
:104D500005D0C71FC81FC72BD8B4C82BC7C901F0BF
:104D6000C8C902F000011BEF29F00901BF51020A76
:104D70000001D8B46DD0030AD8B471D0C90AD8B430
:104D800075D0010AD8B479D0070AD8B47DD0040A06
:104D9000D8B485D0010AD8B489D0040AD8B48DD04B
:104DA000030AD8B495D0010AD8B49DD01D0AD8B44E
:104DB000A1D0020AD8B4A4D0010AD8B4A8D0070A56
:104DC000D8B4B8D0010AD8B4CFD0030AD8B4CDD063
:104DD000010AD8B4D6D03D0AD8B4DAD0320AD8B451
:104DE000E3D0010AD8B4ECD0030AD8B4F4D0010A55
:104DF000D8B404D1050AD8B408D1010AD8B411D165
:104E00003F0AD8B42BD1030AD8B445D1070AD8B485
:104E100049D1010AD8B44DD1030AD8B451D1010AFD
:104E2000D8B459D10F0AD8B469D1010AD8B471D114
:104E3000020AD8B479D1060AD8B4ADD1010AD8B4DF
:104E400005D2020AD8B46CD2010AD8B48DD2BDD230
:104E5000020E0A01266F0001C7EC1AF0B8D2010E4B
:104E60000A01266F0001C7EC1AF0B1D2C80E0A0180
:104E7000266F0001C7EC1AF0AAD2C90E0A01266FEC
:104E80000001C7EC1AF0A3D226D501C0C3F909016D
:104E9000C66B01C0C5F90001C7EC21F098D2CA0E5B
:104EA0000A01266F0001C7EC1AF091D2CB0E0A015D
:104EB000266F0001C7EC1AF08AD21DD501C0C3F9D4
:104EC0000901C66B01C0C5F90001C7EC21F07FD212
:104ED00022D501C0C3F90901C66B01C0C5F90001A3
:104EE000C7EC21F074D2CD0E0A01266F0001C7EC89
:104EF0001AF06DD2D00E0A01266F0001C7EC1AF02D
:104F0000D20E0A01266F0001C7EC1AF060D2B6EC8F
:104F10001AF0D30E0A01276F00019FEC1AF00BDD87
:104F20002C0E0A01276F00019FEC1AF004DDBCEC87
:104F30001AF04DD2B6EC1AF0D40E0A01276F000118
:104F40009FEC1AF0F8DC2C0E0A01276F00019FEC91
:104F50001AF0F1DC2C0E0A01276F00019FEC1AF009
:104F6000EADCBCEC1AF033D232D2B6EC1AF0D60E30
:104F70000A01276F00019FEC1AF0DDDCBCEC1AF08F
:104F800026D2D70E0A01266F0001C7EC1AF01FD2F5
:104F9000B6EC1AF0EA0E0A01276F00019FEC1AF036
:104FA000CADCBCEC1AF013D2B6EC1AF0D80E0A0127
:104FB000276F00019FEC1AF0BEDCBCEC1AF007D2A0
:104FC000FCD401C0C3F90901C66B01C0C5F90001D9
:104FD000C7EC21F0FCD1B6EC1AF0DA0E0A01276F0B
:104FE00000019FEC1AF0A7DC2C0E0A01276F0001CC
:104FF0009FEC1AF0A0DCBCEC1AF0E9D1DB0E0A0140
:10500000266F0001C7EC1AF0E2D1B6EC1AF0DE0E02
:105010000A01276F00019FEC1AF08DDCBCEC1AF03E
:10502000D6D1B6EC1AF0DF0E0A01276F00019FEC13
:105030001AF081DC2C0E0A01276F00019FEC1AF098
:1050400096EC21F002C0C4F901C0C3F902C0C6F950
:1050500001C0C5F938DDBCEC1AF0B9D1B6EC1AF0D4
:10506000E00E0A01276F00019FEC1AF064DC3B0E92
:105070000A01276F00019FEC1AF096EC21F002C0A4
:10508000C4F901C0C3F902C0C6F901C0C5F91BDDEE
:10509000BCEC1AF09CD1E30E0A01266F0001C7ECAC
:1050A0001AF095D1E40E0A01266F0001C7EC1AF040
:1050B0008ED1E50E0A01266F0001C7EC1AF087D1E8
:1050C00008D501C0C3F90901C66B01C0C5F90001CB
:1050D000C7EC21F07CD1B6EC1AF0E70E0A01276F7D
:1050E00000019FEC1AF096EC21F001C0C3F901C059
:1050F00027FA9FEC1AF0BCEC1AF069D1F2D401C087
:10510000C3F90901C66B01C0C5F90001C7EC21F064
:105110005ED1F6D401C0C3F90901C66B01C0C5F95F
:105120000001C7EC21F053D196EC21F001C0C0F989
:105130000901C16BC051C15D16E2036AC151940FF0
:10514000016E030E032201C0C3F903C0C4F90001BC
:1051500096EC21F0C4C9EAFFC3C9E9FF01C0EFFF23
:105160000901C12BE7D7036AC151940FE96E030E01
:105170000320EA6EEF6A030EC46F940EC36F000142
:10518000CEDC01C0C3F90901C66B01C0C5F900013D
:10519000C7EC21F01CD196EC21F001C0C0F9090147
:1051A000C16BC051C15D16E2036AC151940F016E1B
:1051B000030E032201C0C3F903C0C4F9000196EC39
:1051C00021F0C4C9EAFFC3C9E9FF01C0EFFF09012B
:1051D000C12BE7D7036AC151940FE96E030E032078
:1051E000EA6EEF6A030EC46F940EC36F000197DC82
:1051F00001C0C2F90901C251FF0806E1C669C569CB
:105200000001C7EC21F00901C2C9C3F90C0EC46F3B
:1052100000016AEC20F00150036A640F016E030E76
:10522000032201C0C3F903C0C4F903C0C6F901C019
:10523000C5F90001A7D402C0C4F901C0C3F902C076
:10524000C6F901C0C5F9C7EC21F0C1D096EC21F038
:1052500001C0C0F90901C16BC051C15D16E2036A0A
:10526000C151A00F016E030E032201C0C3F903C098
:10527000C4F9000196EC21F0C4C9EAFFC3C9E9FFF3
:1052800001C0EFFF0901C12BE7D7036AC151A00F8D
:10529000E96E030E0320EA6EEF6A000196EC21F03E
:1052A00001C0C2F90901C251FF0805E0C2BF0AD01E
:1052B000C251040807E2C66BC56B0001C7EC21F0C0
:1052C00086D00901C2C9C3F90C0EC46F00016AEC93
:1052D00020F00150036A640F016E030E032201C027
:1052E000C3F9090103C0C4F903C0CBF901C0CAF96D
:1052F000030ECD6FA00ECC6F000101EC20F0015227
:1053000008E10901C66B010EC56F0001C7EC21F071
:1053100006D00901C66BC56B0001C7EC21F057D060
:105320000901C16BC15103081DE3C1510C0DF350BC
:10533000C46BC36F340EC325E96E030EC421EA6E3D
:10534000EF6AC1510C0DF350C46BC36F640EC325DB
:10535000E96E030EC421EA6EEF6A0301AC6B09012A
:10536000C12BE0D7000133D0B6EC1AF0EF0E0A01E2
:10537000276F00019FEC1AF09BEC24F02C0E0A0121
:10538000276F00019FEC1AF096EC21F001C0C1F9E3
:105390000901C12D0FD0000196EC21F002C0C4F923
:1053A00001C0C3F902C0C6F901C0C5F963EC25F01C
:1053B00007D00901C151020804E100019BEC24F06F
:1053C00009010001BCEC1AF002D083EC21F085EF5A
:1053D0002FF00901916B996B986B9051140A0001A1
:1053E000D8B4E8D0010AD8B4FDD04A0AD8B408D15C
:1053F0003F0AD8B424D1760AD8B42FD1010AD8B440
:1054000056D10F0AD8B453D1010AD8B450D1030AE7
:10541000D8B44DD1010AD8B44AD1070AD8B447D17B
:10542000010AD8B444D1030AD8B441D1010AD8B48E
:105430003ED13F0AD8B43BD1010AD8B438D11F0AB3
:10544000D8B435D1030AD8B432D11F0AD8B402D2A5
:10545000010AD8B40FD2070AD8B429D2080AD8B49E
:1054600040D2010AD8B43FD2030AD8B43ED2010ACE
:10547000D8B440D21C0AD8B442D2060AD8B442D218
:10548000010AD8B442D2020AD8B442D20A0AD8B425
:1054900042D20D0AD8B442D2030AD8B43FD2090A84
:1054A000D8B450D2040AD8B459D27F0AD8B45AD248
:1054B000010AD8B475D2030AD8B490D2010AD8B47C
:1054C000ABD20A0AD8B4C6D20D0AD8B420D3010A86
:1054D000D8B427D3030AD8B426D3010AD8B425D325
:1054E0000F0AD8B431D37F0AD8B43DD30F0AD8B449
:1054F00059D36D0AD8B47CD3030AD8B47CD3010A3B
:10550000D8B47CD30F0AD8B479D3010AD8B476D3EF
:10551000030AD8B439EF2EF0010AD8B445EF2EF0C3
:10552000070AD8B44BEF2EF0010AD8B451EF2EF091
:10553000030AD8B45DEF2EF03F0AD8B472EF2EF014
:10554000030AD8B476EF2EF0010AD8B48BEF2EF010
:10555000070AD8B4F8EF2EF0010AD8B4FCEF2EF009
:10556000030AD8B409EF2FF0010AD8B415EF2FF0D1
:105570000F0AD8B41AEF2FF0010AD8B41FEF2FF09A
:10558000030AD8B424EF2FF0010AD8B429EF2FF082
:10559000070AD8B445EF2FF01C0AD8B466EF2FF0F5
:1055A000010AD8B472EF2FF0030AD8B47AEF2FF0C3
:1055B00081EF2FF00801FCB10AD0DDA108D0010E67
:1055C0000A01346F000182EC0FF0F4D70801F3C830
:1055D000C6F9F2C8C5F90001C7EC21F00801FC9139
:1055E00086EF2FF0000E0801FCB1010E0901BF6F1C
:1055F000C66BC56F0001C7EC21F0080186EF2FF0E4
:105600000801DC5310E1DDA10ED0020E0901BF6FCD
:10561000FA0EC06F0001F8EC21F00901BF2FF8D796
:105620000001EED708010901C66BDCC8C5F900010D
:10563000C7EC21F00301AD9F080186EF2FF0000EAB
:105640000301ADBF010E0901BF6FC66BC56F00013D
:10565000C7EC21F0080186EF2FF096EC21F002C094
:1056600093F901C092F93AEF22F002C0C0F901C0EB
:10567000BFF9196AF2BE198EF29E02C04EFE01C039
:105680004DFE93C950FE92C94FFE37EC0AF019BE89
:10569000F28E00C0BFF903C0C0F903C0C6F900C054
:1056A000C5F90001C7EC21F0080186EF2FF096EC58
:1056B00021F002C095F901C094F996EC21F002C0E6
:1056C00093F901C092F9170E0901905DD80FD8B077
:1056D000B8D0280F000189EF2FF0090194519227CB
:1056E00095519323AED009019451925F9551935BEC
:1056F000A8D0196AF2BE198EF29E93C954FE92C9BF
:1057000053FE95C956FE94C955FE7DEC01F019BEB5
:10571000F28E02C093F901C092F9090192D0196A80
:10572000F2BE198EF29E93C94EFE92C94DFE95C9E6
:1057300050FE94C94FFE37EC0AF019BEF28E02C03B
:1057400093F901C092F909017CD0196AF2BE198E51
:10575000F29E93C94EFE92C94DFE95C950FE94C962
:105760004FFE37EC0AF019BEF28E00C092F9090123
:1057700003C093F966D009019451925D03E19551FC
:10578000935D02E0000E01D0010E936B926F59D031
:1057900009019551935D04E305E19251945D02E3A3
:1057A000000E01D0010E936B926F4BD00901935103
:1057B000955D04E305E19451925D02E3000E01D092
:1057C000010E936B926F3DD009019251931103E04A
:1057D0009451951102E1000E01D0010E936B926F6E
:1057E00030D009019251931105E19451951102E1D4
:1057F000000E01D0010E936B926F23D009019451DA
:10580000921B9551931B1DD009019351955D04E3A3
:1058100005E19251945D02E2000E01D0010E936BFE
:10582000926F0FD009019551935D04E305E1945106
:10583000925D02E2000E01D0010E936B926F01D0D7
:10584000090193C9C6F992C9C5F90001C7EC21F055
:1058500008015CD396EC21F001500210000ED8B480
:10586000010E0901BF6FC66BC56F0001C7EC21F0C7
:1058700008014CD396EC21F002C099F901C098F9C7
:1058800096EC21F002C0C0F9D89009010134026EF3
:10589000C035036E0250330FE96E020E0320EA6E2C
:1058A00099C9ECFFED5298C9EFFF08012FD396EC90
:1058B00021F002C0C0F9D89009010134026EC03550
:1058C000036E0250330FE96E020E0320EA6EECCF36
:1058D000C6F9ED52EFCFC5F90001C7EC21F0080180
:1058E00015D3080113D3080111D3010E0301C46FAE
:1058F00008010CD3020E0301C46F080107D309018C
:10590000912B00010901912B00010901912B00014C
:105910000901912B00010901912B000191C926FA7F
:10592000A6EC12F00901905132080AE1000196EC50
:1059300021F002C0DFF801C0DEF802013281090166
:105940000801E4D296EC21F002C0C0F901C0BFF911
:1059500001C027FAAEEC14F00801D8D296EC21F081
:105960000801D4D296EC21F002C093F901C092F95B
:10597000090192510801C115006E036A0050090126
:10598000925D03E10350935D02E0000E01D0010E31
:10599000BF6FC66BC56F0001C7EC21F00801B6D21E
:1059A00096EC21F002C093F901C092F90801C151AF
:1059B000FF0A09019215006E036A0050925D03E12F
:1059C0000350935D02E0000E01D0010EBF6FC66B65
:1059D000C56F0001C7EC21F0080198D296EC21F0C8
:1059E00002C093F901C092F9090192510801C01552
:1059F000006E036A00500901925D03E10350935D5C
:105A000002E0000E01D0010EBF6FC66BC56F000132
:105A1000C7EC21F008017AD296EC21F002C093F98C
:105A200001C092F90801C051FF0A09019215006EE8
:105A3000036A0050925D03E10350935D02E0000EA3
:105A400001D0010EBF6FC66BC56F0001C7EC21F01E
:105A500008015CD296EC21F002C0C0F901C0BFF988
:105A6000C20E09010124E96E080E0220EA6EEF5011
:105A70000A01296B286F0001F8EC12F003C0C4F989
:105A800002C0C3F901C0C2F900C0C1F903C02FFAB6
:105A900002C02EFA01C02DFA00C02CFA0A01336BA5
:105AA000326B7F0E316F860E306F000113EC13F0F6
:105AB00003C0C4F902C0C3F901C0C2F900C0C1F9F2
:105AC00003C02FFA02C02EFA01C02DFA00C02CFA32
:105AD0000A01336B326B480E316F850E306F000157
:105AE000C2EC13F003C02BFA02C02AFA01C029FA53
:105AF00000C028FA3DEC14F001C0C1F90901C66BE1
:105B000001C0C5F90001C7EC21F00801FFD1196AF5
:105B1000F2BE198EF29E72EC08F019BEF28E0801E8
:105B2000F5D10801F3D10801F1D196EC21F001C0C3
:105B3000BFF90901C06BC0C9C6F901C0C5F90001B0
:105B4000C7EC21F00801E2D196EC21F002C0BFF9C8
:105B50000901C06BC0C9C6F902C0C5F90001C7EC94
:105B600021F00801D3D196EC21F001C091F9010E8A
:105B70000901915DBF6F196AF2BE198EF29EE8CFDE
:105B800049FE000116EC0AF019BEF28E02C0C0F9FF
:105B900001C0BFF902C0C6F901C0C5F9C7EC21F0C8
:105BA0000801B4D196EC21F001C091F9010E090170
:105BB000915DBF6F196AF2BE198EF29EE8CF49FE61
:105BC000000116EC0AF019BEF28E02C0C0F9D8909E
:105BD000036A09010230026E0310000ED8B4010EF0
:105BE000BF6FC66BC56F0001C7EC21F008018ED1F5
:105BF0008B8008018BD18B90080188D10A01266B1C
:105C00000001A6EC12F0030E0A01266F0001A6ECBB
:105C100012F0010E0A01286F0001A7EC11F096ECBA
:105C200021F001C091F90901905157080AE191C989
:105C300028FA010E0A01296F00015BEC14F017D05D
:105C400009019051580807E191C9C0F9000181ECA0
:105C500022F00DD00901C36991C9C4F900016AECB1
:105C600020F001C0BFF901C0C0F981EC22F00801A9
:105C70004DD196EC21F002C093F901C092F992C97E
:105C800026FAF8EC14F0080141D10801DD8BC5803B
:105C9000C5B0FED73BD1C584C5B4FED70801DD9B96
:105CA00035D196EC21F002C0C0F901C0BFF901C0A6
:105CB00035FADFEC16F0080129D196EC21F002C08C
:105CC000C0F901C0BFF901C000F0EDEC16F001C051
:105CD000BFF90901C66B01C0C5F90001C7EC21F08D
:105CE000080114D1C7EC17F0080110D196EC21F08F
:105CF00002C0C0F901C0BFF901C028FA46EC18F093
:105D000001C0BFF90901C66B01C0C5F90001C7ECAC
:105D100021F00801FBD096EC21F002C093F901C0FC
:105D200092F90901925102081BE1935319E1000114
:105D300096EC21F002C0C0F901C0BFF902C0C2F95F
:105D400001C0C1F9EBEF23F0020E0901BF6F960EFF
:105D5000C06F0001F8EC21F00901BF2FF8D746D041
:105D60009251030802E1935302E0000E01D0010EAC
:105D7000BF6F9251050802E1935302E0000E01D07B
:105D8000010EBF1133E0000196EC21F001C09DF936
:105D90000901916B9D51915D16E2036A91519E0F2D
:105DA000016E090E032201C0BFF903C0C0F9000152
:105DB00096EC21F0C0C9EAFFBFC9E9FF01C0EFFFBF
:105DC0000901912BE7D7036A9D519E0FE96E090ED9
:105DD0000320EA6EEF6A92C926FA090E0A01286FBB
:105DE0009E0E276F0001BAEC18F0090108018ED051
:105DF00089EC19F008018AD01BEF24F001C0BFF92B
:105E00000901C66B01C0C5F90001C7EC21F008010A
:105E10007DD096EC21F002C0C0F901C0BFF901C0ED
:105E2000C1F939EF24F0080171D00801DD99B00EF5
:105E3000ED6F6CD00801DD99B20EED6F67D00801EF
:105E4000DD99B40EED6F62D00801DD99B60EED6FED
:105E50005DD096EC21F002C0C0F901C0BFF996EC0C
:105E600021F002C0C2F901C0C1F996EC21F002C0D4
:105E7000C4F901C0C3F9BFC92AFAC1C92BFA01C0CC
:105E80002CFAB9EC17F0080141D096EC21F002C0D1
:105E9000C0F901C0BFF996EC21F002C0C2F901C0FF
:105EA000C1F9BFC92AFA01C02BFA090E0A012D6FE8
:105EB0009A0E2C6F00016EEC17F00901C66B9AC99F
:105EC000C5F90001C7EC21F0080120D096EC21F0C3
:105ED00002C0E9F801C0E8F80801E76BE66BE56B82
:105EE000E46B14D0E7C8C6F9E6C8C5F9C7EC21F0E1
:105EF00008010CD00801E76BE66BE56BE46B06D09C
:105F0000000190C9BFF9B5EF26F00801000177EF55
:105F100033F0E824F76AF7362D0FF66E5F0EF7229E
:105F20000A00F550FA6E0800F550F96EDA56E6569A
:105F3000F2561E574A5776579057AC57C857E257F4
:105F4000FC574058405840584058405840584058D6
:105F50004058405840584058405840584058405881
:105F60004058405840584058405840584058405871
:105F700040584058405840582458085809018C6BE4
:105F80008B6B83516E085EE1020E020155250901FB
:105F90008B6F000E0201562109018C6F000166EC27
:105FA00021F0090101C091F9906B000166EC21F02C
:105FB0000150090190250201556F000E0901912140
:105FC0000201566F000166EC21F00901866B01C0E9
:105FD00085F9846B865303E18551845D10E20001ED
:105FE00096EC21F002C091F901C090F902C093F93A
:105FF00001C092F9ABEC21F00901842BEBD7936B34
:106000002BC092F90001ABEC21F08CC993F98BC93C
:1060100092F9ABEC21F0020E09018525016E000E0C
:106020008621036E015001012D5D0901906F000E64
:106030000354916F936F90C992F90001ABEC21F07A
:1060400056D309018351000A000141E0010A48E0EA
:10605000030A53E06D0AD8B467D06C0AD8B4B6D03E
:106060006E0AD8B4CBD0690AD8B4EED0010AD8B43D
:1060700032D1030AD8B450D1010AD8B47CD10F0A66
:10608000D8B479D1010AD8B4B9D1030AD8B4F3D1BC
:10609000010AD8B40ED23B0AD8B432D23C0AD8B4E2
:1060A000BBD2010AD8B4BCD2030AD8B4BBD2010A0D
:1060B000D8B4D0D21F0AD8B4E8D2010AD8B4EDD2ED
:1060C000030AD8B4F2D2010AD8B4F4D20CD308012E
:1060D000DD918B9202012F6B2E6B316B306B08D3ED
:1060E00066EC21F001C090F90901C66B01C0C5F949
:1060F0000001C7EC21F00201FBD266EC21F009019E
:1061000001C091F9906B000166EC21F0015009018A
:106110009027000E912391C9C6F990C9C5F90001D5
:10612000C7EC21F00201E4D266EC21F00901866B94
:1061300001C085F98551020155250901906F8651ED
:10614000020156210901916F010E905D8D6F000EC5
:1061500091598E6F010E8D250201556F000E0901B8
:106160008E210201566F0901846B865303E185512C
:10617000845D23E28DC990F9E80E8E25916F8451DC
:10618000905F000E915BF2CF92F9F29EF86A91C98E
:10619000F7FF90C9F6FF0900F5500800F5CF03F0AE
:1061A000F86A92BFF28E8F6FC66B8FC9C5F9000176
:1061B000C7EC21F00901842BD8D786C9C6F985C957
:1061C000C5F90001C7EC21F0020192D2010E0201D3
:1061D00055250901906F000E020156210901916FAA
:1061E000C66F90C9C5F90001C7EC21F066EC21F03B
:1061F000015002015527000E56237AD2020E0201E9
:1062000055250901906F000E020156210901916F79
:10621000C66F90C9C5F90001C7EC21F066EC21F00A
:10622000090101C091F9906B000166EC21F0015069
:1062300009019025016E000E9121036E01500201AB
:1062400055270350562354D296EC21F002C08CF906
:1062500001C08BF90201565109018C5D0EE308E182
:106260008B510201555DD8A002D0090106D0090169
:106270008CC956F28BC955F228D08CC956F28BC9FD
:1062800055F2000196EC21F002C031F201C030F26B
:106290000201315303E13051010804E23051D8B416
:1062A00031073007302D02D031530EE031C2C6F92C
:1062B00030C2C5F90001C7EC21F056C2C6F955C27B
:1062C000C5F9C7EC21F0020109010801E16B050ED7
:1062D000E06F02010DD296EC21F00150021009E0AE
:1062E00096EC21F096EC21F002C056F201C055F276
:1062F00011D096EC21F002C056F201C055F256C200
:10630000C6F955C2C5F9C7EC21F00801E16B050ECD
:10631000E06F00010201ECD166EC21F009018C6B09
:1063200001C08BF90001DFEC21F002C086F901C049
:1063300085F986C993F985C992F9ABEC21F0090179
:106340008B518525906F8C518621916FD890903517
:10635000026E9135036E02502E0FE96E010E03207E
:10636000EA6EECCFC6F9ED52EFCFC5F90001C7ECEC
:1063700021F00201BDD109018351080808E10001A3
:1063800096EC21F002C08CF901C08BF909010001E3
:10639000DFEC21F002C086F901C085F9DFEC21F0C5
:1063A00002C056F201C055F2DFEC21F002C088F9BC
:1063B00001C087F90901885308E12B50875D05E288
:1063C000000196EC21F0F6D7090186530AE101019C
:1063D0002D510901855D05E20001DFEC21F0090185
:1063E000F4D78351080808E18CC9C6F98BC9C5F9EF
:1063F0000001C7EC21F0090102017AD196EC21F0ED
:1064000002C02FF201C02EF296EC21F002C031F250
:1064100001C030F256C2C6F955C2C5F9C7EC21F029
:106420000201315303E13051010813E231C2C6F9D0
:1064300030C2C5F90001C7EC21F02FC2C6F92EC247
:10644000C5F9C7EC21F02FC256F22EC255F211D079
:106450000201302D07D0315305E12FC256F22EC272
:1064600055F208D0000196EC21F002C056F201C0AE
:1064700055F202013DD196EC21F002C086F901C02F
:1064800085F996EC21F002C088F901C087F909016D
:10649000875188110CE056C2C6F955C2C5F90001F2
:1064A000C7EC21F086C956F285C955F209010201EF
:1064B0001FD196EC21F002C086F901C085F996EC57
:1064C00021F002C088F901C087F996EC21F002C0E2
:1064D0008AF901C089F956C2C6F955C2C5F9C7EC97
:1064E00021F0090189518A1105E088C956F287C94E
:1064F00055F204D086C956F285C955F20201F8D08A
:1065000096EC21F002C086F901C085F996EC21F0E5
:1065100002C088F901C087F996EC21F002C08AF91F
:1065200001C089F90901875188114EE08A31916FC4
:106530008931906F91339033913390331F0E9117BF
:10654000680E9025E96E090E9121EA6EEFCF00F0FA
:106550008951070B936F946B9351016E04E0D890AF
:106560000032012EFCD700B02FD056C2C6F955C25A
:10657000C5F90001C7EC21F086C956F285C955F26C
:1065800009018A31916F8931906F91339033913342
:1065900090331F0E9117680E9025016E090E912100
:1065A000036E01C0E9FFEA6E8951070B926F936B8E
:1065B000010E006E9251016E04E0D8900036012E5B
:1065C000FCD70050EF1226D08751881123E18A3181
:1065D000916F8931906F91339033913390331F0EC7
:1065E0009117680E9025016E090E9121036E01C06E
:1065F000E9FFEA6E8951070B926F936B010E006EF3
:106600009251016E04E0D8900036012EFCD7005064
:10661000FF0AEF1602016CD089EC08F0020168D085
:10662000020166D096EC21F002C02FF201C02EF2DA
:1066300056C2C6F955C2C5F9C7EC21F02FC2C6F93A
:106640002EC2C5F9C7EC21F02FC256F22EC255F268
:1066500002014ED096EC21F002C02FF201C02EF2C2
:106660000201316B306B0901C66BC56B0001C7ECD1
:1066700021F02FC2C6F92EC2C5F9C7EC21F02FC2F6
:1066800056F22EC255F2020133D096EC21F002C030
:10669000DFF801C0DEF802012BD0E3C8C6F9E2C87A
:1066A000C5F9C7EC21F0020123D00801E36BE26BCE
:1066B00002011ED096EC21F002C08CF901C08BF9CA
:1066C0008CC990F90901916B8BC992F9936B8CC9B4
:1066D0002CFA000157EC1AF092C92CFA57EC1AF078
:1066E000020106D0000183C990F9E9EF29F0020107
:1066F0000001FAEF34F0F86AD09E078E94869488F1
:10670000770EC86E280EC66EC78EC79C2A6A7E9604
:10671000190EB06EA60EAD6E900EAC6E02012F6B10
:106720002E6B316B306B329132835F6B606B616BC0
:10673000626B636B656B646B3285666B676B686BF2
:10674000696B32876A6B6B6B6C6B6D6B280E6E6F4F
:106750003299AF6BB06B328B03012F6B010E306F30
:10676000316B0201329D0301326B336B0201329FA8
:106770000301AC6BAD91020EED6FAD930801BC6BE4
:106780000301AD95AD970801BE6BC06BC16B0301F2
:10679000AD99AD9BAD9D0801D86B690EDA6FD969D3
:1067A000DB6B0301AD9F0801DD91DD93DD95DF6BB0
:1067B000DE6BE16BE06BE36BE26BE56BE46BE76B6D
:1067C000E66BE96B0A0EE86FEA6BEB6BDD97EC6B3F
:1067D000B40EED6FDD89DD9BF36BF26BF56BF46B43
:1067E000DD8DF76BF66BF86BDD8FFB6BFC91FD6B52
:1067F000FC93FE6BFC95FF6BFC970901416B406BB2
:10680000456B446B020E466F676B0801FC990901EA
:10681000786BC088FF0EC16EC098C29CC29EC088B3
:10682000C26EC098D26AD16A26D003001E00040C42
:10683000204233000202590000784334003F43AE47
:10684000001003EE187C1A7C0A7C0D7C197C1B7CE2
:106850000B7C0C7C7E4810000808B30B0A0703026F
:106860000100040A48C2FF0CC0000408EEB0B2B434
:10687000B61049680000000EF86E680EF76E2A0E1A
:10688000F66E0900F550006E000A13E00900F5509D
:10689000016EE8BE05D00F0BEA6E0900F5CFE9FFE7
:1068A00001BC090001AC0900F5CFEEFF004EE9D7AD
:1068B000F9D7F86AF19E9B8C010E0A01346F000132
:1068C00082EC0FF097EF0FF042EF10F091EF10F025
:1068D000F2CF82F9F29EF86AF90EF76EF20EF66EBA
:1068E0000900F5500800F5CF03F0F86A090182BFEE
:1068F000F28E826F836B822D0CD083530AE1196A6A
:10690000F2BE198EF29E00017FEC08F019BEF28EE5
:1069100009010001CDEF1AF04FEF1EF09DEF1EF0C0
:1069200079EF1FF085EF1FF058EF21F00801FCA56B
:1069300011D0010E0A012E6F030E306FAE0E2F6FB5
:10694000326B3F0E316F020E336F0001C8EC19F04D
:106950000801FC95FCA711D0010E0A012E6F080E4C
:10696000306F4F0E2F6F326B3F0E316F020E336F51
:106970000001C8EC19F00801FC97FF532AE002015E
:106980006E51270802E2B26BF16B32AB11D0010EEF
:106990000A012E6F020E306FF00E2F6F326B3F0E1A
:1069A000316F020E336F0001C8EC19F010D00201F4
:1069B000010E0A012E6F020E306FB10E2F6F326B77
:1069C0003F0E316F020E336F0001C8EC19F0080161
:1069D000FF6BDDA111D0DE51DF110DE1E051E111BE
:1069E0000AE1000166EC21F001C082F901C083F9DF
:1069F000BEEF2FF008010BD00301ADAD07D00801A9
:106A0000C16B0001C1EC0FF00301AD9D0801000155
:086A1000B1EC19F07FD703007F
:026B0000120081
:06FFF800A6F745F7F8FA38
:00000001FF
;PIC18F66J50
;CRC=61E8  CREATED="24-Sep-20 13:45"
