>>> Warning 203 "C:\Program Files (x86)\PICC\Drivers\pic18_usb.c" Line 727(1,1): Condition always TRUE
>>> Warning 203 "rpt10.c" Line 2501(1,1): Condition always TRUE
>>> Warning 201 "C:\Users\peera\Documents\Works\LIL\gogo-5\pic-firmware\evalOpcode.c" Line 1236(1,1): Assignment inside relational expression
>>> Warning 208 "C:\Users\peera\Documents\Works\LIL\gogo-5\pic-firmware\i2c.h" Line 2(5,13): Function not void and does not return a value  i2cWrite
>>> Warning 208 "C:\Users\peera\Documents\Works\LIL\gogo-5\pic-firmware\i2c.h" Line 4(5,12): Function not void and does not return a value  i2cRead
>>> Warning 203 "C:\Users\peera\Documents\Works\LIL\gogo-5\pic-firmware\ds1307.c" Line 12(1,1): Condition always TRUE
>>> Warning 201 "C:\Users\peera\Documents\Works\LIL\gogo-5\pic-firmware\raspberrypi.c" Line 261(1,1): Assignment inside relational expression
>>> Warning 201 "C:\Users\peera\Documents\Works\LIL\gogo-5\pic-firmware\raspberrypi.c" Line 265(1,1): Assignment inside relational expression
>>> Warning 201 "C:\Users\peera\Documents\Works\LIL\gogo-5\pic-firmware\raspberrypi.c" Line 272(1,1): Assignment inside relational expression
>>> Warning 216 "rpt10.c" Line 430(1,2): Interrupts disabled during call to prevent re-entrancy:  (setLow)
>>> Warning 216 "rpt10.c" Line 430(1,2): Interrupts disabled during call to prevent re-entrancy:  (usb_token_reset)
>>> Warning 216 "rpt10.c" Line 430(1,2): Interrupts disabled during call to prevent re-entrancy:  (@MUL1616)
>>> Warning 216 "rpt10.c" Line 430(1,2): Interrupts disabled during call to prevent re-entrancy:  (usb_flush_out)
>>> Warning 216 "rpt10.c" Line 430(1,2): Interrupts disabled during call to prevent re-entrancy:  (setHigh)
>>> Warning 216 "rpt10.c" Line 430(1,2): Interrupts disabled during call to prevent re-entrancy:  (getBit)
>>> Warning 216 "rpt10.c" Line 430(1,2): Interrupts disabled during call to prevent re-entrancy:  (Char2Segments)
>>> Warning 216 "rpt10.c" Line 430(1,2): Interrupts disabled during call to prevent re-entrancy:  (usb_tbe)
>>> Warning 216 "rpt10.c" Line 430(1,2): Interrupts disabled during call to prevent re-entrancy:  (usb_flush_in)
>>> Warning 216 "rpt10.c" Line 430(1,2): Interrupts disabled during call to prevent re-entrancy:  (stopLogoProcedures)
>>> Warning 216 "rpt10.c" Line 430(1,2): Interrupts disabled during call to prevent re-entrancy:  (startLogoProcedures)
>>> Warning 216 "rpt10.c" Line 430(1,2): Interrupts disabled during call to prevent re-entrancy:  (startStopLogoProcedures)
>>> Warning 216 "rpt10.c" Line 430(1,2): Interrupts disabled during call to prevent re-entrancy:  (@DIV1616)
>>> Warning 216 "rpt10.c" Line 430(1,2): Interrupts disabled during call to prevent re-entrancy:  (readSensor)
>>> Warning 202 "C:\Users\peera\Documents\Works\LIL\gogo-5\pic-firmware\usb_desc_hid_gogoboard.h" Line 332(6,28): Variable never used:   USB_STRING_DESC_OFFSET
>>> Warning 202 "C:\Users\peera\Documents\Works\LIL\gogo-5\pic-firmware\24256.c" Line 35(14,20): Variable never used:   status
>>> Warning 202 "C:\Users\peera\Documents\Works\LIL\gogo-5\pic-firmware\logovm.h" Line 284(17,27): Variable never used:   gblRWCount
>>> Warning 202 "C:\Users\peera\Documents\Works\LIL\gogo-5\pic-firmware\i2cDisplay.h" Line 23(6,27): Variable never used:   gblUseOnBoard7Segment
>>> Warning 202 "rpt10.c" Line 282(5,16): Variable never used:   gbl_cur_cmd
>>> Warning 202 "rpt10.c" Line 282(18,31): Variable never used:   gbl_cur_param
>>> Warning 202 "rpt10.c" Line 282(33,44): Variable never used:   gbl_cur_ext
>>> Warning 202 "rpt10.c" Line 282(46,62): Variable never used:   gbl_cur_ext_byte
>>> Warning 202 "rpt10.c" Line 283(5,20): Variable never used:   gblExtCMDBuffer
>>> Warning 202 "rpt10.c" Line 284(6,19): Variable never used:   gblExtCmdMode
>>> Warning 202 "rpt10.c" Line 285(5,17): Variable never used:   gblExtCmdLen
>>> Warning 202 "rpt10.c" Line 286(5,25): Variable never used:   gblExtCmdBufferIndex
>>> Warning 202 "rpt10.c" Line 305(5,20): Variable never used:   gblActiveMotors
>>> Warning 202 "rpt10.c" Line 351(5,18): Variable never used:   gblCmdTimeOut
>>> Warning 202 "rpt10.c" Line 391(7,16): Variable never used:   gblPrevIR
>>> Warning 202 "rpt10.c" Line 418(7,17): Variable never used:   gblCCPtest
>>> Warning 202 "rpt10.c" Line 419(5,16): Variable never used:   gblCCPindex
>>> Warning 202 "rpt10.c" Line 420(6,23): Variable never used:   gblPrintCCPbuffer
>>> Warning 202 "rpt10.c" Line 1491(8,9): Variable never used:   i
>>> Warning 202 "rpt10.c" Line 1846(8,9): Variable never used:   i
>>> Warning 202 "rpt10.c" Line 1846(10,11): Variable never used:   j
>>> Warning 202 "rpt10.c" Line 2088(10,16): Variable never used:   InByte
>>> Warning 202 "rpt10.c" Line 2089(9,34): Variable never used:   doNotStopRunningProcedure
>>> Warning 202 "rpt10.c" Line 2091(9,17): Variable never used:   out_data
>>> Warning 202 "rpt10.c" Line 2440(7,16): Variable never used:   SensorVal
>>> Warning 202 "rpt10.c" Line 2441(7,16): Variable never used:   uploadLen
>>> Warning 202 "rpt10.c" Line 2441(17,24): Variable never used:   counter
>>> Warning 202 "rpt10.c" Line 2444(7,10): Variable never used:   foo
>>> Warning 202 "rpt10.c" Line 2446(5,6): Variable never used:   i
>>> Warning 202 "C:\Users\peera\Documents\Works\LIL\gogo-5\pic-firmware\evalOpcode.c" Line 482(19,23): Variable never used:   opr3
>>> Warning 202 "C:\Users\peera\Documents\Works\LIL\gogo-5\pic-firmware\evalOpcode.c" Line 485(7,13): Variable never used:   strPtr
>>> Warning 202 "C:\Users\peera\Documents\Works\LIL\gogo-5\pic-firmware\i2cDisplay.c" Line 24(8,14): Variable never used:   inbyte
>>> Warning 202 "C:\Users\peera\Documents\Works\LIL\gogo-5\pic-firmware\i2cDisplay.c" Line 64(10,14): Variable never used:   temp
>>> Warning 202 "C:\Users\peera\Documents\Works\LIL\gogo-5\pic-firmware\i2cDisplay.c" Line 124(8,14): Variable never used:   strLen
>>> Warning 202 "C:\Users\peera\Documents\Works\LIL\gogo-5\pic-firmware\7segment.c" Line 237(9,19): Variable never used:   charToShow
>>> Warning 202 "C:\Users\peera\Documents\Works\LIL\gogo-5\pic-firmware\7segment.c" Line 239(8,9): Variable never used:   i
      Memory usage:   ROM=41%      RAM=62% - 94%
      0 Errors,  59 Warnings.
Build Successful.
