alembic==1.4.2
amqp==1.4.9
aniso8601==8.0.0
anyjson==0.3.3
appdirs==1.4.4
billiard==3.3.0.23
blinker==1.4
boto3==1.14.56
botocore==1.17.56
#cdecimal @ file:///C:/Users/likhi/Downloads/b2b_backend-dev/b2b_backend-dev/cdecimal-2.3.tar.gz
celery==3.1.23
certifi==2020.6.20
cffi==1.14.2
chardet==3.0.4
click==7.1.2
configparser==4.0.2
contextlib2==0.6.0.post1
cryptography==3.1
distlib==0.3.1
docutils==0.15.2
enum34==1.1.10
filelock==3.0.12
Flask==0.10.1
Flask-Cors==2.1.2
Flask-Ext==0.1
Flask-Mail==0.9.1
flask-marshmallow==0.6.2
Flask-Migrate==1.8.0
Flask-RESTful==0.3.5
Flask-Script==2.0.5
Flask-SQLAlchemy==2.4.4
futures==3.3.0
html5lib==0.9999999
idna==2.10
importlib-metadata==1.7.0
importlib-resources==3.0.0
instamojo-wrapper==1.2.0
ipaddress==1.0.23
itsdangerous==0.24
Jinja2==2.8
jmespath==0.10.0
json2html==1.3.0
kombu==3.0.37
lxml==4.5.2
#m3-cdecimal==2.3
Mako==1.1.3
MarkupSafe==1.1.1
marshmallow==2.21.0
numpy==1.16.6
onetimepass==1.0.1
opentok==2.4.0
passlib==1.7.2
pathlib2==2.3.5
paypalrestsdk==1.13.1
Pillow==6.2.2
psycopg2==2.8.6
pycparser==2.20
pyOpenSSL==19.1.0
PyPDF2==1.26.0
python-dateutil==2.8.1
python-editor==1.0.4
pytz==2015.7
rauth==0.7.3
reportlab==3.5.49
requests==2.9.1
s3transfer==0.3.3
scandir==1.10.0
schedule==0.6.0
simplejson==3.8.2
singledispatch==3.4.0.3
six==1.15.0
SQLAlchemy==1.1.0
typing==3.7.4.3
urllib3==1.25.10
virtualenv==20.0.31
webargs==5.5.3
webencodings==0.5.1
Werkzeug==1.0.1
xhtml2pdf==0.0.6
zipp==1.2.0