digraph g {
    # Legend:
    State[shape=box]
    EntryPoint

    # States:
    Ready[shape=box]
    PendingTransfer[shape=box]
    DichotomyInProgress[shape=box]
    AwaitingStep[shape=box]

    # Default happy-path
    Ready -> StartTransfer -> PendingTransfer
    PendingTransfer -> FinishTransfer -> Ready

    # Fast forward to a new state when all involved parties
    # agree on the new state (to run many transactions off-chain,
    # as long as all invlolved parties sign these transactions)
    Ready -> FastForward -> Ready [constraint=false]

    # Litigation part 1: dichotomy on the execution trace
    PendingTransfer -> StartLitigation -> DichotomyInProgress
    DichotomyInProgress -> TraceDichotomy -> DichotomyInProgress
    TraceDichotomy -> AwaitingStep

    # Litigation alternative path: if both parties agree on the result
    PendingTransfer -> IncorrectResult -> Ready

    # Litigation part 2: execution of a single step
    AwaitingStep -> Step
    Step -> PendingTransfer # Litigator was lying
    Step -> Ready           # The person requesting the transfer was lying, transfer cancelled.

    # Settle after the end of a timeout or when admitting defeat.
    DichotomyInProgress -> Settle
    AwaitingStep -> Settle
    Settle -> PendingTransfer
}