<svg width="17" height="12" viewBox="0 0 17 12" fill="none" xmlns="http://www.w3.org/2000/svg">
<path d="M16.3496 2.53711C16.1738 1.83398 15.6172 1.27734 14.9434 1.10156C13.6836 0.75 8.70312 0.75 8.70312 0.75C8.70312 0.75 3.69336 0.75 2.43359 1.10156C1.75977 1.27734 1.20312 1.83398 1.02734 2.53711C0.675781 3.76758 0.675781 6.4043 0.675781 6.4043C0.675781 6.4043 0.675781 9.01172 1.02734 10.2715C1.20312 10.9746 1.75977 11.502 2.43359 11.6777C3.69336 12 8.70312 12 8.70312 12C8.70312 12 13.6836 12 14.9434 11.6777C15.6172 11.502 16.1738 10.9746 16.3496 10.2715C16.7012 9.01172 16.7012 6.4043 16.7012 6.4043C16.7012 6.4043 16.7012 3.76758 16.3496 2.53711ZM7.0625 8.77734V4.03125L11.2227 6.4043L7.0625 8.77734Z" fill="#DFEEB6"/>
</svg>
