%YAML 1.1
%TAG !u! tag:unity3d.com,2011:
--- !u!1001 &178072457371968709
PrefabInstance:
  m_ObjectHideFlags: 0
  serializedVersion: 2
  m_Modification:
    m_TransformParent: {fileID: 0}
    m_Modifications:
    - target: {fileID: -8913766511103523227, guid: 4a2dc2a2ff29ffc439d06a186665df0d, type: 3}
      propertyPath: m_Materials.Array.data[0]
      value: 
      objectReference: {fileID: 2100000, guid: eaa1b23cc0e83d04c85590b1ea6b2525, type: 2}
    - target: {fileID: -8679921383154817045, guid: 4a2dc2a2ff29ffc439d06a186665df0d, type: 3}
      propertyPath: m_RootOrder
      value: 0
      objectReference: {fileID: 0}
    - target: {fileID: -8679921383154817045, guid: 4a2dc2a2ff29ffc439d06a186665df0d, type: 3}
      propertyPath: m_LocalPosition.x
      value: -4.6
      objectReference: {fileID: 0}
    - target: {fileID: -8679921383154817045, guid: 4a2dc2a2ff29ffc439d06a186665df0d, type: 3}
      propertyPath: m_LocalPosition.y
      value: 0.1
      objectReference: {fileID: 0}
    - target: {fileID: -8679921383154817045, guid: 4a2dc2a2ff29ffc439d06a186665df0d, type: 3}
      propertyPath: m_LocalPosition.z
      value: 29.7
      objectReference: {fileID: 0}
    - target: {fileID: -8679921383154817045, guid: 4a2dc2a2ff29ffc439d06a186665df0d, type: 3}
      propertyPath: m_LocalRotation.w
      value: 1
      objectReference: {fileID: 0}
    - target: {fileID: -8679921383154817045, guid: 4a2dc2a2ff29ffc439d06a186665df0d, type: 3}
      propertyPath: m_LocalRotation.x
      value: 0
      objectReference: {fileID: 0}
    - target: {fileID: -8679921383154817045, guid: 4a2dc2a2ff29ffc439d06a186665df0d, type: 3}
      propertyPath: m_LocalRotation.y
      value: 0
      objectReference: {fileID: 0}
    - target: {fileID: -8679921383154817045, guid: 4a2dc2a2ff29ffc439d06a186665df0d, type: 3}
      propertyPath: m_LocalRotation.z
      value: 0
      objectReference: {fileID: 0}
    - target: {fileID: -8679921383154817045, guid: 4a2dc2a2ff29ffc439d06a186665df0d, type: 3}
      propertyPath: m_LocalEulerAnglesHint.x
      value: 0
      objectReference: {fileID: 0}
    - target: {fileID: -8679921383154817045, guid: 4a2dc2a2ff29ffc439d06a186665df0d, type: 3}
      propertyPath: m_LocalEulerAnglesHint.y
      value: 0
      objectReference: {fileID: 0}
    - target: {fileID: -8679921383154817045, guid: 4a2dc2a2ff29ffc439d06a186665df0d, type: 3}
      propertyPath: m_LocalEulerAnglesHint.z
      value: 0
      objectReference: {fileID: 0}
    - target: {fileID: -7521889269759584128, guid: 4a2dc2a2ff29ffc439d06a186665df0d, type: 3}
      propertyPath: m_Materials.Array.data[0]
      value: 
      objectReference: {fileID: 2100000, guid: b01661f71f4897940b4425f6152e9a8a, type: 2}
    - target: {fileID: -5611615533874332949, guid: 4a2dc2a2ff29ffc439d06a186665df0d, type: 3}
      propertyPath: m_Materials.Array.data[0]
      value: 
      objectReference: {fileID: 2100000, guid: eaa1b23cc0e83d04c85590b1ea6b2525, type: 2}
    - target: {fileID: -4900703026702964466, guid: 4a2dc2a2ff29ffc439d06a186665df0d, type: 3}
      propertyPath: m_Materials.Array.data[0]
      value: 
      objectReference: {fileID: 2100000, guid: 58661df39892b0349ae77990c3b4338c, type: 2}
    - target: {fileID: -3228064684908513503, guid: 4a2dc2a2ff29ffc439d06a186665df0d, type: 3}
      propertyPath: m_Materials.Array.data[0]
      value: 
      objectReference: {fileID: 2100000, guid: b94a4dff7588e0b4383290041c40c188, type: 2}
    - target: {fileID: -2334358016772127140, guid: 4a2dc2a2ff29ffc439d06a186665df0d, type: 3}
      propertyPath: m_Materials.Array.data[0]
      value: 
      objectReference: {fileID: 2100000, guid: 58661df39892b0349ae77990c3b4338c, type: 2}
    - target: {fileID: -692627603564461077, guid: 4a2dc2a2ff29ffc439d06a186665df0d, type: 3}
      propertyPath: m_Materials.Array.data[0]
      value: 
      objectReference: {fileID: 2100000, guid: 6fe3d20b8dc8991459ef0cf792782319, type: 2}
    - target: {fileID: 919132149155446097, guid: 4a2dc2a2ff29ffc439d06a186665df0d, type: 3}
      propertyPath: m_Name
      value: barco
      objectReference: {fileID: 0}
    - target: {fileID: 3904376018446930858, guid: 4a2dc2a2ff29ffc439d06a186665df0d, type: 3}
      propertyPath: m_Materials.Array.data[0]
      value: 
      objectReference: {fileID: 2100000, guid: aad88023a9505f14a95d9842b5389d2e, type: 2}
    - target: {fileID: 5242582477688854523, guid: 4a2dc2a2ff29ffc439d06a186665df0d, type: 3}
      propertyPath: m_Materials.Array.data[0]
      value: 
      objectReference: {fileID: 2100000, guid: 26ce706ae74b79148b2ec1f4fd801620, type: 2}
    - target: {fileID: 5984970847807157398, guid: 4a2dc2a2ff29ffc439d06a186665df0d, type: 3}
      propertyPath: m_Materials.Array.size
      value: 1
      objectReference: {fileID: 0}
    - target: {fileID: 5984970847807157398, guid: 4a2dc2a2ff29ffc439d06a186665df0d, type: 3}
      propertyPath: m_Materials.Array.data[0]
      value: 
      objectReference: {fileID: 2100000, guid: b01661f71f4897940b4425f6152e9a8a, type: 2}
    - target: {fileID: 5984970847807157398, guid: 4a2dc2a2ff29ffc439d06a186665df0d, type: 3}
      propertyPath: m_Materials.Array.data[1]
      value: 
      objectReference: {fileID: 0}
    m_RemovedComponents: []
  m_SourcePrefab: {fileID: 100100000, guid: 4a2dc2a2ff29ffc439d06a186665df0d, type: 3}
