17;001;0001A
17;001;0001B
17;001;0001C
17;001;0001D
17;001;0001E
17;001;0001F
17;001;0001G
17;001;0002A
17;001;0002B
17;001;0002C
17;001;0002D
17;001;0002E
17;001;0002F
17;001;0002G
17;001;0002H
17;001;0002I
17;001;0002J
17;001;0002K
17;001;0002L
17;001;0002M
17;001;0002N
17;001;0002O
17;001;0002P
17;001;0002Q
17;001;0003A
17;001;0003B
17;001;0003C
17;001;0003D
17;001;0003E
17;001;0003F
17;001;0003G
17;001;0003H
17;001;0003I
17;001;0003J
17;001;0003K
17;001;0003L
17;001;0004A
17;001;0004B
17;001;0004C
17;001;0004D
17;001;0005A
17;001;0005B
17;001;0005C
17;001;0005D
17;001;0005E
17;001;0005F
17;001;0005G
17;001;0005H
17;001;0005I
17;001;0005J
17;001;0005K
17;001;0005L
17;001;0005M
17;001;0005N
17;001;0005O
17;001;0006A
17;001;0007A
17;002;0008A
17;002;0008B
17;002;0008C
17;002;0009A
17;002;0009B
17;003;0010A
17;003;0011A
17;003;0011B
17;003;0011C
17;003;0012A
17;003;0012B
17;003;0012C
17;003;0012D
17;003;0012E
17;003;0014A
17;004;0015A
17;004;0015B
17;004;0015C
17;004;0015D
17;004;0015E
17;004;0015G
17;004;0016A
17;004;0016B
17;004;0017A
17;004;0017B
17;004;0018A
17;004;0018B
17;004;0018C
17;005;0020A
17;005;0021A
17;005;0021B
17;005;0022A
17;005;0022B
17;005;0022C
17;005;0022D
17;005;0022E
17;005;0022F
17;005;0023A
17;005;0024A
17;005;0024B
17;005;0024C
17;005;0024D
17;005;0024E
17;005;0024F
17;005;0025A
17;005;0025B
17;005;0025C
17;005;0025D
17;005;0025E
17;005;0025F
17;006;0026A
17;006;0026B
17;006;0026C
17;006;0027A
17;006;0027B
17;006;0027C
17;006;0027D
17;006;0028A
17;006;0028B
17;006;0028C
17;006;0028D
17;006;0028E
17;006;0028F
17;006;0028G
17;006;0028H
17;006;0029A
17;006;0029C
17;006;0029D
17;006;0029E
17;006;0029F
17;006;0029G
17;006;0029H
17;006;0029I
17;007;0030A
17;007;0030B
17;007;0031A
17;007;0031B
17;007;0031C
17;007;0031D
17;007;0032A
17;007;0032B
17;007;0033A
17;007;0033B
17;007;0033C
17;007;0034A
17;007;0034B
17;007;0035A
17;007;0036A
17;007;0036B
17;007;0037A
17;007;0038A
17;007;0038B
17;007;0039A
17;008;0040A
17;008;0040B
17;008;0040C
17;008;0041A
17;008;0041B
17;008;0041C
17;008;0041D
17;008;0041E
17;008;0042A
17;008;0042B
17;008;0042C
17;008;0043A
17;008;0043B
17;008;0043C
17;008;0043D
17;008;0043E
17;008;0043F
17;008;0043G
17;008;0044A
17;008;0044B
17;008;0044C
17;008;0044D
17;008;0044E
17;008;0044F
17;008;0044G
17;008;0045A
17;009;0046A
17;009;0046B
17;009;0046C
17;009;0046E
17;009;0046F
17;009;0046J
17;009;0047A
17;009;0047B
17;009;0048C
17;009;0048D
17;010;0050A
17;010;0050B
17;010;0050C
17;011;0052A
17;011;0052B
17;011;0052C
17;011;0052D
17;011;0053A
17;011;0053B
17;011;0053C
17;011;0053D
17;011;0054A
17;011;0054B
17;011;0055A
17;011;0055B
17;011;0055C
17;012;0056A
17;012;0056B
17;012;0056C
17;012;0056D
17;012;0056E
17;012;0056F
17;012;0056G
17;012;0057A
17;012;0057B
17;012;0058A
17;013;0059A
17;013;0060A
17;013;0061A
17;014;0063A
17;014;0065B
17;014;0066A
17;015;0067A
17;015;0067B
17;015;0067C
17;015;0067D
17;015;0067E
17;015;0067G
17;015;0067H
17;015;0068A
17;015;0068B
17;015;0069A
17;015;0070A
17;015;0070B
17;015;0071A
17;015;0071B
17;015;0072A
17;015;0072B
17;015;0072C
17;015;0072D
17;016;0073A
17;016;0073B
17;016;0074A
17;016;0075A
17;016;0075B
17;017;0076A
17;017;0077A
17;017;0077B
17;017;0077C
17;017;0077D
17;017;0077E
17;017;0077F
17;017;0078A
17;018;0079A
17;018;0079B
17;018;0079C
17;018;0080A
17;018;0082A
17;018;0082B
17;018;0083A
17;019;0084A
17;019;0085A
17;019;0085B
17;019;0086A
17;019;0087A
17;019;0088A
17;019;0088B
17;019;0088C
17;020;0089A
17;020;0089B
17;020;0089C
17;020;0089D
17;020;0089E
17;020;0090A
17;020;0090B
17;020;0090C
17;021;0091A
17;021;0091B
17;021;0091C
17;021;0091D
17;021;0092A
17;021;0093A
17;021;0093B
17;021;0094A
17;021;0095A
17;021;0096B
17;021;0097A
17;021;0097B
17;021;0097C
17;021;0097D
17;021;0098A
17;022;0099A
17;022;0099B
17;022;0099C
17;023;0100A
17;023;0101A
17;023;0102A
17;023;0103A
