COQAUX1 534580de060dc4ac1ca3fbedd107cb87 /home/delfi/Datos/Estudio/Coq/Parcial2/booleanos.v
0 0 VernacProof "tac:no using:no"
718 722 proof_build_time "0.002"
0 0 and_assoc "0.002"
680 717 context_used ""
718 722 proof_check_time "0.000"
0 0 VernacProof "tac:no using:no"
842 846 proof_build_time "0.001"
0 0 or_assoc "0.001"
804 841 context_used ""
842 846 proof_check_time "0.001"
0 0 VernacProof "tac:no using:no"
1153 1157 proof_build_time "0.005"
0 0 LAnd "0.005"
1131 1152 context_used ""
1153 1157 proof_check_time "0.001"
0 0 VernacProof "tac:no using:no"
1470 1474 proof_build_time "0.006"
0 0 LOr1 "0.006"
1448 1469 context_used ""
1470 1474 proof_check_time "0.001"
0 0 VernacProof "tac:no using:no"
1793 1797 proof_build_time "0.005"
0 0 LOr2 "0.005"
1772 1792 context_used ""
1793 1797 proof_check_time "0.001"
0 0 VernacProof "tac:no using:no"
2038 2042 proof_build_time "0.005"
0 0 LXor "0.005"
1950 2037 context_used ""
2038 2042 proof_check_time "0.002"
0 0 VernacProof "tac:no using:no"
2140 2144 proof_build_time "0.001"
0 0 LNot "0.001"
2106 2139 context_used ""
2140 2144 proof_check_time "0.000"
0 0 vo_compile_time "0.039"
