{
  "name": "Primos",
  "plural": "Primos",
  "base": "PersistedModel",
  "idInjection": true,
  "options": {
    "validateUpsert": true
  },
  "properties": {
    "inicial": {
      "type": "number",
      "required": true,
      "default": 1
    },
    "final": {
      "type": "number",
      "required": true,
      "default": 1
    },
    "cantidadNumeros": {
      "type": "number",
      "required": true
    },
    "arreglodatos": {
      "type": "string"
    }
  },
  "validations": [],
  "relations": {},
  "acls": [],
  "methods": {}
}
