ID,Sex,Age,bio_mat_ID_0,visit_0,das_0,haq_0,drug_0,copd_0,visit_1,das_1,haq_1,drug_1,copd_1,visit_2,das_2,haq_2,drug_2,copd_2,visit_3,das_3,haq_3,drug_3,copd_3,visit_4,das_4,haq_4,drug_4,copd_4,visit_5,das_5,haq_5,drug_5,copd_5
LEIIX504,1,45,20181100273087,2018-01-01,4.72,0.98,Bazopamab,0,3/29/2018,3.6,1.55,Zebzitabin,0,7/17/2018,3.48,1.93,Zebzitabin,0,12/18/2018,3.34,1.76,Zebzitabin,0,6/25/2019,3.79,1.28,Bazopamab,0,1/6/2020,3.86,1.74,Bazopamab,0
QHNKM499,0,61,20181100271160,2018-01-01,7.31,2.27,Bazopamab,0,3/18/2018,6.2,2.21,Bazopamab,0,7/2/2018,4.68,1.76,Zebzitabin,0,12/23/2018,3.37,1.44,Zebzitabin,0,7/9/2019,2.72,1.21,Bazopamab,0,1/13/2020,2.78,1.66,Zebzitabin,0
HTAOB104,0,38,20181100270746,2018-01-01,5.28,1.05,Bazopamab,0,3/30/2018,4.26,1.66,Bazopamab mono,0,7/2/2018,2.67,1.97,Bazopamab,0,12/31/2018,3.61,1.77,Bazopamab,0,7/10/2019,3.75,1.33,Bazopamab,0,1/6/2020,4.21,1.06,Zebzitabin,0
HNHFV998,1,67,20181100272774,2018-01-02,2.46,1.25,Bazopamab,0,4/2/2018,2.95,0.71,Zebzitabin,0,6/15/2018,3.62,1.04,Zebzitabin 600 mg/m,0,1/8/2019,3.23,1.99,Bazopamab 800mg/täglich,0,7/11/2019,2.09,2.02,Zebzitabin,0,12/27/2019,1.85,2.37,Bazopamab,0
UTDLS235,1,50,20181100274372,2018-01-02,5.91,1.85,Bazopamab,0,3/24/2018,5.05,1.19,Zebzitabin,0,7/8/2018,2.41,1.14,Zebzitabin,0,1/18/2019,1.93,1.65,Zebzitabin,0,6/30/2019,1.14,0.94,Bazopamab,0,1/9/2020,3.05,1.07,Zebzitabin,0
YQFGE756,1,71,20181100270732,2018-01-03,5.55,1.65,Zebzitabin mono,0,3/13/2018,4.27,1.56,Zebzitabin,0,7/2/2018,3.73,1.29,Bazopamab,1,,,,,,,,,,,,,,,
AVAEH285,0,42,20181100273065,2018-01-03,6.44,1.82,Zebzitabin,0,3/31/2018,5.32,2.52,Bazopamab,0,6/29/2018,6.41,2.43,Bazopamab,0,1/2/2019,4.29,1.78,Bazopamab 800 mg daily,0,7/14/2019,4.57,1.17,Zebzitabin,0,1/6/2020,3.7,2.51,Zebzitabin,0
QDOPT789,0,58,20181100271460,2018-01-03,4.61,1.72,Bazopamab mono,0,4/2/2018,4.18,0.91,Bazopamab,0,6/30/2018,2.62,0.82,Bazopamab,0,1/14/2019,2.23,1.48,Zebzitabin,1,,,,,,,,,,
BMOAK298,0,46,20181100273797,2018-01-04,5.04,1.08,Bazopamab,0,3/27/2018,3.85,1.17,Zebzitabin,0,6/18/2018,1.92,1.51,Zebzitabin,0,1/2/2019,2.39,1.69,Zebzitabin,0,6/29/2019,2.48,1.05,Zebzitabin mono,0,12/25/2019,3.84,1.03,Bazopamab,0
ZDKNF501,0,59,20181100273804,2018-01-04,2.91,0.71,Bazopamab,0,4/9/2018,2.86,0.7,Bazopamab,0,7/31/2018,1.42,1.26,Bazopamab,0,12/29/2018,3.18,1.95,Zebzitabin,0,7/14/2019,2.58,1.84,Bazopamab,0,1/10/2020,3.21,1.13,Bazopamab,0
GWWLP632,0,48,20181100270914,2018-01-05,2.75,0.58,Bazopamab,0,4/4/2018,2.16,0.54,Bazopamab,0,7/24/2018,1.53,1.11,Bazopamab,0,1/3/2019,2.53,1.66,Bazopamab,0,7/7/2019,2.4,1.76,Zebzitabin,0,1/9/2020,2.65,1.57,Zebzitabin,0
TPRAA071,1,69,20181100272685,2018-01-05,5.85,1.23,Zebzitabin,0,4/12/2018,3.37,1.12,Zebzitabin,0,7/1/2018,2.03,1.06,Bazopamab 800 mg daily,0,1/18/2019,1.16,0.73,Zebzitabin 600 mg/m,0,7/16/2019,1.76,1.09,Zebzitabin,0,1/6/2020,1.87,1.68,Zebzitabin,0
GPHXR235,1,53,20181100273907,2018-01-05,4.23,0.79,Bazopamab,0,4/1/2018,2.91,0.78,Zebzitabin,0,6/15/2018,1.13,1.17,Bazopamab,0,1/7/2019,1.97,1.42,Zebzitabin mono,0,7/6/2019,2.12,1.33,Zebzitabin,0,1/9/2020,2.99,1.14,Bazopamab,0
YFVCK149,0,46,20181100271743,2018-01-06,4.57,1.4,Bazopamab,0,3/30/2018,4.27,1.5,Bazopamab,0,7/9/2018,3.59,1.62,Zebzitabin,0,1/3/2019,3.78,1.79,Zebzitabin,0,7/9/2019,3.12,1.75,Bazopamab 800 mg daily,0,12/31/2019,2.89,1.7,Bazopamab,0
DDQIS729,0,58,20181100273014,2018-01-06,3.16,0.34,Bazopamab,0,4/14/2018,1.52,0.51,Bazopamab,0,7/11/2018,1.02,1,Bazopamab,0,1/9/2019,1.83,1.08,Zebzitabin 600 mg/m,0,6/13/2019,2.42,1.71,Zebzitabin,0,1/3/2020,2.04,1.69,Zebzitabin,0
SECTK413,0,68,20181100272376,2018-01-07,5.3,1.38,Bazopamab,0,4/22/2018,4.19,1.49,Bazopamab,0,7/8/2018,3.03,1.5,Zebzitabin,0,1/15/2019,3.03,1.39,Bazopamab,0,7/3/2019,2.8,1.53,Bazopamab,0,1/12/2020,2.64,1.57,Zebzitabin,0
JMOWB723,1,56,20181100274781,2018-01-07,3.59,1.16,Bazopamab,0,4/13/2018,3.36,0.9,Bazopamab,0,7/5/2018,2.35,1.1,Bazopamab,0,12/29/2018,3.06,1.61,Zebzitabin,0,6/24/2019,2.21,1.96,Bazopamab,0,1/15/2020,2.07,1.62,Bazopamab,0
TXRLK043,1,51,20181100273191,2018-01-07,4.11,0.81,Bazopamab 800mg/täglich,1,4/7/2018,2.77,1.15,Zebzitabin,1,6/25/2018,2.75,1.49,Zebzitabin,1,,,,,,,,,,,,,,,
SIEVO798,0,53,20181100271115,2018-01-08,2.65,0.8,Zebzitabin,0,4/8/2018,2.92,0.97,Zebzitabin,0,7/8/2018,2.88,1.55,Zebzitabin-Mono,0,1/23/2019,3.92,2.15,Zebzitabin,0,6/23/2019,3.33,1.96,Bazopamab,0,,,,,
KFCEX579,0,58,20181100272306,2018-01-08,3.7,1.3,Zebzitabin,0,4/9/2018,2.78,0.65,Bazopamab,0,,,,,,,,,,,,,,,,,,,,
SVBRW443,1,38,20181100272598,2018-01-09,5.57,2.09,Zebzitabin,0,4/3/2018,5.45,1.64,Bazopamab,0,7/4/2018,3.9,1.3,Bazopamab mono,0,1/13/2019,3.63,1.58,Zebzitabin,0,7/6/2019,2.13,1.86,Bazopamab,0,12/31/2019,1.87,1.66,Bazopamab,0
FVNCE752,1,46,20181100272144,2018-01-09,3.47,0.82,Bazopamab,0,4/17/2018,2.7,0.86,Bazopamab,0,7/12/2018,2.31,1.29,Bazopamab,0,1/19/2019,2.67,1.64,Zebzitabin,0,7/23/2019,2.64,1.61,Zebzitabin,0,12/16/2019,2.77,1.73,Bazopamab,0
RWLTK646,1,56,20181100273629,2018-01-09,5.75,1.51,Zebzitabin,0,4/5/2018,4.88,1.97,Zebzitabin,0,,,,,,,,,,,,,,,,,,,,
JELVM709,1,58,20181100273007,2018-01-10,5.02,1.52,Bazopamab,0,4/27/2018,4.46,1.26,Bazopamab,0,7/8/2018,2.35,1.2,Zebzitabin,0,1/7/2019,3.02,1.48,Zebzitabin,0,7/21/2019,2.08,1.74,Bazopamab,0,1/24/2020,2.3,1.23,Zebzitabin,0
SJRLR841,0,71,20181100272163,2018-01-10,3.91,1.11,Bazopamab,0,4/11/2018,2.67,0.98,Bazopamab,0,6/20/2018,3.07,1,Bazopamab,0,12/27/2018,2.46,0.99,Bazopamab,0,6/16/2019,2.34,1.98,Zebzitabin,0,12/26/2019,0.89,2.42,Bazopamab,0
JXJHW683,1,48,20181100271479,2018-01-11,4.64,1.35,Zebzitabin mono,0,4/26/2018,3.87,1.48,Bazopamab,0,7/3/2018,3.87,1.56,Zebzitabin,0,,,,,,,,,,,,,,,
GZKOC995,0,55,20181100272469,2018-01-11,4.32,1.11,Bazopamab,0,4/26/2018,3.44,1.28,Bazopamab,0,6/26/2018,3.02,1.44,Zebzitabin,0,1/7/2019,3.2,1.44,Bazopamab,0,7/17/2019,3.01,1.78,Bazopamab,0,1/17/2020,2.37,1.84,Zebzitabin,0
QZVTK445,1,62,20181100273737,2018-01-11,4.15,0.65,Bazopamab,0,4/11/2018,3.02,1.38,Bazopamab,0,7/1/2018,2.7,1.86,Zebzitabin,0,12/28/2018,3.46,1.66,Bazopamab,0,7/12/2019,3.98,1.54,Zebzitabin,0,1/4/2020,3.7,1.57,Bazopamab,0
TORJA356,1,69,20181100273778,2018-01-12,4.92,1.42,Zebzitabin,0,4/11/2018,4.74,1.96,Bazopamab,0,7/19/2018,4.37,2.08,Zebzitabin,1,,,,,,,,,,,,,,,
ODVDG360,1,52,20181100273531,2018-01-12,7.05,1.64,Bazopamab,0,4/18/2018,4.6,1.82,Zebzitabin,0,7/31/2018,3.42,1.52,Bazopamab,0,1/20/2019,2.08,0.8,Bazopamab,0,7/17/2019,2.6,1.06,Zebzitabin,0,1/5/2020,2.25,1.79,Bazopamab,0
XSSVO253,1,42,20181100272122,2018-01-13,3.94,1.41,Zebzitabin,0,,,,,,,,,,,,,,,,,,,,,,,,,
CSAIY266,1,57,20181100273278,2018-01-13,6.46,1.7,Bazopamab,0,4/11/2018,5.57,2.19,Zebzitabin,0,7/21/2018,4.16,2.12,Bazopamab,0,1/11/2019,4.07,1.76,Zebzitabin,0,7/27/2019,3.79,1.31,Bazopamab,0,1/15/2020,3.9,1.35,Zebzitabin,0
RLMXP876,0,48,20181100273286,2018-01-13,5.49,1.86,Zebzitabin,0,3/23/2018,4.72,1.7,Bazopamab,0,8/2/2018,4.45,1.42,Bazopamab,0,1/1/2019,3.36,1.34,Bazopamab,0,,,,,,,,,,
QAKTT496,1,38,20181100271558,2018-01-14,6.2,1.65,Bazopamab,0,4/17/2018,4.65,1.28,Bazopamab,0,7/16/2018,2.06,1.12,Bazopamab,0,1/18/2019,1.85,1.17,Bazopamab mono,0,7/4/2019,1.49,1.14,Zebzitabin,0,1/15/2020,2.44,1.13,Bazopamab,0
FAUJB250,1,67,20181100271695,2018-01-14,5.87,1.82,Zebzitabin,0,4/14/2018,5.29,1.79,Zebzitabin,0,7/25/2018,3.75,1.63,Bazopamab,0,1/14/2019,3.59,1.64,Bazopamab,0,7/16/2019,2.77,1.54,Bazopamab,0,1/1/2020,2.85,1.48,Zebzitabin,0
YMXTM619,1,73,20181100274884,2018-01-15,5.86,1.47,Bazopamab,0,5/5/2018,4.44,1.49,Bazopamab,0,7/24/2018,2.79,1.47,Bazopamab,0,1/5/2019,2.53,1.35,Bazopamab,0,7/13/2019,2.45,1.22,Bazopamab,0,12/24/2019,2.91,1.39,Bazopamab,0
ZKGHH457,1,59,20181100273620,2018-01-15,6.08,1.49,Zebzitabin,0,4/8/2018,4.3,1.31,Zebzitabin,0,8/5/2018,2.22,1.21,Bazopamab,0,1/18/2019,1.85,1.11,Zebzitabin,0,7/14/2019,1.83,1.12,Zebzitabin,0,1/3/2020,2.48,1.31,Bazopamab,0
ZPHBZ145,0,57,20181100274183,2018-01-15,4.27,0.77,Zebzitabin,0,4/19/2018,2.21,0.51,Bazopamab,0,7/20/2018,1.05,0.8,Zebzitabin,0,1/20/2019,0.85,0.95,Bazopamab,1,7/22/2019,1.42,1.2,Bazopamab,1,,,,,
DDBRK980,1,54,20181100274684,2018-01-16,5.48,1.02,Zebzitabin,0,4/11/2018,3.45,1.46,Bazopamab,0,7/21/2018,2.66,1.56,Bazopamab,0,1/13/2019,2.44,1.06,Zebzitabin,0,,,,,,,,,,
YIVIY654,1,50,20181100270258,2018-01-16,6,1.19,Bazopamab,0,4/12/2018,3.79,1.57,Zebzitabin,0,8/2/2018,3.11,1.67,Bazopamab,0,2/9/2019,2.16,1.16,Bazopamab,0,7/15/2019,3.01,0.95,Zebzitabin 600 mg/m,0,1/18/2020,3.14,1.74,Bazopamab,0
KHVXH780,1,59,20181100272694,2018-01-17,5.84,1.36,Bazopamab,0,5/3/2018,4.13,1.69,Bazopamab,0,6/29/2018,3.19,1.53,Bazopamab,0,1/24/2019,3.01,0.98,Bazopamab,0,7/7/2019,3.12,1.65,Zebzitabin,0,1/11/2020,2.06,1.76,Zebzitabin,0
DZZTO065,1,48,20181100272790,2018-01-17,6.39,1.65,Bazopamab,0,4/9/2018,5.11,2.07,Bazopamab mono,0,8/1/2018,3.98,1.87,Bazopamab,0,1/24/2019,3.69,1.36,Zebzitabin,0,7/14/2019,3.53,1.5,Zebzitabin,0,1/9/2020,2.91,1.62,Zebzitabin,0
QPMNE132,0,71,20181100271906,2018-01-17,3.91,0.57,Zebzitabin,0,4/5/2018,2.85,1.05,Zebzitabin,0,7/17/2018,1.63,1.59,Zebzitabin,0,1/9/2019,3,1.65,Zebzitabin,1,7/13/2019,3.32,1.53,Zebzitabin,1,,,,,
LILKR733,1,66,20181100272117,2018-01-18,7.55,1.95,Bazopamab,0,4/1/2018,5.95,2.43,Zebzitabin,0,7/22/2018,4.42,2.06,Bazopamab,0,1/21/2019,3.7,1.29,Zebzitabin,0,7/22/2019,3.63,1.24,Zebzitabin,0,1/21/2020,3.2,1.5,Zebzitabin,0
GEJYN592,1,34,20181100273028,2018-01-18,4.74,1.5,Bazopamab,0,5/9/2018,4.21,1.23,Zebzitabin,0,7/12/2018,3.39,1.45,Zebzitabin mono,0,1/21/2019,2.71,1.91,Zebzitabin,0,7/6/2019,2.24,1.17,Bazopamab,0,1/20/2020,3.3,1.68,Zebzitabin,0
XZBCW503,1,48,20181100273548,2018-01-19,5.4,1.28,Bazopamab,0,4/19/2018,4.05,1.38,Zebzitabin,0,7/21/2018,2.65,1.49,Zebzitabin,0,1/17/2019,2.55,1.44,Zebzitabin,0,7/19/2019,2.59,1.24,Bazopamab,0,1/12/2020,3.07,1.42,Zebzitabin,0
AKYQX250,1,44,20181100271375,2018-01-19,5.59,1.83,Bazopamab mono,0,4/26/2018,4.96,1.73,Zebzitabin,1,,,,,,,,,,,,,,,,,,,,
KBHTN538,1,42,20181100272284,2018-01-19,5.3,1.54,Bazopamab,0,4/5/2018,5.15,1.83,Bazopamab,0,7/7/2018,3.89,2.04,Zebzitabin,0,1/24/2019,4.13,2.22,Bazopamab,0,7/11/2019,3.54,1.3,Zebzitabin,0,1/6/2020,4.39,1.28,Zebzitabin,0
XRWTB794,1,54,20181100271993,2018-01-20,6.26,1.68,Zebzitabin,0,3/31/2018,5.42,2.22,Zebzitabin,0,7/13/2018,4.43,2.13,Bazopamab,0,1/22/2019,4.26,1.7,Bazopamab,0,,,,,,,,,,
MZHVU325,1,42,20181100271203,2018-01-20,2.31,0.73,Bazopamab,0,5/1/2018,2.04,0.56,Bazopamab,0,7/23/2018,2.59,1.08,Bazopamab,0,1/31/2019,2.76,1.73,Zebzitabin,0,8/4/2019,2.43,1.92,Bazopamab,0,1/10/2020,2.11,2.17,Zebzitabin,0
GVTJM679,1,66,20181100273893,2018-01-21,5.94,1.46,Zebzitabin,0,4/9/2018,4.32,1.74,Zebzitabin,0,8/2/2018,3.81,1.7,Bazopamab,0,2/5/2019,2.85,1.29,Bazopamab,0,,,,,,,,,,
AIZOU049,1,47,20181100272861,2018-01-21,4.86,1.2,Zebzitabin,0,4/20/2018,3.24,0.78,Bazopamab,0,7/17/2018,1.59,0.86,Bazopamab 800mg/täglich,0,2/8/2019,1.33,1.09,Zebzitabin,0,,,,,,,,,,
FSFQP770,0,57,20181100274922,2018-01-21,3.07,1.27,Zebzitabin,0,4/19/2018,3.15,0.45,Bazopamab,0,7/26/2018,2.13,0.78,Bazopamab,0,12/29/2018,2.2,1.88,Zebzitabin,1,,,,,,,,,,
SYZFQ507,0,46,20181100271195,2018-01-22,3.89,0.68,Bazopamab,0,4/24/2018,2.38,1.17,Zebzitabin,0,7/23/2018,3.21,1.6,Zebzitabin,0,1/20/2019,2.73,1.39,Zebzitabin,0,8/1/2019,3.51,1.49,Bazopamab,0,1/16/2020,2.78,2.24,Bazopamab,0
WJILI105,1,46,20181100272278,2018-01-22,6.83,1.7,Zebzitabin,0,5/6/2018,5.62,1.9,Zebzitabin-Mono,0,7/14/2018,2.75,1.79,Bazopamab,0,1/27/2019,3.21,1.57,Bazopamab,0,7/10/2019,2.85,1.12,Bazopamab,0,1/9/2020,3.83,0.77,Bazopamab,0
JRJXA221,1,46,20181100274177,2018-01-23,4.22,0.59,Bazopamab,0,4/16/2018,2.84,1.28,Zebzitabin,0,7/26/2018,2.21,1.72,Zebzitabin,0,1/16/2019,3.19,1.45,Bazopamab,0,7/29/2019,3.77,1.61,Bazopamab,0,1/22/2020,3.35,1.47,Zebzitabin,0
CYJXB859,1,62,20181100270922,2018-01-23,5.26,1.69,Zebzitabin,0,4/2/2018,4.78,1.47,Zebzitabin,0,7/19/2018,3.22,1.37,Zebzitabin,0,1/21/2019,3.26,1.58,Zebzitabin,0,7/28/2019,2.34,1.65,Bazopamab,0,1/14/2020,2.44,1.49,Zebzitabin,0
RAFTQ551,1,42,20181100272491,2018-01-23,7.1,1.68,Zebzitabin,0,,,,,,,,,,,,,,,,,,,,,,,,,
MSMFD298,1,73,20181100274836,2018-01-24,3.04,1.34,Zebzitabin,0,3/25/2018,3.64,1.02,Zebzitabin,0,7/29/2018,3.51,1.27,Bazopamab 800 mg daily,0,,,,,,,,,,,,,,,
TCESX150,1,57,20181100272697,2018-01-24,3.88,0.95,Zebzitabin 600 mg/m,0,,,,,,,,,,,,,,,,,,,,,,,,,
NGJDM890,1,51,20181100270112,2018-01-25,4.99,1.57,Zebzitabin,0,4/9/2018,4.43,1.18,Zebzitabin,0,7/24/2018,2.5,1.18,Bazopamab,0,,,,,,,,,,,,,,,
UBHLM821,0,55,20181100270932,2018-01-25,3.76,1.63,Zebzitabin,0,5/6/2018,3.97,1.12,Zebzitabin-Mono,0,7/14/2018,4.12,1.22,Zebzitabin mono,0,1/26/2019,3.29,1.92,Bazopamab,0,,,,,,,,,,
BXBGQ695,1,59,20181100272635,2018-01-25,5.4,1.39,Bazopamab,0,4/10/2018,4.15,1.22,Zebzitabin,0,8/2/2018,2.18,1.23,Zebzitabin,0,1/23/2019,2.32,1.32,Zebzitabin,0,8/1/2019,2.01,1.35,Bazopamab,0,2/6/2020,2.57,1.27,Zebzitabin,0
SOBJU873,0,49,20181100271868,2018-01-26,5.83,1.21,Bazopamab mono,0,5/5/2018,4.32,2.01,Zebzitabin,0,,,,,,,,,,,,,,,,,,,,
OCPIE718,0,45,20181100274356,2018-01-26,5.28,1.12,Bazopamab,0,4/19/2018,3.98,1.7,Zebzitabin,0,7/19/2018,3.25,1.84,Bazopamab 800 mg daily,0,1/21/2019,3.48,1.45,Zebzitabin,0,7/22/2019,3.72,1.52,Bazopamab,0,1/2/2020,3.22,1.6,Zebzitabin,0
QNZWR940,1,58,20181100270907,2018-01-27,5.61,2.03,Zebzitabin,0,4/28/2018,5.5,1.7,Zebzitabin,0,7/21/2018,4.06,1.48,Zebzitabin,0,,,,,,,,,,,,,,,
ETGYI563,1,55,20181100271538,2018-01-27,6.4,1.48,Zebzitabin,0,5/6/2018,4.88,1.7,Bazopamab,0,,,,,,,,,,,,,,,,,,,,
IBSIU936,1,53,20181100274951,2018-01-27,5.25,0.9,Bazopamab,0,4/27/2018,3.35,1.59,Zebzitabin,0,7/19/2018,3.11,1.81,Zebzitabin-Mono,0,1/21/2019,2.93,1.23,Zebzitabin,0,8/2/2019,3.76,1.35,Zebzitabin,0,1/19/2020,3.13,1.8,Zebzitabin,0
ZAYDR747,1,51,20181100270992,2018-01-28,5.03,1.22,Zebzitabin,0,5/4/2018,3.83,1.37,Bazopamab,0,7/14/2018,2.77,1.46,Zebzitabin,0,1/26/2019,2.89,1.36,Bazopamab,0,7/21/2019,2.81,1.55,Zebzitabin,0,1/21/2020,2.61,1.59,Zebzitabin 600 mg/m,0
ZACYI481,1,64,20181100274503,2018-01-28,5.4,1.28,Zebzitabin,0,4/30/2018,3.77,1.72,Bazopamab,0,7/19/2018,4.17,1.75,Bazopamab,1,,,,,,,,,,,,,,,
COSMM788,1,74,20181100274761,2018-01-29,5.43,1.16,Bazopamab 800mg/täglich,1,,,,,,,,,,,,,,,,,,,,,,,,,
WASHP729,1,64,20181100273841,2018-01-29,6.69,1.96,Bazopamab,0,5/11/2018,5.72,2.28,Zebzitabin,0,8/1/2018,4.92,2.02,Bazopamab,0,1/22/2019,3.96,1.58,Zebzitabin,0,8/14/2019,3.58,1.37,Bazopamab,0,2/2/2020,3.16,1.8,Bazopamab,0
HCZWT934,0,32,20181100273533,2018-01-29,3.45,0.53,Bazopamab,0,4/15/2018,2.61,1.17,Bazopamab,0,7/26/2018,2.54,1.74,Bazopamab 800mg/täglich,0,1/22/2019,3.51,1.74,Bazopamab,0,7/27/2019,3.88,1.71,Zebzitabin,0,1/24/2020,3.5,1.65,Zebzitabin,0
WCMCA012,0,60,20181100271014,2018-01-30,7.16,1.49,Bazopamab 800 mg daily,0,,,,,,,,,,,,,,,,,,,,,,,,,
QGYLL736,1,48,20181100273197,2018-01-30,5.53,1.58,Zebzitabin,0,5/7/2018,4.45,1.44,Bazopamab,0,,,,,,,,,,,,,,,,,,,,
UNQLL170,0,64,20181100272703,2018-01-31,2.37,0.15,Zebzitabin,0,5/5/2018,0.88,0.06,Zebzitabin,0,7/19/2018,0.14,0.72,Bazopamab,0,,,,,,,,,,,,,,,
IHEJJ586,1,68,20181100273281,2018-01-31,3.62,1.06,Bazopamab,0,5/11/2018,3.18,0.82,Bazopamab,0,8/14/2018,2.35,1.21,Zebzitabin,0,2/12/2019,2.58,1.81,Zebzitabin,0,7/29/2019,2.15,1.5,Bazopamab,0,2/16/2020,2.89,1.59,Bazopamab,0
MMKME160,1,55,20181100271074,2018-01-31,4.66,1.31,Zebzitabin,0,4/21/2018,4.01,1.48,Zebzitabin,0,8/2/2018,3.59,1.64,Zebzitabin,0,2/11/2019,3.45,1.71,Bazopamab,0,8/1/2019,3.16,1.57,Zebzitabin,0,,,,,
ZAHXR232,1,56,20181100271277,2018-02-01,4.75,1.44,Bazopamab,0,5/5/2018,4.4,1.39,Zebzitabin,0,7/29/2018,3.08,1.5,Zebzitabin mono,0,1/24/2019,3.42,1.79,Zebzitabin,0,8/5/2019,2.69,1.61,Zebzitabin-Mono,0,1/26/2020,3.01,1.44,Bazopamab,0
MZMYM304,1,59,20181100271320,2018-02-01,4.91,2.05,Bazopamab,0,4/21/2018,5.04,1.56,Bazopamab,0,8/6/2018,4.5,1.27,Zebzitabin,0,1/20/2019,3.81,1.64,Bazopamab,0,8/14/2019,2.25,2.04,Zebzitabin,0,1/14/2020,1.49,2.12,Zebzitabin,0
RWGBE622,0,43,20181100273733,2018-02-02,5.12,1.76,Zebzitabin mono,0,5/8/2018,4.71,1.51,Zebzitabin,1,,,,,,,,,,,,,,,,,,,,
ZBKEZ717,1,56,20181100270580,2018-02-02,4.99,1.57,Zebzitabin,0,5/5/2018,3.94,1.11,Zebzitabin,0,,,,,,,,,,,,,,,,,,,,
JLRCS414,1,43,20181100271807,2018-02-02,4.43,0.83,Bazopamab,0,5/10/2018,3.1,1.06,Bazopamab 800 mg daily,0,8/8/2018,1.86,1.41,Zebzitabin,0,2/5/2019,2.47,1.45,Zebzitabin,0,7/23/2019,2.74,1.39,Zebzitabin,0,2/2/2020,3.13,1.34,Zebzitabin,0
WFSNQ303,1,63,20181100270076,2018-02-03,5.36,1.8,Zebzitabin,0,5/20/2018,5.14,1.52,Bazopamab,0,8/1/2018,3.11,1.36,Bazopamab,0,2/2/2019,3.52,1.66,Bazopamab,0,,,,,,,,,,
OXQOZ464,1,54,20181100274917,2018-02-03,2.23,0.08,Bazopamab,0,5/19/2018,0.72,0.68,Bazopamab,0,8/3/2018,2.19,1.53,Bazopamab,0,1/30/2019,2.63,1.43,Bazopamab,0,7/27/2019,3.9,1.71,Bazopamab,0,1/11/2020,2.92,2.27,Bazopamab,0
NGDXN531,0,61,20181100271901,2018-02-04,5.5,1.19,Bazopamab,0,4/23/2018,3.64,1.3,Bazopamab,0,8/6/2018,2.38,1.33,Zebzitabin mono,0,2/4/2019,2.11,1.07,Zebzitabin,0,8/10/2019,2.45,1.29,Zebzitabin,0,1/28/2020,2.46,1.57,Zebzitabin,0
RBKJP951,1,31,20181100272498,2018-02-04,3.32,1.13,Bazopamab,0,5/17/2018,3.92,1.18,Zebzitabin,0,8/1/2018,2.7,1.55,Zebzitabin,0,1/31/2019,4.33,2.19,Bazopamab,0,8/16/2019,3.14,2.08,Zebzitabin,0,1/26/2020,3.29,1.27,Bazopamab,0
MYXHX084,0,74,20181100270745,2018-02-04,2.96,0.56,Bazopamab,0,5/13/2018,1.9,0.6,Bazopamab,0,8/4/2018,1.63,1.02,Zebzitabin,0,1/12/2019,2.37,1.28,Zebzitabin,0,7/23/2019,2.46,1.91,Bazopamab,0,1/26/2020,1.9,1.83,Bazopamab,0
CSNSX933,1,58,20181100273170,2018-02-05,5.07,1.07,Zebzitabin 600 mg/m,1,5/4/2018,3.47,1.2,Zebzitabin,1,,,,,,,,,,,,,,,,,,,,
XQJCE010,1,62,20181100272520,2018-02-05,5.52,1.77,Bazopamab 800 mg daily,0,,,,,,,,,,,,,,,,,,,,,,,,,
AVFDB230,0,42,20181100274460,2018-02-06,4.24,1.03,Zebzitabin,0,5/8/2018,3.14,1.07,Bazopamab,0,8/8/2018,2.53,1.28,Zebzitabin,0,2/3/2019,2.64,1.37,Zebzitabin,0,8/7/2019,2.6,1.64,Bazopamab,0,2/3/2020,2.34,1.77,Zebzitabin,0
PUWUA694,1,47,20181100271484,2018-02-06,4.54,0.93,Bazopamab,0,5/12/2018,2.78,1.08,Zebzitabin,0,8/3/2018,2.22,1.15,Bazopamab,0,2/4/2019,2.31,0.87,Zebzitabin,0,7/21/2019,2.6,1.78,Bazopamab,0,2/17/2020,1.54,1.89,Bazopamab,0
MNFSC186,1,48,20181100272769,2018-02-06,5.6,1.57,Zebzitabin,0,5/4/2018,5.21,2.27,Zebzitabin,0,8/5/2018,4.57,2.16,Zebzitabin,0,,,,,,,,,,,,,,,
LZEAG662,1,60,20181100272676,2018-02-07,5.43,1.39,Bazopamab,0,5/14/2018,4.45,1.65,Zebzitabin,0,7/31/2018,3.52,1.78,Bazopamab,0,2/27/2019,3.28,1.7,Zebzitabin,0,7/28/2019,3.2,1.29,Bazopamab,0,2/18/2020,3.5,1.56,Zebzitabin,0
NQIDQ893,0,45,20181100272835,2018-02-07,4.79,1.29,Bazopamab,0,5/13/2018,4.34,1.51,Bazopamab,0,8/18/2018,3.25,1.78,Bazopamab,0,1/26/2019,3.61,1.97,Bazopamab,0,8/15/2019,3.25,1.41,Zebzitabin,0,1/19/2020,3.81,1.39,Zebzitabin,0
DJYBH183,0,44,20181100271707,2018-02-08,4.7,1.15,Bazopamab,0,5/17/2018,3.22,0.89,Bazopamab,0,8/3/2018,1.85,0.97,Zebzitabin,0,2/4/2019,1.78,1.12,Zebzitabin,0,7/22/2019,1.71,1.45,Zebzitabin,0,2/2/2020,1.93,1.57,Zebzitabin,0
XWSOU969,1,52,20181100270615,2018-02-08,7.51,1.66,Bazopamab,0,5/5/2018,5.98,2.45,Bazopamab,0,8/23/2018,3.36,2.21,Bazopamab,0,2/1/2019,4.11,1.37,Zebzitabin,0,8/16/2019,4.07,1.35,Zebzitabin,0,2/16/2020,3.91,0.83,Bazopamab,0
KPOLE066,1,65,20181100271629,2018-02-08,4.51,1.15,Zebzitabin,0,4/28/2018,3.62,1.24,Zebzitabin 600 mg/m,1,7/26/2018,2.68,1.4,Zebzitabin,1,2/1/2019,3.01,1.48,Zebzitabin,1,8/13/2019,2.76,1.66,Zebzitabin,1,,,,,
XILCT184,1,42,20181100272407,2018-02-09,5.04,1.69,Zebzitabin,0,5/3/2018,4.28,1.34,Bazopamab,1,,,,,,,,,,,,,,,,,,,,
AGEVE823,1,47,20181100272788,2018-02-09,4.04,0.82,Bazopamab,0,4/26/2018,2.79,0.83,Zebzitabin,0,8/10/2018,1.74,1.21,Bazopamab,0,2/12/2019,2.14,1.43,Bazopamab,0,7/27/2019,2.31,1.41,Bazopamab,0,2/16/2020,2.79,1.48,Bazopamab,0
LULRP507,1,45,20181100271515,2018-02-10,5.86,1.55,Bazopamab,0,5/16/2018,5.09,1.82,Zebzitabin,0,8/20/2018,3.24,1.82,Zebzitabin,0,2/10/2019,3.7,1.7,Zebzitabin,0,8/5/2019,3.23,1.44,Zebzitabin,0,2/22/2020,3.55,1.17,Bazopamab,0
WBULN753,1,74,20181100270167,2018-02-10,4.62,1.18,Bazopamab,0,5/9/2018,3.96,1.56,Zebzitabin,0,8/10/2018,3.56,1.8,Bazopamab,0,2/23/2019,3.7,1.79,Zebzitabin,0,8/29/2019,3.56,1.57,Bazopamab,0,1/23/2020,3.38,1.71,Bazopamab,0
XFEGJ904,1,43,20181100270706,2018-02-10,7.26,2.27,Bazopamab,0,5/3/2018,6.06,1.93,Zebzitabin,0,8/6/2018,3.99,1.5,Bazopamab,0,2/7/2019,2.71,1.38,Bazopamab,0,8/15/2019,1.98,1.07,Bazopamab 800 mg daily,0,1/20/2020,2.64,1.48,Bazopamab,0
KBKPI550,0,47,20181100273843,2018-02-11,3.41,0.49,Zebzitabin,0,5/19/2018,2.2,0.71,Zebzitabin,0,8/20/2018,1.54,1.34,Bazopamab,1,2/9/2019,2.22,1.62,Zebzitabin,1,8/14/2019,2.72,1.34,Zebzitabin,1,,,,,
QBWXS475,1,63,20181100271051,2018-02-11,5.72,1.43,Bazopamab,0,5/14/2018,4.85,1.8,Zebzitabin,0,8/18/2018,3.55,1.98,Zebzitabin,0,2/6/2019,3.51,1.9,Bazopamab,0,8/7/2019,3.44,1.12,Bazopamab,0,2/9/2020,4.22,1.3,Zebzitabin,0
BBNVP146,0,56,20181100271999,2018-02-12,3.22,0.6,Bazopamab,0,5/25/2018,2.41,1.21,Zebzitabin,0,8/6/2018,3.19,1.68,Bazopamab,0,2/7/2019,3.68,1.59,Bazopamab,0,8/20/2019,3.98,1.96,Zebzitabin,0,2/9/2020,2.75,2.12,Bazopamab mono,0
FXILG128,0,48,20181100270881,2018-02-12,3.48,0.39,Zebzitabin,0,5/23/2018,2.69,1.46,Zebzitabin,0,8/7/2018,2.85,2.08,Bazopamab,0,2/7/2019,4.32,1.8,Zebzitabin,0,,,,,,,,,,
NRSUU228,1,48,20181100273046,2018-02-12,6.57,1.97,Bazopamab,0,5/22/2018,5.42,1.75,Bazopamab 800 mg daily,0,8/15/2018,3.79,1.54,Bazopamab,0,2/21/2019,2.67,1.53,Zebzitabin,0,8/10/2019,2.2,1.03,Zebzitabin,0,2/17/2020,2.99,1.53,Bazopamab,0
WQTWH227,1,55,20181100270756,2018-02-13,5.77,1.75,Zebzitabin,1,5/13/2018,4.81,1.53,Zebzitabin,1,8/3/2018,3.63,1.47,Bazopamab,1,2/5/2019,2.67,1.6,Bazopamab,1,,,,,,,,,,
PKIAO477,1,64,20181100274122,2018-02-13,4.76,1.25,Zebzitabin,1,,,,,,,,,,,,,,,,,,,,,,,,,
QHVNW439,1,51,20181100270835,2018-02-14,3.25,0.93,Bazopamab,0,6/10/2018,2.74,0.92,Bazopamab,0,8/27/2018,2.79,1.23,Zebzitabin,0,2/3/2019,3.08,1.55,Zebzitabin,0,8/22/2019,2.72,1.96,Bazopamab,0,2/11/2020,2.06,2.02,Zebzitabin,0
GRQPC155,1,64,20181100271791,2018-02-14,5.32,1.54,Bazopamab,0,5/20/2018,4.72,1.31,Zebzitabin,0,8/14/2018,2.65,1.48,Bazopamab,0,2/14/2019,2.69,1.92,Zebzitabin,0,8/26/2019,2.12,1.06,Zebzitabin-Mono,0,3/1/2020,3.77,1.09,Bazopamab,0
MKTMX351,1,50,20181100270796,2018-02-14,4.31,0.8,Bazopamab,0,5/25/2018,2.65,0.97,Bazopamab,0,8/28/2018,1.99,1.23,Bazopamab,0,2/1/2019,2.14,1.14,Zebzitabin,0,8/16/2019,2.58,1.51,Bazopamab,0,3/2/2020,2.31,1.72,Bazopamab,0
QLDPU232,0,66,20181100271711,2018-02-15,5.13,1.14,Bazopamab,0,6/2/2018,3.89,1.34,Zebzitabin,0,8/14/2018,2.05,1.42,Zebzitabin,0,2/16/2019,2.94,1.28,Zebzitabin,0,8/15/2019,2.78,1.65,Zebzitabin,0,2/19/2020,2.65,1.21,Bazopamab,0
HANUH975,1,50,20181100272239,2018-02-15,5.21,1.92,Bazopamab,0,5/15/2018,5.15,1.81,Bazopamab,0,8/19/2018,4.6,1.57,Bazopamab,0,2/17/2019,4.16,1.68,Zebzitabin,0,8/27/2019,2.96,1.96,Bazopamab,0,2/25/2020,2.11,1.99,Bazopamab,0
WWTFF544,1,53,20181100270879,2018-02-16,6.01,1.27,Zebzitabin,0,5/31/2018,3.67,1.28,Bazopamab,0,8/8/2018,2.42,1.27,Zebzitabin,1,,,,,,,,,,,,,,,
VKLBI785,1,53,20181100272733,2018-02-16,5.88,1.66,Bazopamab,0,5/31/2018,5,1.74,Zebzitabin,0,9/14/2018,3.6,1.7,Zebzitabin,0,2/13/2019,3.29,1.64,Zebzitabin,0,8/21/2019,2.88,1.32,Bazopamab,0,2/18/2020,3.23,1.47,Zebzitabin,0
SEYPU439,1,37,20181100272096,2018-02-16,4.55,1.59,Bazopamab,0,5/8/2018,4.82,1.85,Bazopamab,0,8/1/2018,4.71,1.93,Bazopamab,0,2/20/2019,4.78,2.08,Bazopamab,0,9/13/2019,3.82,1.92,Bazopamab,0,2/7/2020,3.18,1.91,Bazopamab,0
ISTNC718,0,38,20181100272128,2018-02-17,6.34,1.57,Zebzitabin,0,5/11/2018,5,1.73,Zebzitabin,0,8/19/2018,2.94,1.68,Zebzitabin,0,3/17/2019,2.89,1.48,Zebzitabin,0,8/17/2019,2.76,1.13,Bazopamab,1,,,,,
ZKCFT887,1,61,20181100270838,2018-02-17,4.08,1.22,Bazopamab,0,5/24/2018,4.28,1.67,Bazopamab,0,8/19/2018,3.93,1.99,Bazopamab,0,3/13/2019,4.72,2.18,Bazopamab,0,8/27/2019,4.05,1.88,Bazopamab,0,2/19/2020,3.74,1.62,Bazopamab,0
JKHDU764,0,38,20181100274572,2018-02-18,4.42,1.14,Bazopamab,0,5/23/2018,3.75,1.12,Zebzitabin,0,8/24/2018,2.16,1.35,Bazopamab,0,2/15/2019,2.94,1.65,Zebzitabin,0,8/25/2019,2.49,1.58,Zebzitabin,0,3/1/2020,2.97,1.26,Bazopamab,0
UOCHD600,0,63,20181100270320,2018-02-18,6.06,1.52,Zebzitabin,0,5/13/2018,4.58,2.03,Zebzitabin,0,,,,,,,,,,,,,,,,,,,,
POWQD743,1,50,20181100274731,2018-02-18,9.37,2.26,Zebzitabin,1,,,,,,,,,,,,,,,,,,,,,,,,,
MHJQA470,1,56,20181100273112,2018-02-19,3.82,1.62,Zebzitabin,0,5/24/2018,3.99,1.04,Zebzitabin,0,8/29/2018,3.54,1.08,Zebzitabin,0,2/28/2019,3.18,1.78,Zebzitabin,0,,,,,,,,,,
WCPQW322,1,55,20181100272499,2018-02-19,4.42,1.21,Bazopamab,0,5/9/2018,4.05,1.41,Zebzitabin,0,8/9/2018,2.91,1.61,Zebzitabin,0,2/20/2019,3.74,1.78,Bazopamab,0,8/15/2019,3.18,1.77,Bazopamab,0,2/28/2020,3.12,1.41,Bazopamab,0
DQZPQ240,1,71,20181100272070,2018-02-20,3.53,0.51,Bazopamab,0,5/31/2018,2.52,1.08,Zebzitabin,0,8/13/2018,2.13,1.61,Zebzitabin-Mono,0,2/16/2019,3.26,1.57,Bazopamab,0,8/12/2019,3.62,1.75,Bazopamab,0,2/17/2020,3.2,1.56,Zebzitabin,0
FAMXC307,0,46,20181100270221,2018-02-20,6.27,2.08,Zebzitabin,0,,,,,,,,,,,,,,,,,,,,,,,,,
URQUM238,1,57,20181100273458,2018-02-20,5.11,1.52,Zebzitabin,0,5/29/2018,3.82,0.91,Zebzitabin,0,8/30/2018,2.11,0.83,Bazopamab,0,,,,,,,,,,,,,,,
CTKMF598,1,46,20181100272126,2018-02-21,5.41,2.11,Bazopamab,0,5/29/2018,6.04,2.13,Bazopamab,0,8/18/2018,5.42,2.03,Bazopamab,0,2/22/2019,5.01,2.32,Bazopamab,0,9/8/2019,3.54,1.72,Bazopamab,0,2/23/2020,3.53,1.77,Zebzitabin,0
CHNWB783,1,50,20181100274652,2018-02-21,4.86,1.46,Zebzitabin,0,5/21/2018,4.79,2,Zebzitabin,0,7/31/2018,4.43,2.04,Bazopamab,0,,,,,,,,,,,,,,,
SCDHY520,0,53,20181100272914,2018-02-22,6.62,2.09,Zebzitabin,0,6/9/2018,6.41,2.59,Bazopamab,0,8/11/2018,5.13,2.18,Bazopamab,0,3/7/2019,5.35,1.7,Bazopamab,0,8/31/2019,4.23,1.98,Zebzitabin,0,,,,,
CXUNG151,1,39,20181100273914,2018-02-22,6.44,1.51,Zebzitabin,0,5/6/2018,5.38,2.05,Zebzitabin,0,8/29/2018,3.04,1.99,Zebzitabin,0,,,,,,,,,,,,,,,
BHWTQ392,1,51,20181100270657,2018-02-22,6.67,1.81,Zebzitabin,0,5/31/2018,5.04,1.87,Bazopamab,0,8/31/2018,4.06,1.66,Bazopamab,0,3/6/2019,2.66,1.3,Bazopamab,0,,,,,,,,,,
PIQNH813,0,47,20181100271655,2018-02-23,4.78,1.16,Zebzitabin,0,6/1/2018,3.47,1.08,Zebzitabin,0,8/15/2018,2.48,1.29,Zebzitabin,0,2/27/2019,2.15,1.44,Bazopamab,0,,,,,,,,,,
KSPPT943,1,66,20181100271338,2018-02-23,4.96,1.3,Zebzitabin,0,6/3/2018,3.68,1.62,Bazopamab,0,8/20/2018,4.18,1.62,Bazopamab,0,3/2/2019,3.27,1.27,Bazopamab,0,8/17/2019,3.41,1.68,Bazopamab,0,2/20/2020,2.15,2.34,Bazopamab,0
CPUWY323,1,52,20181100272727,2018-02-24,4.3,1.02,Zebzitabin,0,5/26/2018,3.53,1.54,Zebzitabin,0,8/14/2018,3.79,1.87,Zebzitabin,0,2/20/2019,3.72,1.78,Zebzitabin,0,,,,,,,,,,
BUUEO263,1,45,20181100271607,2018-02-24,4.52,1.07,Zebzitabin,1,,,,,,,,,,,,,,,,,,,,,,,,,
XAYCX687,1,50,20181100274311,2018-02-24,5.05,2.08,Zebzitabin,0,6/8/2018,5,1.54,Zebzitabin,0,8/21/2018,4.59,1.25,Zebzitabin,0,2/19/2019,3.48,1.63,Zebzitabin,0,8/5/2019,2.09,1.85,Zebzitabin,0,,,,,
FMMHU145,1,63,20181100274478,2018-02-25,6.32,1.76,Zebzitabin,0,6/8/2018,5.11,1.75,Zebzitabin,0,8/20/2018,3.37,1.55,Bazopamab,0,3/1/2019,2.97,1.37,Bazopamab,0,,,,,,,,,,
VOJVJ925,0,55,20181100274182,2018-02-25,5.6,1.45,Zebzitabin,0,5/15/2018,4.2,1.69,Bazopamab,0,8/12/2018,3.75,1.6,Zebzitabin,0,3/2/2019,3.1,1.23,Zebzitabin,0,,,,,,,,,,
OJFUU651,1,42,20181100274904,2018-02-26,5.59,1.47,Zebzitabin,0,5/24/2018,4.31,1.44,Bazopamab,0,,,,,,,,,,,,,,,,,,,,
FPKHR646,1,67,20181100273673,2018-02-26,7.78,2.48,Bazopamab,0,6/3/2018,6.69,2.26,Bazopamab,0,9/14/2018,4.48,1.66,Bazopamab,0,2/16/2019,3.28,1.37,Bazopamab,0,8/23/2019,2.35,1.21,Zebzitabin,0,2/21/2020,2.6,1.45,Zebzitabin,0
ZMAMD355,0,67,20181100272813,2018-02-26,6.12,1.68,Zebzitabin,0,6/28/2018,4.86,1.69,Zebzitabin,0,9/8/2018,3.36,1.52,Zebzitabin,0,2/25/2019,2.92,1.32,Zebzitabin,1,8/25/2019,2.59,1.38,Bazopamab,1,,,,,
MQVRV501,1,48,20181100271715,2018-02-27,4.91,1.18,Zebzitabin,0,6/5/2018,4.29,1.77,Zebzitabin,0,,,,,,,,,,,,,,,,,,,,
OWYZY200,1,51,20181100272273,2018-02-27,4.18,1.33,Bazopamab,0,5/31/2018,3.07,0.74,Zebzitabin,0,8/22/2018,2.37,0.71,Bazopamab,0,3/7/2019,1.81,1.07,Zebzitabin,0,8/30/2019,1.3,1.74,Bazopamab,0,2/14/2020,0.95,2.03,Zebzitabin,0
YKEOV841,1,70,20181100271015,2018-02-28,5.72,1.38,Bazopamab,0,5/16/2018,4.17,1.64,Bazopamab,0,9/4/2018,3.4,1.61,Bazopamab,0,3/16/2019,2.85,1.26,Zebzitabin,0,9/8/2019,3.03,1.36,Zebzitabin mono,0,2/27/2020,2.69,1.77,Zebzitabin,0
BIAIL108,0,58,20181100270808,2018-02-28,4.04,0.98,Zebzitabin,0,5/27/2018,3.05,0.9,Bazopamab,0,,,,,,,,,,,,,,,,,,,,
QYAYQ258,0,49,20181100272458,2018-02-28,2.96,0.25,Bazopamab 800 mg daily,0,5/24/2018,1.97,0.98,Zebzitabin,0,9/2/2018,2.2,1.72,Zebzitabin,0,3/6/2019,3.28,1.74,Zebzitabin,1,8/21/2019,3.96,1.67,Zebzitabin,1,,,,,
MBSTL888,1,46,20181100272033,2018-03-01,6.58,1.68,Zebzitabin,0,,,,,,,,,,,,,,,,,,,,,,,,,
TJPAB542,0,62,20181100272304,2018-03-01,4.25,1.23,Bazopamab,0,5/24/2018,3.52,1.32,Zebzitabin,0,8/18/2018,3.56,1.45,Bazopamab,0,3/4/2019,3.27,1.51,Bazopamab,0,8/9/2019,2.98,1.78,Bazopamab 800mg/täglich,0,3/10/2020,2.26,2.08,Zebzitabin,0
VXEQB806,0,60,20181100273301,2018-03-02,3.76,1.02,Zebzitabin,0,6/19/2018,2.84,0.58,Bazopamab,0,8/17/2018,1.39,0.79,Bazopamab,0,3/12/2019,1.93,1.29,Zebzitabin,0,9/2/2019,1.46,1.71,Bazopamab,0,,,,,
JJEZM106,1,69,20181100272484,2018-03-02,4.4,1.33,Bazopamab,0,5/25/2018,3.72,1.03,Zebzitabin,0,8/27/2018,2.38,1.08,Zebzitabin,0,3/10/2019,2.67,1.42,Zebzitabin,0,8/29/2019,1.98,1.74,Bazopamab,0,2/29/2020,2.01,1.57,Zebzitabin,0
VVNHS085,0,43,20181100274389,2018-03-02,4.06,1.04,Zebzitabin,0,6/10/2018,3.79,1.47,Zebzitabin,1,,,,,,,,,,,,,,,,,,,,
KRJOT126,1,55,20181100274950,2018-03-03,3.52,1.16,Zebzitabin,0,6/1/2018,4.3,1.64,Bazopamab,0,9/21/2018,4.06,2.09,Zebzitabin,0,,,,,,,,,,,,,,,
UNEZM334,1,57,20181100273070,2018-03-03,5.13,1.12,Bazopamab,0,6/5/2018,4.05,1.61,Zebzitabin,0,9/11/2018,2.97,1.81,Zebzitabin,0,2/26/2019,3.48,1.59,Bazopamab,0,8/27/2019,3.55,1.49,Zebzitabin,0,3/15/2020,3.46,1.4,Zebzitabin,0
BQYDL268,1,57,20181100272560,2018-03-04,3.45,0.02,Bazopamab,0,6/14/2018,1.38,1.02,Zebzitabin,0,9/2/2018,2.38,1.94,Zebzitabin,0,3/23/2019,2.39,1.58,Bazopamab,0,8/27/2019,4.28,1.02,Bazopamab,0,3/5/2020,4.34,1.94,Bazopamab,0
QZKWR839,0,53,20181100273715,2018-03-04,4.17,1.43,Zebzitabin,0,6/4/2018,4.87,1.83,Bazopamab,0,8/22/2018,3.88,1.91,Bazopamab,0,2/28/2019,5.49,2.1,Zebzitabin,0,,,,,,,,,,
PCEQM468,1,56,20181100272995,2018-03-04,4.98,1.58,Zebzitabin,0,,,,,,,,,,,,,,,,,,,,,,,,,
SMZBS148,1,45,20181100271100,2018-03-05,3.89,0.95,Bazopamab,0,6/17/2018,3.05,0.77,Zebzitabin,0,9/15/2018,1.35,1.01,Zebzitabin,0,3/4/2019,2.43,1.38,Zebzitabin,0,9/2/2019,1.99,1.78,Bazopamab,0,2/28/2020,2.19,1.28,Zebzitabin,0
BEIZZ437,1,53,20181100270681,2018-03-05,1.92,0.37,Bazopamab,0,5/28/2018,1.88,0.68,Zebzitabin,0,9/7/2018,2.07,1.37,Bazopamab,0,3/4/2019,3.65,1.87,Bazopamab,0,9/2/2019,3.4,2.2,Bazopamab,0,3/21/2020,2.76,1.77,Bazopamab,0
KDSAV984,0,44,20181100273884,2018-03-06,4.93,0.7,Zebzitabin,0,5/25/2018,3.02,1.21,Bazopamab 800mg/täglich,0,8/24/2018,2.12,1.7,Zebzitabin,0,3/4/2019,2.14,1.5,Zebzitabin,0,9/3/2019,3.16,0.89,Zebzitabin,0,,,,,
KDNWL231,1,39,20181100271751,2018-03-06,6.23,1.84,Zebzitabin,0,6/9/2018,5.54,2.1,Zebzitabin,0,,,,,,,,,,,,,,,,,,,,
ZFIHC683,1,52,20181100274620,2018-03-06,3.95,1.01,Zebzitabin,0,5/30/2018,3.01,0.93,Zebzitabin,0,8/23/2018,2.63,1.28,Bazopamab,0,2/20/2019,2.4,1.61,Bazopamab,0,,,,,,,,,,
CAZSU614,0,53,20181100271926,2018-03-07,6.15,1.64,Zebzitabin,0,6/17/2018,4.55,1.65,Zebzitabin,0,9/1/2018,3.37,1.41,Bazopamab,0,,,,,,,,,,,,,,,
EPRMV656,1,58,20181100274045,2018-03-07,5.95,1.42,Zebzitabin,0,6/14/2018,4.63,2.07,Bazopamab,0,,,,,,,,,,,,,,,,,,,,
YMSUP280,1,43,20181100272101,2018-03-08,2.68,0.51,Bazopamab,0,6/11/2018,2.95,1.19,Zebzitabin,0,9/10/2018,2.71,1.98,Zebzitabin,0,3/13/2019,4.54,2.39,Bazopamab,0,9/9/2019,4.32,1.87,Zebzitabin,0,2/26/2020,4.46,1.36,Bazopamab,0
QPXZT925,0,69,20181100272480,2018-03-08,5.77,1.57,Bazopamab mono,0,5/29/2018,4.94,1.89,Zebzitabin,0,8/25/2018,3.73,1.81,Bazopamab,0,3/11/2019,3.86,1.55,Bazopamab,0,,,,,,,,,,
CITAH238,1,47,20181100272309,2018-03-08,8.41,2.11,Zebzitabin,0,6/12/2018,6.33,2.33,Zebzitabin,0,9/5/2018,3.64,1.87,Zebzitabin,0,3/19/2019,2.76,1.14,Bazopamab,1,,,,,,,,,,
BZHDV044,1,54,20181100272434,2018-03-09,5.71,1.6,Zebzitabin mono,0,,,,,,,,,,,,,,,,,,,,,,,,,
FEURF121,0,74,20181100271236,2018-03-09,5.6,1.72,Bazopamab,0,6/25/2018,5.08,1.86,Zebzitabin,0,9/19/2018,4.06,1.73,Bazopamab,0,2/19/2019,3.95,1.63,Bazopamab 800 mg daily,0,8/17/2019,3.21,1.71,Bazopamab,0,3/26/2020,2.75,1.67,Zebzitabin,0
IZIES895,0,49,20181100272874,2018-03-10,5.81,1.4,Bazopamab,0,6/1/2018,4.09,1.54,Zebzitabin,0,9/7/2018,3.13,1.45,Zebzitabin,0,3/1/2019,2.53,1.1,Bazopamab,0,9/5/2019,2.7,1.38,Zebzitabin,0,3/6/2020,2.31,1.76,Zebzitabin,0
ZEBLC363,1,45,20181100271997,2018-03-10,4.2,0.72,Bazopamab,0,6/9/2018,2.37,0.7,Zebzitabin,0,8/30/2018,1.58,1.12,Bazopamab,0,4/2/2019,1.38,1.26,Zebzitabin,0,9/11/2019,2.05,1.11,Zebzitabin,0,3/13/2020,2.76,1.62,Zebzitabin,0
JCYWI458,0,54,20181100272802,2018-03-10,4.39,1.78,Zebzitabin,0,6/12/2018,4.73,1.24,Bazopamab,1,9/2/2018,3.51,1.26,Bazopamab,1,,,,,,,,,,,,,,,
FTTKL654,0,54,20181100273975,2018-03-11,5.7,1.79,Zebzitabin,0,6/5/2018,4.57,1.48,Zebzitabin,1,9/15/2018,3.3,1.12,Bazopamab,1,,,,,,,,,,,,,,,
MYTZA248,1,61,20181100271540,2018-03-11,5.22,1.67,Zebzitabin,0,6/8/2018,4.68,1.38,Zebzitabin,0,9/4/2018,3.06,1.31,Bazopamab,0,,,,,,,,,,,,,,,
PLYPH530,1,56,20181100272660,2018-03-12,7.64,2,Bazopamab,0,6/8/2018,5.93,2.06,Bazopamab,0,9/17/2018,3.27,1.66,Bazopamab,0,3/25/2019,2.81,1.18,Bazopamab,0,9/14/2019,2.52,1.08,Zebzitabin,0,3/12/2020,2.99,1.1,Bazopamab,0
FPNJI068,1,44,20181100273888,2018-03-12,7.98,2.34,Bazopamab,0,6/5/2018,6.76,2.17,Zebzitabin mono,0,9/17/2018,3.38,1.62,Bazopamab,0,3/3/2019,3.15,1.32,Zebzitabin,0,9/8/2019,2.2,1.18,Zebzitabin,0,3/16/2020,2.92,0.86,Bazopamab,0
XKYPK616,1,62,20181100271565,2018-03-12,2.44,0.09,Bazopamab,0,6/3/2018,1.48,0.59,Zebzitabin,0,9/28/2018,1.55,1.54,Bazopamab,0,3/13/2019,2.58,1.9,Bazopamab,0,9/20/2019,3.37,1.39,Bazopamab,0,3/3/2020,4.01,1.56,Bazopamab,0
NJJMW903,1,71,20181100273052,2018-03-13,3.79,0.58,Zebzitabin,1,,,,,,,,,,,,,,,,,,,,,,,,,
LDLVX346,0,42,20181100272800,2018-03-13,5.93,1.4,Bazopamab,0,7/1/2018,4.11,1.02,Zebzitabin,0,10/11/2018,1.57,1.11,Bazopamab,0,3/12/2019,1.13,1.31,Bazopamab,0,9/4/2019,1.25,0.71,Zebzitabin,0,3/9/2020,3.13,1.04,Bazopamab,0
UAKCX977,1,82,20181100272782,2018-03-14,6.91,1.94,Zebzitabin,0,6/1/2018,5.31,1.96,Bazopamab,0,9/27/2018,3.99,1.56,Zebzitabin,0,2/27/2019,2.89,1.09,Bazopamab,0,,,,,,,,,,
KSIQJ045,0,53,20181100270871,2018-03-14,4.37,1.07,Zebzitabin,0,6/16/2018,3.29,1.24,Zebzitabin,0,9/4/2018,3.03,1.45,Bazopamab,0,3/22/2019,2.91,1.44,Zebzitabin,0,8/31/2019,2.95,1.6,Bazopamab,0,3/22/2020,2.55,1.89,Bazopamab,0
CHYAX630,0,63,20181100271738,2018-03-14,5.85,1.75,Zebzitabin,0,5/22/2018,5.06,1.72,Bazopamab,0,9/6/2018,3.38,1.5,Bazopamab,0,3/5/2019,3.45,1.41,Bazopamab,0,9/11/2019,2.67,1.69,Bazopamab,0,,,,,
XXKJG397,0,43,20181100274993,2018-03-15,6.21,1.25,Zebzitabin,0,6/20/2018,4.36,1.99,Bazopamab,0,9/10/2018,3.52,1.97,Bazopamab,0,,,,,,,,,,,,,,,
EZXKJ534,0,45,20181100272904,2018-03-15,5.28,0.48,Bazopamab,0,6/30/2018,2.59,1.26,Bazopamab,0,9/10/2018,1.53,1.65,Bazopamab,0,3/17/2019,1.91,0.98,Bazopamab,0,9/14/2019,3.4,1.05,Bazopamab,0,3/26/2020,3.45,1.35,Bazopamab,0
UDHJR823,0,54,20181100273911,2018-03-16,1.87,0.49,Zebzitabin,0,6/21/2018,1.44,0.01,Bazopamab,0,9/2/2018,0.97,0.67,Zebzitabin,1,,,,,,,,,,,,,,,
TYJPD463,1,80,20181100270740,2018-03-16,5.07,1.22,Zebzitabin,0,6/7/2018,3.59,0.94,Zebzitabin,0,9/26/2018,1.75,1.1,Bazopamab,0,,,,,,,,,,,,,,,
OTLOT687,0,40,20181100273902,2018-03-16,4.89,1.45,Bazopamab 800 mg daily,0,,,,,,,,,,,,,,,,,,,,,,,,,
QNXSV231,1,55,20181100274418,2018-03-17,6.18,1.15,Zebzitabin,0,6/14/2018,4.2,2.02,Zebzitabin,0,9/4/2018,3.71,2.11,Zebzitabin,0,3/22/2019,3.33,1.29,Zebzitabin,0,9/22/2019,4.18,1.2,Bazopamab,0,,,,,
GWRLP267,1,50,20181100270332,2018-03-17,5.52,1.32,Bazopamab,0,6/13/2018,4.28,1.67,Zebzitabin,0,9/24/2018,3.11,1.65,Bazopamab,0,4/9/2019,3.34,1.33,Bazopamab,0,9/16/2019,3.25,1.61,Bazopamab,0,3/12/2020,2.75,1.53,Zebzitabin,0
DQZIC884,1,58,20181100273439,2018-03-18,3.38,0.42,Zebzitabin,0,,,,,,,,,,,,,,,,,,,,,,,,,
BHJKF417,1,50,20181100273225,2018-03-18,5.77,1.81,Zebzitabin,0,6/8/2018,5.25,1.68,Zebzitabin,0,9/24/2018,3.49,1.55,Zebzitabin,0,3/29/2019,3.44,1.67,Bazopamab,0,,,,,,,,,,
QPDVX538,1,47,20181100273790,2018-03-18,4.45,1.15,Bazopamab,0,6/18/2018,4.14,1.5,Zebzitabin,0,10/2/2018,2.85,1.72,Zebzitabin,0,3/10/2019,4.06,1.81,Bazopamab,0,8/30/2019,3.49,1.86,Bazopamab,0,3/17/2020,3.28,1.29,Zebzitabin,0
FWFLU768,1,58,20181100272105,2018-03-19,2.74,0.14,Zebzitabin-Mono,0,6/3/2018,1.15,0.35,Bazopamab,0,9/30/2018,0.88,1.08,Bazopamab,0,3/17/2019,1.62,1.34,Bazopamab,0,9/25/2019,2.47,1.45,Bazopamab,1,,,,,
OUGDM926,1,50,20181100272099,2018-03-19,6.22,1.11,Bazopamab,0,6/8/2018,4.25,1.74,Zebzitabin,0,9/20/2018,2.79,1.97,Bazopamab,0,3/23/2019,2.66,1.48,Bazopamab 800 mg daily,0,9/24/2019,3.49,0.81,Bazopamab,0,3/14/2020,4.3,1.2,Zebzitabin,0
MACWJ674,1,52,20181100271613,2018-03-20,6.25,1.3,Bazopamab,0,6/11/2018,4.5,1.99,Bazopamab,0,9/29/2018,3.6,2,Bazopamab,0,3/7/2019,3.37,1.33,Bazopamab,0,9/20/2019,3.88,1.26,Zebzitabin,0,3/22/2020,3.47,1.57,Bazopamab,0
OPTDO549,1,65,20181100271859,2018-03-20,5.78,1.39,Bazopamab,0,7/14/2018,4.28,1.65,Zebzitabin,0,9/25/2018,3.29,1.64,Zebzitabin,0,3/6/2019,2.89,1.32,Zebzitabin-Mono,0,9/10/2019,3.02,1.33,Bazopamab,0,3/8/2020,2.87,1.65,Bazopamab,0
ROKTP729,0,51,20181100270772,2018-03-20,6.23,1.59,Zebzitabin,0,,,,,,,,,,,,,,,,,,,,,,,,,
FSLEU431,1,56,20181100271010,2018-03-21,5.43,1.55,Bazopamab,0,6/19/2018,4.3,1.2,Bazopamab,0,9/20/2018,2.39,1.13,Bazopamab,0,3/17/2019,2.25,1.31,Zebzitabin,0,9/23/2019,1.73,1.39,Zebzitabin,0,4/6/2020,2.26,1.39,Bazopamab,0
BDOJA394,0,72,20181100270660,2018-03-21,2.84,0.7,Bazopamab,0,6/25/2018,2.62,0.74,Zebzitabin,0,9/12/2018,1.96,1.29,Zebzitabin,0,4/4/2019,3.13,1.86,Bazopamab,0,9/28/2019,2.75,1.84,Bazopamab,0,3/30/2020,2.96,1.51,Zebzitabin,0
MGLJU994,1,61,20181100274489,2018-03-22,4.33,1.07,Zebzitabin,0,,,,,,,,,,,,,,,,,,,,,,,,,
STSOD184,1,45,20181100273916,2018-03-22,5.63,1.77,Bazopamab,0,7/3/2018,5.13,2.15,Bazopamab,0,9/9/2018,5.26,2.01,Bazopamab,0,3/18/2019,4.46,1.71,Bazopamab,0,10/4/2019,3.93,1.74,Zebzitabin,0,3/21/2020,2.83,2.15,Zebzitabin,0
MKDIT059,1,62,20181100273959,2018-03-22,4.98,1.21,Bazopamab,0,6/20/2018,3.44,0.97,Bazopamab,0,9/30/2018,1.86,1.03,Bazopamab,0,3/25/2019,1.8,1.12,Bazopamab,0,9/14/2019,1.75,1.38,Zebzitabin,0,3/17/2020,2.09,1.48,Zebzitabin,0
VKMHB114,1,57,20181100274825,2018-03-23,4.59,1.18,Bazopamab,0,7/7/2018,4.02,1.76,Bazopamab,0,10/3/2018,3.74,1.83,Bazopamab,0,3/2/2019,4.44,1.55,Zebzitabin,0,9/21/2019,4.08,2.11,Bazopamab,0,3/8/2020,2.63,1.82,Bazopamab,0
EPLXL614,0,49,20181100272068,2018-03-23,4.92,1.47,Bazopamab,0,6/17/2018,4.01,1.24,Bazopamab,0,9/10/2018,3.31,1.35,Bazopamab,0,3/28/2019,2.49,1.61,Zebzitabin,0,9/10/2019,2.2,1.26,Bazopamab,0,4/2/2020,2.74,1.82,Bazopamab 800mg/täglich,0
VULAT979,1,47,20181100271497,2018-03-24,5.56,1.82,Zebzitabin,0,6/24/2018,5.2,1.73,Bazopamab 800 mg daily,0,10/6/2018,3.48,1.46,Zebzitabin,0,3/27/2019,3.9,1.48,Bazopamab,0,10/2/2019,2.71,1.97,Bazopamab,0,3/17/2020,2.1,1.47,Bazopamab,0
LEAPD362,1,55,20181100271253,2018-03-24,6.02,1.57,Zebzitabin,0,6/29/2018,4.35,1.61,Zebzitabin,0,,,,,,,,,,,,,,,,,,,,
NPBDY039,1,45,20181100273174,2018-03-24,3.73,1.3,Zebzitabin,0,6/12/2018,3.49,1.06,Zebzitabin,0,,,,,,,,,,,,,,,,,,,,
RWTYK373,0,40,20181100272405,2018-03-25,5.36,1.75,Zebzitabin,0,6/19/2018,5.3,1.99,Bazopamab,0,,,,,,,,,,,,,,,,,,,,
PQVPW924,0,75,20181100271902,2018-03-25,4.87,1.62,Bazopamab,0,7/5/2018,4.37,1.27,Bazopamab,0,9/15/2018,3.45,1.35,Bazopamab,0,3/15/2019,2.79,1.77,Zebzitabin,0,10/4/2019,2.11,1.35,Bazopamab,0,3/16/2020,2.8,1.73,Zebzitabin,0
SDXIE524,1,60,20181100272124,2018-03-26,3.7,1.04,Zebzitabin,0,6/28/2018,3.3,0.9,Bazopamab 800mg/täglich,0,10/1/2018,1.95,1.15,Bazopamab,1,3/16/2019,3,1.6,Zebzitabin,1,9/26/2019,2.32,1.89,Bazopamab,1,,,,,
FPGPV245,1,62,20181100271101,2018-03-26,5.41,2.09,Zebzitabin,0,,,,,,,,,,,,,,,,,,,,,,,,,
ZEKGH196,1,59,20181100270101,2018-03-26,4.83,0.88,Zebzitabin,0,6/23/2018,3.33,1.17,Bazopamab,0,,,,,,,,,,,,,,,,,,,,
CBSJT436,1,47,20181100270853,2018-03-27,6.16,1.18,Bazopamab,0,6/20/2018,4.07,1.66,Zebzitabin,0,9/19/2018,2.89,1.78,Bazopamab,0,3/26/2019,2.44,1.26,Zebzitabin,0,10/1/2019,3.21,0.95,Bazopamab,0,3/29/2020,3.55,1.46,Bazopamab mono,0
BXGWW353,1,65,20181100270634,2018-03-27,4.67,0.92,Zebzitabin,0,6/24/2018,3.72,1.31,Zebzitabin,1,9/7/2018,2.08,1.68,Zebzitabin,1,3/29/2019,3.16,1.73,Zebzitabin,1,10/14/2019,3.21,1.39,Zebzitabin,1,,,,,
ATGHM120,0,55,20181100271496,2018-03-28,5.19,1.16,Bazopamab,0,6/19/2018,3.53,0.96,Bazopamab,0,10/3/2018,1.42,1.04,Bazopamab,0,3/25/2019,1.7,1.1,Zebzitabin,0,10/4/2019,1.7,1.31,Bazopamab,0,3/19/2020,2.31,1.22,Zebzitabin,0
ZMRVP671,0,62,20181100272815,2018-03-28,4.31,0.7,Bazopamab,0,6/24/2018,2.61,0.95,Bazopamab,0,10/2/2018,1.7,1.3,Bazopamab,0,3/17/2019,2.12,1.22,Zebzitabin,0,9/28/2019,2.67,1.41,Bazopamab,0,3/26/2020,2.73,1.52,Zebzitabin,0
EQFYS284,1,36,20181100271147,2018-03-28,6.53,2.07,Zebzitabin,0,,,,,,,,,,,,,,,,,,,,,,,,,
WZMKK509,1,55,20181100270789,2018-03-29,5.74,1.95,Bazopamab,0,6/26/2018,5.57,2.08,Bazopamab 800mg/täglich,0,10/2/2018,4.87,1.87,Bazopamab,0,3/30/2019,4.45,1.81,Bazopamab,0,9/12/2019,3.44,1.77,Zebzitabin,0,4/14/2020,2.83,1.83,Zebzitabin,0
BIOUE599,1,51,20181100270968,2018-03-29,7.11,2.14,Bazopamab,0,6/19/2018,6.05,2.27,Zebzitabin,0,9/26/2018,4.38,1.75,Bazopamab,0,3/28/2019,3.85,1.26,Zebzitabin,0,10/6/2019,3.09,1.63,Bazopamab,0,3/21/2020,2.32,1.59,Zebzitabin 600 mg/m,0
SOXAX951,1,43,20181100272390,2018-03-30,4.28,0.65,Zebzitabin-Mono,0,,,,,,,,,,,,,,,,,,,,,,,,,
UALQE832,1,64,20181100272058,2018-03-30,3.71,0.71,Bazopamab,0,6/28/2018,2.96,0.9,Zebzitabin,0,9/21/2018,1.66,1.45,Zebzitabin,0,4/7/2019,2.78,1.81,Bazopamab,0,9/29/2019,2.8,1.43,Zebzitabin,0,4/10/2020,3.66,1.18,Bazopamab,0
MLLUC865,1,61,20181100272496,2018-03-30,7.37,2.24,Zebzitabin,0,6/14/2018,6.69,2.71,Bazopamab,0,10/1/2018,5.4,2.23,Bazopamab,0,3/17/2019,4.87,1.6,Zebzitabin,0,9/30/2019,4.06,1.63,Zebzitabin,0,,,,,
BDIDH468,1,47,20181100272371,2018-03-31,3.24,0.66,Zebzitabin,0,7/12/2018,2.25,0.45,Bazopamab,0,9/27/2018,1.1,0.95,Bazopamab,0,4/17/2019,1.85,1.49,Bazopamab,0,9/15/2019,1.83,1.51,Zebzitabin,0,4/10/2020,2.55,1.42,Bazopamab,0
WOYIX927,1,33,20181100272441,2018-03-31,4.34,0.98,Zebzitabin,0,6/25/2018,3.68,1.74,Bazopamab,0,9/22/2018,3.89,2.01,Zebzitabin,0,4/5/2019,4.4,1.71,Bazopamab,0,9/28/2019,4.43,1.91,Bazopamab,0,,,,,
MUCHQ599,0,67,20181100270391,2018-04-01,7.19,2.31,Zebzitabin,0,6/28/2018,6.02,2.06,Zebzitabin,0,9/28/2018,4.23,1.44,Zebzitabin,0,4/1/2019,3.19,1.11,Zebzitabin,0,10/11/2019,2.26,1.54,Bazopamab,0,,,,,
CJVEL923,1,47,20181100270996,2018-04-01,6.63,1.51,Bazopamab mono,0,7/6/2018,4.45,1.37,Bazopamab,0,10/21/2018,2.26,1.34,Bazopamab,0,3/15/2019,1.37,1.16,Zebzitabin,0,,,,,,,,,,
QJVER555,0,57,20181100272896,2018-04-01,5.4,1.13,Bazopamab,0,7/2/2018,3.45,0.99,Bazopamab,0,10/5/2018,1.61,1.13,Bazopamab,0,4/18/2019,1.39,1.13,Bazopamab,0,9/18/2019,1.76,1.01,Zebzitabin,0,3/8/2020,2.71,1.3,Zebzitabin,0
HFCBS550,0,60,20181100272034,2018-04-02,5.68,1.37,Bazopamab,0,6/19/2018,4.82,1.97,Zebzitabin,0,9/9/2018,3.73,2.06,Zebzitabin,0,4/7/2019,4.07,1.74,Bazopamab,0,10/2/2019,3.96,1.47,Zebzitabin,0,4/11/2020,3.8,1.41,Bazopamab,0
MYMEY175,0,51,20181100273101,2018-04-02,7.25,2.19,Zebzitabin,0,7/6/2018,5.83,2.02,Bazopamab,0,,,,,,,,,,,,,,,,,,,,
ZVSDH122,1,44,20181100274757,2018-04-03,6.59,2.19,Zebzitabin,0,6/26/2018,5.15,1.53,Zebzitabin,0,,,,,,,,,,,,,,,,,,,,
BBMHO671,1,67,20181100273193,2018-04-03,5.2,1,Bazopamab,0,6/2/2018,3.49,1.27,Bazopamab,0,9/26/2018,2.28,1.52,Zebzitabin 600 mg/m,0,4/3/2019,2.29,1.35,Bazopamab 800 mg daily,0,9/22/2019,2.79,1.15,Zebzitabin,0,4/8/2020,3.25,1.42,Bazopamab,0
CVRBJ066,1,60,20181100273269,2018-04-03,2.37,0.51,Zebzitabin,0,,,,,,,,,,,,,,,,,,,,,,,,,
THGTX329,0,72,20181100270173,2018-04-04,4.89,1.19,Bazopamab,0,7/4/2018,3.09,0.76,Zebzitabin,0,10/5/2018,1.9,0.91,Bazopamab 800mg/täglich,0,4/20/2019,1.02,1.15,Bazopamab,0,10/1/2019,1.27,1.01,Bazopamab,0,3/22/2020,2.22,1.68,Zebzitabin,0
FVADQ892,1,56,20181100270206,2018-04-04,4.51,1.47,Bazopamab,0,6/24/2018,4.3,1.08,Bazopamab,0,9/25/2018,2.19,1.14,Bazopamab,0,3/28/2019,3,1.69,Zebzitabin,0,9/23/2019,1.88,1.73,Zebzitabin,0,4/2/2020,2.49,1.18,Bazopamab,0
DRQBG837,1,45,20181100271742,2018-04-05,4.43,1.35,Bazopamab,0,6/13/2018,4.3,1.13,Zebzitabin,0,10/3/2018,2.13,1.32,Zebzitabin,0,4/17/2019,3.23,1.87,Zebzitabin,0,9/27/2019,2.23,1.64,Zebzitabin,0,4/2/2020,3.12,1.02,Zebzitabin,0
QULDA104,1,62,20181100272620,2018-04-05,3.85,0.91,Bazopamab,0,6/29/2018,3.56,1.39,Bazopamab,0,10/7/2018,2.84,1.74,Zebzitabin,0,3/23/2019,4.16,1.82,Bazopamab,0,9/16/2019,3.78,1.97,Zebzitabin-Mono,0,4/4/2020,3.25,1.46,Bazopamab,0
MUJXF507,0,46,20181100270468,2018-04-05,2.42,0.28,Zebzitabin,0,6/21/2018,1.43,0.48,Bazopamab,0,9/25/2018,1.52,1.16,Zebzitabin,1,,,,,,,,,,,,,,,
PNDUP067,1,50,20181100271259,2018-04-06,4.37,1.08,Zebzitabin,0,,,,,,,,,,,,,,,,,,,,,,,,,
DGMUU083,0,63,20181100272820,2018-04-06,4.95,1.13,Zebzitabin,0,7/12/2018,3.92,1.61,Zebzitabin,0,10/22/2018,3.14,1.74,Bazopamab,0,,,,,,,,,,,,,,,
DQONM859,1,61,20181100272296,2018-04-07,7.36,2.12,Zebzitabin,0,7/3/2018,6.19,2.41,Zebzitabin,0,10/7/2018,5.01,2.08,Zebzitabin,0,3/19/2019,3.76,1.59,Zebzitabin,0,,,,,,,,,,
QLUXJ587,1,76,20181100271970,2018-04-07,3.96,1.28,Bazopamab,0,6/25/2018,3.53,1.13,Bazopamab,0,10/13/2018,3.22,1.27,Zebzitabin,0,4/8/2019,3.14,1.6,Bazopamab,0,10/4/2019,2.53,1.82,Zebzitabin,0,3/31/2020,2.15,1.95,Zebzitabin,0
YPBUL759,0,38,20181100270161,2018-04-07,5.23,1.71,Bazopamab,0,7/9/2018,4.71,1.41,Zebzitabin,0,10/17/2018,3.45,1.39,Zebzitabin,0,3/25/2019,2.98,1.72,Bazopamab,0,10/2/2019,2.19,1.41,Zebzitabin,0,4/22/2020,2.75,1.61,Bazopamab,0
PEFVO522,1,51,20181100272247,2018-04-08,4.02,1.16,Zebzitabin,0,7/15/2018,3.44,0.97,Zebzitabin,0,10/16/2018,2.37,1.18,Zebzitabin,0,4/9/2019,2.76,1.59,Zebzitabin,0,,,,,,,,,,
KTVZD515,1,26,20181100270739,2018-04-08,3.97,0.96,Zebzitabin,0,,,,,,,,,,,,,,,,,,,,,,,,,
KOAJQ411,1,30,20181100272210,2018-04-09,6.43,1.13,Zebzitabin,0,6/27/2018,3.95,1.57,Bazopamab,0,,,,,,,,,,,,,,,,,,,,
DQQFY545,0,68,20181100270177,2018-04-09,4.07,0.98,Zebzitabin,0,7/3/2018,2.94,0.86,Zebzitabin,0,10/11/2018,2,1.09,Zebzitabin,0,3/28/2019,2.24,1.32,Bazopamab,1,,,,,,,,,,
FYMWO642,1,63,20181100271632,2018-04-09,4.39,1.52,Bazopamab,0,7/2/2018,4.21,1.56,Zebzitabin,0,10/15/2018,4.05,1.49,Zebzitabin,0,4/2/2019,4.11,1.56,Bazopamab,0,9/29/2019,3.17,2.18,Zebzitabin,0,4/18/2020,1.85,2.07,Zebzitabin,0
JBRTT654,1,49,20181100272059,2018-04-10,7.3,2.12,Bazopamab,0,7/31/2018,6.29,2.64,Bazopamab,0,10/26/2018,5.28,2.17,Bazopamab,0,4/9/2019,4.6,1.42,Zebzitabin mono,0,10/15/2019,4.07,1.62,Zebzitabin,0,3/30/2020,2.89,1.76,Zebzitabin,0
QQJAO673,0,48,20181100273446,2018-04-10,3.29,0.8,Zebzitabin,0,7/22/2018,2.49,0.66,Bazopamab 800 mg daily,0,10/7/2018,1.88,1.07,Bazopamab,0,4/9/2019,2.35,1.52,Zebzitabin,0,9/18/2019,2.2,1.68,Bazopamab,0,,,,,
LNSCT483,1,66,20181100274005,2018-04-11,3.79,0.71,Zebzitabin,0,7/23/2018,3.52,1.91,Bazopamab,0,10/16/2018,4.37,2.47,Bazopamab,0,,,,,,,,,,,,,,,
IOTRJ558,1,53,20181100273471,2018-04-11,5.88,1.43,Bazopamab,0,7/27/2018,3.92,1.43,Zebzitabin,0,9/30/2018,3.07,1.32,Bazopamab,0,4/20/2019,2.03,0.99,Zebzitabin,0,10/15/2019,2.32,1.23,Zebzitabin,0,4/14/2020,2.11,1.87,Bazopamab,0
KPWVD611,1,58,20181100270883,2018-04-12,3.22,1.21,Bazopamab,0,7/25/2018,3.6,0.92,Bazopamab,0,10/12/2018,2.79,1.29,Zebzitabin,0,4/23/2019,3.45,2.12,Bazopamab,0,10/11/2019,2.39,1.81,Bazopamab,0,4/27/2020,2.95,1.57,Zebzitabin,0
QCXTQ155,1,54,20181100270209,2018-04-12,4.77,1.14,Bazopamab,0,7/6/2018,3.88,1.44,Zebzitabin,0,10/29/2018,2.95,1.66,Bazopamab mono,0,4/24/2019,3.33,1.63,Bazopamab,0,10/19/2019,3.24,1.53,Zebzitabin,0,4/30/2020,3.23,1.51,Zebzitabin,0
HGFMJ374,1,56,20181100271967,2018-04-12,5.33,1.29,Zebzitabin,0,7/11/2018,4.14,1.64,Bazopamab,1,10/25/2018,3.36,1.7,Zebzitabin,1,3/28/2019,3.3,1.45,Bazopamab,1,,,,,,,,,,
HEGLB304,0,44,20181100270675,2018-04-13,3.48,1.01,Bazopamab,0,7/2/2018,3,0.96,Bazopamab,0,10/11/2018,2.75,1.26,Zebzitabin 600 mg/m,0,4/17/2019,3.03,1.64,Zebzitabin,0,10/10/2019,2.63,1.83,Zebzitabin,0,4/14/2020,2.35,1.87,Bazopamab,0
IBGEG696,1,62,20181100272758,2018-04-13,4.98,1.32,Zebzitabin,0,7/21/2018,3.47,0.66,Zebzitabin,0,10/28/2018,1.07,0.65,Bazopamab,0,4/3/2019,1.14,1.02,Bazopamab,0,10/19/2019,0.75,1.34,Zebzitabin,1,,,,,
RRGVZ098,0,27,20181100273609,2018-04-14,5.89,1.65,Bazopamab,0,7/9/2018,4.54,1.76,Zebzitabin,0,11/4/2018,3.92,1.52,Bazopamab,0,4/14/2019,3.14,1.14,Bazopamab,0,9/30/2019,2.91,1.62,Zebzitabin,0,4/8/2020,1.96,1.99,Zebzitabin,0
ENCQX978,1,68,20181100273064,2018-04-14,3.41,1.06,Zebzitabin,0,7/8/2018,2.93,0.86,Zebzitabin,0,10/13/2018,2.82,1.17,Bazopamab,0,3/25/2019,2.76,1.65,Bazopamab,0,10/21/2019,2.34,1.73,Bazopamab,0,4/28/2020,2.27,1.97,Zebzitabin,0
TJPNJ649,1,53,20181100271862,2018-04-14,4.24,0.97,Bazopamab,0,7/15/2018,3.51,1.42,Zebzitabin,0,10/17/2018,3,1.7,Bazopamab,0,4/10/2019,3.72,1.63,Bazopamab,0,10/22/2019,3.62,1.81,Bazopamab,0,4/10/2020,3.03,1.63,Zebzitabin,0
IYTUO174,1,52,20181100273026,2018-04-15,6,1.59,Bazopamab mono,0,7/7/2018,4.53,1.48,Zebzitabin,0,10/24/2018,2.87,1.35,Bazopamab,0,4/12/2019,2.37,1.23,Bazopamab,0,10/13/2019,2.18,1.26,Zebzitabin,1,,,,,
ZYMTV020,0,66,20181100274940,2018-04-15,4.68,1.34,Zebzitabin mono,0,7/16/2018,3.96,1.31,Bazopamab,0,9/21/2018,3.02,1.4,Zebzitabin,0,4/29/2019,3.11,1.55,Zebzitabin,0,9/29/2019,2.64,1.65,Bazopamab,1,,,,,
SDOKH057,1,65,20181100273995,2018-04-16,4.68,1.15,Bazopamab,0,6/27/2018,3.42,1.04,Zebzitabin,0,10/15/2018,2.13,1.16,Zebzitabin,0,4/5/2019,2.28,1.26,Zebzitabin 600 mg/m,0,10/29/2019,2.14,1.52,Zebzitabin,0,4/27/2020,2.25,1.54,Bazopamab,0
FXPYN507,0,52,20181100272541,2018-04-16,5.16,1.11,Zebzitabin,0,6/25/2018,4.02,1.86,Zebzitabin,0,,,,,,,,,,,,,,,,,,,,
GWUYC502,1,51,20181100270124,2018-04-16,3.9,0.9,Zebzitabin,0,7/6/2018,2.67,0.61,Bazopamab,0,,,,,,,,,,,,,,,,,,,,
OCGCO173,1,52,20181100270213,2018-04-17,7.62,1.99,Zebzitabin,0,7/17/2018,5.61,1.95,Bazopamab,0,,,,,,,,,,,,,,,,,,,,
ZIWJL554,0,63,20181100270823,2018-04-17,5.31,1.54,Zebzitabin,0,7/14/2018,5.03,1.98,Zebzitabin,0,10/10/2018,4.01,1.95,Bazopamab,0,4/9/2019,4.63,1.78,Zebzitabin,0,,,,,,,,,,
CTGPS081,0,67,20181100270418,2018-04-18,5.15,1.59,Bazopamab,0,7/17/2018,4.51,1.3,Bazopamab,0,10/4/2018,2.64,1.22,Zebzitabin,0,4/20/2019,2.92,1.48,Bazopamab,0,10/17/2019,2.05,1.64,Bazopamab mono,0,4/5/2020,2.3,1.36,Zebzitabin,0
TWNFU304,1,60,20181100274159,2018 04 18,4.16,0.7,Zebzitabin,0,7/24/2018,2.54,1.01,Zebzitabin-Mono,0,10/23/2018,2.21,1.4,Bazopamab,0,,,,,,,,,,,,,,,
JRQQH769,1,27,20181100271546,2018-04-18,5.74,1.54,Zebzitabin,0,7/12/2018,4.38,1.76,Zebzitabin,0,10/21/2018,3.86,1.57,Zebzitabin,0,4/13/2019,3.24,1.16,Zebzitabin,0,10/16/2019,3.11,1.65,Bazopamab,0,4/16/2020,2.08,1.98,Bazopamab mono,0
IFYVF750,0,53,20181100274359,2018-04-19,8.21,2.58,Zebzitabin,0,7/7/2018,7.29,2.74,Bazopamab,0,,,,,,,,,,,,,,,,,,,,
TLTNP107,0,53,20181100270627,2018-04-19,5.22,1.28,Bazopamab,0,7/26/2018,4.02,1.44,Zebzitabin,0,10/28/2018,2.73,1.47,Zebzitabin,0,4/26/2019,3,1.33,Bazopamab,0,10/21/2019,2.84,1.59,Zebzitabin,0,4/14/2020,2.59,1.5,Zebzitabin,0
UBKAB099,0,52,20181100272666,2018-04-20,5.67,1.15,Bazopamab,0,7/19/2018,4.17,1.9,Bazopamab,0,10/19/2018,3.64,2.03,Bazopamab,0,4/28/2019,3.58,1.45,Zebzitabin,0,10/12/2019,4.07,1.38,Zebzitabin,0,4/10/2020,3.54,1.66,Zebzitabin,0
DEMUU221,1,55,20181100270019,2018-04-20,4.75,1.24,Bazopamab,0,7/20/2018,3.44,1.1,Zebzitabin,0,10/11/2018,2.63,1.18,Zebzitabin,0,3/28/2019,2.23,1.26,Bazopamab,0,10/22/2019,2.16,1.46,Zebzitabin,0,4/6/2020,2.14,1.79,Bazopamab,0
WMHRZ077,1,39,20181100274388,2018-04-20,5.38,1.8,Zebzitabin,0,,,,,,,,,,,,,,,,,,,,,,,,,
ICEPI093,1,74,20181100271875,2018-04-21,4.59,0.76,Zebzitabin,0,7/27/2018,3.06,1.19,Bazopamab,0,10/13/2018,2.02,1.56,Bazopamab,0,,,,,,,,,,,,,,,
BHPFI712,1,44,20181100272833,2018-04-21,5.4,1.56,Zebzitabin,0,7/6/2018,4.82,1.98,Bazopamab,0,10/28/2018,4.31,1.89,Bazopamab,0,,,,,,,,,,,,,,,
MLEQF266,1,58,20181100272680,2018-04-22,3.99,0.79,Bazopamab,0,8/15/2018,2.66,0.77,Zebzitabin,0,10/14/2018,2.04,1.31,Zebzitabin,0,4/14/2019,1.76,1.65,Zebzitabin,0,11/5/2019,2.25,1,Bazopamab,0,5/2/2020,3.44,1.6,Zebzitabin,0
CMHQM594,0,70,20181100270542,2018-04-22,5.05,1.43,Bazopamab,0,7/25/2018,4.3,1.32,Zebzitabin,0,10/26/2018,2.92,1.46,Bazopamab,0,5/2/2019,2.84,1.72,Bazopamab,0,10/7/2019,2.41,1.3,Zebzitabin,0,4/26/2020,3.18,1.43,Zebzitabin,0
PKOQJ629,1,59,20181100272992,2018-04-22,3.21,1.16,Bazopamab,0,7/30/2018,3.5,1.11,Bazopamab,0,10/23/2018,3.55,1.52,Bazopamab,0,4/30/2019,3.78,2.15,Zebzitabin,0,10/16/2019,3,1.81,Bazopamab,0,4/18/2020,3.08,1.9,Bazopamab,0
EWOYZ167,1,55,20181100271335,2018-04-23,6.13,1.23,Bazopamab,0,8/2/2018,4.37,1.54,Zebzitabin,0,10/19/2018,2.02,1.61,Zebzitabin,0,4/22/2019,2.51,1.31,Bazopamab,0,10/24/2019,2.78,1.1,Bazopamab,0,4/9/2020,3.51,0.95,Bazopamab,0
CMFZB062,1,62,20181100274315,2018-04-23,5.03,1.28,Zebzitabin,0,8/5/2018,4.67,2,Bazopamab,0,,,,,,,,,,,,,,,,,,,,
YFSUC603,0,56,20181100271028,2018 04 24,7.88,2.41,Zebzitabin,0,7/25/2018,6.87,2.31,Bazopamab,0,10/25/2018,4.25,1.83,Bazopamab 800 mg daily,0,4/27/2019,3.42,1.57,Bazopamab,0,,,,,,,,,,
DFOHY050,0,52,20181100270832,2018-04-24,4.4,1.66,Bazopamab,0,7/19/2018,4.59,1.26,Bazopamab,0,10/29/2018,3.38,1.34,Bazopamab,0,4/12/2019,3.46,1.98,Bazopamab,0,10/7/2019,2.21,1.69,Bazopamab,0,5/5/2020,2.74,1.57,Zebzitabin,0
YILLF329,1,64,20181100274586,2018-04-24,3.97,0.89,Zebzitabin-Mono,0,7/22/2018,2.96,0.84,Zebzitabin,1,,,,,,,,,,,,,,,,,,,,
NCTDS043,0,59,20181100273683,2018-04-25,5.75,1.65,Zebzitabin,1,7/20/2018,4.82,1.57,Zebzitabin,1,10/24/2018,3.19,1.49,Bazopamab,1,,,,,,,,,,,,,,,
QAXBV707,0,54,20181100274398,2018-04-25,6.05,1.77,Zebzitabin,0,7/23/2018,5.57,2.28,Zebzitabin,0,10/17/2018,4.83,2.16,Bazopamab,0,4/27/2019,4.68,1.81,Bazopamab,0,,,,,,,,,,
NPUCQ782,0,56,20181100274530,2018-04-26,6.46,2.04,Bazopamab,0,7/23/2018,5.23,1.49,Zebzitabin,0,10/24/2018,3.09,1.11,Bazopamab,0,4/13/2019,2.22,1.17,Zebzitabin,0,10/29/2019,1.42,1.31,Zebzitabin,0,5/5/2020,1.85,1.5,Zebzitabin,0
ARFAL866,0,41,20181100272202,2018-04-26,5.75,1.34,Zebzitabin,0,7/6/2018,4.25,1.46,Bazopamab,0,11/1/2018,2.52,1.5,Bazopamab,0,4/12/2019,2.54,1.33,Bazopamab,0,,,,,,,,,,
QWUXQ798,1,78,20181100273125,2018-04-26,3.53,0.48,Zebzitabin,0,7/28/2018,2.52,0.93,Zebzitabin,0,10/28/2018,2.07,1.7,Zebzitabin,0,,,,,,,,,,,,,,,
LOEBD770,0,59,20181100271113,2018-04-27,4.57,1.49,Bazopamab,0,7/31/2018,4.12,1.08,Zebzitabin,0,10/29/2018,2.65,1.16,Zebzitabin,0,5/6/2019,2.71,1.65,Bazopamab,0,10/30/2019,1.87,1.56,Zebzitabin mono,0,5/1/2020,2.45,1.49,Zebzitabin,0
NXADE397,0,46,20181100273473,2018-04-27,4.59,1.33,Zebzitabin,0,8/13/2018,4.59,1.82,Zebzitabin,0,11/8/2018,3.97,2.01,Bazopamab,0,,,,,,,,,,,,,,,
XYMCR374,1,68,20181100274939,2018-04-28,6.27,1.49,Bazopamab,0,7/16/2018,4.67,1.71,Zebzitabin,0,10/22/2018,2.73,1.53,Zebzitabin,0,4/27/2019,2.91,1.11,Zebzitabin,0,11/2/2019,2.8,1.47,Zebzitabin,0,4/22/2020,2.53,1.31,Zebzitabin,0
OSKCZ240,1,63,20181100273826,2018-04-28,4.83,1.14,Bazopamab,0,8/8/2018,4.34,2.03,Zebzitabin,0,10/18/2018,4.26,2.25,Zebzitabin mono,0,4/19/2019,4.88,1.87,Bazopamab,0,10/18/2019,4.8,1.84,Bazopamab,0,4/26/2020,3.77,1.73,Bazopamab,0
VTICX643,1,41,20181100270918,2018-04-28,6.06,1.84,Bazopamab,0,8/4/2018,5.09,1.6,Zebzitabin,0,10/24/2018,2.99,1.27,Zebzitabin,0,4/24/2019,2.99,1.22,Bazopamab,0,11/14/2019,2.12,1.67,Zebzitabin,0,5/1/2020,1.93,1.4,Zebzitabin,0
HWIGZ931,0,57,20181100274919,2018-04-29,3.5,0.64,Zebzitabin,0,7/24/2018,2.34,1.14,Zebzitabin,0,,,,,,,,,,,,,,,,,,,,
YAMJY597,1,51,20181100273179,2018-04-29,4.5,0.99,Zebzitabin,0,8/7/2018,3.6,1.71,Zebzitabin,0,10/31/2018,3.88,1.97,Bazopamab,0,4/25/2019,4.05,1.64,Zebzitabin 600 mg/m,0,10/22/2019,4.28,1.74,Zebzitabin,0,,,,,
BJNIJ721,1,76,20181100274898,2018-04-30,3.22,0.64,Zebzitabin,0,7/24/2018,2.42,0.81,Zebzitabin,1,,,,,,,,,,,,,,,,,,,,
FDTLU697,0,51,20181100270762,2018-04-30,6.17,2.03,Bazopamab,0,7/24/2018,5.62,1.54,Bazopamab,0,11/13/2018,2.99,1.3,Bazopamab,0,4/14/2019,2.85,1.62,Bazopamab,0,11/3/2019,1.68,1.33,Zebzitabin,0,5/6/2020,2.73,1.12,Zebzitabin,0
ATGHC342,0,49,20181100273685,2018-04-30,6.17,1.77,Bazopamab mono,0,7/28/2018,5.1,1.8,Zebzitabin,0,10/31/2018,3.8,1.65,Zebzitabin,0,5/7/2019,3.13,1.51,Zebzitabin mono,0,10/31/2019,2.75,1.29,Bazopamab mono,0,,,,,
EWXKX773,0,39,20181100272612,2018-05-01,4.46,0.93,Bazopamab 800mg/täglich,0,7/30/2018,3.22,1.48,Zebzitabin-Mono,0,11/14/2018,3.44,1.74,Bazopamab,0,,,,,,,,,,,,,,,
MOJER609,1,44,20181100274787,2018-05-01,3.4,0.98,Zebzitabin,0,8/2/2018,3.03,1.33,Zebzitabin,0,10/23/2018,3.76,1.56,Zebzitabin,0,4/23/2019,4.03,1.58,Bazopamab,0,,,,,,,,,,
WNNWW093,1,61,20181100271851,2018-05-02,6.77,1.7,Bazopamab,0,8/1/2018,4.96,2.07,Bazopamab,0,10/7/2018,3.98,1.72,Bazopamab,0,5/15/2019,3.25,0.97,Zebzitabin,0,10/22/2019,3.31,1.52,Zebzitabin,0,4/20/2020,2.19,1.83,Bazopamab,0
FQWQW890,1,59,20181100270284,2018-05-02,5.91,1.94,Zebzitabin,0,,,,,,,,,,,,,,,,,,,,,,,,,
JVUFW603,1,48,20181100273964,2018-05-02,4.73,1.56,Zebzitabin,0,7/30/2018,4.84,1.92,Zebzitabin,0,10/21/2018,4.64,1.96,Bazopamab,0,5/4/2019,4.84,1.98,Zebzitabin,0,10/25/2019,3.96,1.97,Bazopamab,0,,,,,
AOUZE413,1,64,20181100274268,2018-05-03,4.91,1.28,Bazopamab,0,7/24/2018,3.94,1.2,Bazopamab,0,11/2/2018,2.73,1.46,Zebzitabin,0,5/6/2019,2.46,1.73,Bazopamab,0,10/30/2019,2.37,1.11,Zebzitabin,0,4/28/2020,3.44,1.45,Bazopamab 800 mg daily,0
MZZGC232,1,52,20181100274180,2018-05-03,5.66,1.89,Zebzitabin,0,7/24/2018,6.15,2.33,Zebzitabin,0,11/6/2018,4.84,2.27,Bazopamab 800mg/täglich,0,4/29/2019,5.54,2.28,Bazopamab 800 mg daily,0,11/7/2019,4.24,1.85,Zebzitabin,0,5/8/2020,4.02,1.32,Bazopamab,0
ZRNTG984,0,56,20181100273568,2018-05-04,7.09,2.19,Bazopamab,0,7/30/2018,5.65,1.88,Zebzitabin,0,11/13/2018,3.82,1.31,Zebzitabin,0,4/27/2019,2.68,1,Bazopamab,0,10/11/2019,1.97,1.42,Bazopamab,0,5/14/2020,1.64,1.69,Bazopamab,0
KSYNN492,0,54,20181100270495,2018-05-04,5.5,1.41,Zebzitabin,0,8/2/2018,4.3,1.65,Zebzitabin,0,11/10/2018,3.65,1.7,Zebzitabin,0,5/6/2019,3.1,1.5,Bazopamab,0,11/1/2019,3.12,1.33,Bazopamab,0,,,,,
YELTP591,1,43,20181100273941,2018-05-04,3.54,0.74,Bazopamab,0,8/6/2018,2.63,1.22,Zebzitabin 600 mg/m,0,11/12/2018,3.29,1.62,Bazopamab,0,5/4/2019,3.42,1.55,Bazopamab,0,11/4/2019,3.7,1.83,Zebzitabin,0,5/18/2020,2.67,2.15,Zebzitabin,0
KGGEJ518,1,49,20181100274440,2018-05-05,5.2,1.16,Zebzitabin,1,8/16/2018,4.38,1.88,Bazopamab,1,11/12/2018,3.29,1.98,Zebzitabin,1,4/25/2019,4.35,1.57,Zebzitabin,1,,,,,,,,,,
NLIQI207,1,67,20181100274964,2018-05-05,3.88,0.6,Bazopamab,0,7/16/2018,2.51,0.7,Zebzitabin,0,11/11/2018,0.84,1.13,Bazopamab,0,5/3/2019,2.05,1.33,Bazopamab,0,11/15/2019,2.29,1.5,Bazopamab,0,5/9/2020,2.81,1.14,Bazopamab,0
XOPLF034,1,61,20181100272688,2018-05-06,6.24,2.31,Zebzitabin,0,8/11/2018,5.99,2.15,Bazopamab,0,,,,,,,,,,,,,,,,,,,,
SNCNT204,1,42,20181100270976,2018-05-06,5.65,1.99,Zebzitabin,0,8/10/2018,5.48,1.76,Bazopamab,0,,,,,,,,,,,,,,,,,,,,
PJWHZ982,0,46,20181100274223,2018-05-06,3.91,1.29,Zebzitabin,0,,,,,,,,,,,,,,,,,,,,,,,,,
QBKIL354,1,76,20181100271282,2018-05-07,2.85,0.64,Bazopamab,0,7/29/2018,1.9,0.37,Zebzitabin 600 mg/m,0,11/3/2018,1.48,0.89,Zebzitabin-Mono,0,4/25/2019,1.79,1.47,Bazopamab,0,10/29/2019,1.82,1.58,Bazopamab,0,5/4/2020,2.21,1.78,Bazopamab,0
HDIDJ696,1,61,20181100272170,2018-05-07,3.87,0.96,Zebzitabin,0,,,,,,,,,,,,,,,,,,,,,,,,,
QBOFC883,0,71,20181100272382,2018-05-08,3.34,1.06,Bazopamab,0,8/1/2018,2.89,0.88,Zebzitabin,0,11/5/2018,3.11,1.24,Bazopamab,0,5/3/2019,2.78,1.74,Bazopamab,0,11/16/2019,2.44,1.66,Zebzitabin,0,5/1/2020,2.41,2.1,Zebzitabin,0
NPVKA747,1,75,20181100273021,2018-05-08,5.1,0.9,Bazopamab,0,8/7/2018,3.66,1.98,Zebzitabin,0,11/17/2018,4.06,2.22,Zebzitabin,0,5/8/2019,4.16,1.47,Bazopamab,0,11/4/2019,4.88,1.64,Bazopamab,0,5/3/2020,3.51,1.96,Bazopamab,0
DDASB573,1,49,20181100274100,2018-05-08,4.86,1.24,Bazopamab,0,8/11/2018,4.61,1.94,Zebzitabin-Mono,0,10/31/2018,3.86,2.14,Zebzitabin,0,5/7/2019,4.84,1.96,Zebzitabin,0,10/31/2019,4.42,1.85,Zebzitabin,0,5/22/2020,3.81,1.45,Bazopamab,0
GKGYG220,1,69,20181100274259,2018-05-09,5.7,1.56,Bazopamab,0,7/26/2018,4.64,1.42,Bazopamab,0,12/3/2018,2.48,1.33,Bazopamab,0,5/8/2019,2.71,1.38,Zebzitabin,0,11/14/2019,2.17,1.43,Bazopamab,0,5/2/2020,2.62,1.21,Bazopamab,0
IEQYC596,1,49,20181100270632,2018-05-09,5.06,1.5,Bazopamab,0,8/15/2018,4.39,1.58,Zebzitabin,0,11/9/2018,3.66,1.57,Zebzitabin,0,5/27/2019,3.49,1.58,Zebzitabin,0,11/10/2019,2.97,1.67,Zebzitabin,0,4/28/2020,2.6,1.77,Bazopamab,0
RPHYD649,1,71,20181100270531,2018-05-10,5.16,1.15,Zebzitabin,0,,,,,,,,,,,,,,,,,,,,,,,,,
BRWMO043,1,28,20181100272269,2018-05-10,5.4,2.04,Zebzitabin,0,8/5/2018,4.94,1.08,Zebzitabin,0,11/11/2018,2.72,0.79,Zebzitabin,0,5/5/2019,2.17,1.42,Bazopamab,0,11/1/2019,0.73,1.52,Bazopamab,0,,,,,
SMMZT375,1,58,20181100274456,2018-05-10,5.92,1.84,Bazopamab,0,8/9/2018,4.89,1.86,Bazopamab,0,11/4/2018,4.26,1.5,Bazopamab,0,5/12/2019,3.53,1.16,Bazopamab,0,11/12/2019,2.9,1.85,Bazopamab,0,5/8/2020,1.6,2.06,Bazopamab,0
ZGULL917,0,53,20181100272097,2018-05-11,5.7,2.05,Bazopamab,0,7/28/2018,5.68,1.95,Zebzitabin,0,11/13/2018,4.75,1.75,Zebzitabin,0,5/17/2019,4.19,1.89,Bazopamab,0,11/16/2019,2.99,1.66,Bazopamab,0,5/23/2020,2.85,1.77,Zebzitabin,0
JUQYK738,1,65,20181100272456,2018-05-11,4.96,0.86,Zebzitabin,0,8/10/2018,3.46,1.46,Zebzitabin mono,1,11/29/2018,2.72,1.84,Bazopamab,1,5/25/2019,2.94,1.58,Zebzitabin,1,11/16/2019,3.6,1.19,Bazopamab,1,,,,,
TSNPL502,1,77,20181100273714,2018-05-12,4.23,1.37,Bazopamab,0,8/15/2018,4.06,1.34,Bazopamab,0,11/3/2018,3.58,1.55,Bazopamab 800mg/täglich,0,5/18/2019,3.55,1.92,Bazopamab,0,11/6/2019,2.87,1.65,Zebzitabin,0,5/9/2020,3,1.77,Zebzitabin,0
NJWBL936,0,65,20181100273139,2018-05-12,2.73,0.34,Zebzitabin,0,7/30/2018,1.59,0.28,Bazopamab,0,,,,,,,,,,,,,,,,,,,,
OCRAA218,1,44,20181100270812,2018-05-12,3.85,1.32,Zebzitabin,0,8/15/2018,3.71,1.22,Bazopamab,0,,,,,,,,,,,,,,,,,,,,
TSTSW022,0,65,20181100272665,2018-05-13,5.08,0.45,Zebzitabin,0,8/30/2018,2.79,1.33,Zebzitabin,1,11/24/2018,1.75,1.86,Zebzitabin,1,5/6/2019,2.35,1.33,Zebzitabin,1,10/25/2019,3.76,0.98,Zebzitabin,1,,,,,
KFOKN727,1,54,20181100273013,2018-05-13,3.16,0.5,Zebzitabin,0,8/11/2018,2.07,0.97,Bazopamab,0,11/7/2018,2.85,1.58,Zebzitabin 600 mg/m,0,,,,,,,,,,,,,,,
AENAE759,1,56,20181100272751,2018-05-14,5.12,1.5,Bazopamab,0,8/4/2018,4.65,1.9,Bazopamab,0,11/2/2018,4.06,1.78,Bazopamab,0,4/24/2019,4.48,1.52,Zebzitabin,0,11/4/2019,3.79,2.1,Zebzitabin,0,5/16/2020,2.38,1.8,Bazopamab,0
KLHAC167,1,52,20181100273789,2018-05-14,4.38,1.58,Zebzitabin,1,8/15/2018,4.62,1.77,Bazopamab,1,,,,,,,,,,,,,,,,,,,,
MZXZO612,1,53,20181100270733,2018-05-14,5.8,1.91,Zebzitabin,0,,,,,,,,,,,,,,,,,,,,,,,,,
WNKHD670,1,41,20181100271550,2018-05-15,4.65,1.44,Zebzitabin,1,8/19/2018,4.12,1.15,Bazopamab,1,11/10/2018,2.79,1.28,Zebzitabin,1,,,,,,,,,,,,,,,
IAEFJ244,1,68,20181100272646,2018-05-15,4.94,1.81,Bazopamab,0,7/29/2018,5.13,2.03,Bazopamab,0,11/21/2018,5.12,1.86,Zebzitabin,0,5/24/2019,5.01,1.81,Zebzitabin,0,11/2/2019,3.83,2.19,Zebzitabin,0,5/15/2020,2.35,2.11,Bazopamab,0
DVYUJ406,0,53,20181100271521,2018-05-16,4.32,0.63,Bazopamab,0,8/20/2018,2.25,0.86,Zebzitabin,0,11/21/2018,1.86,1.28,Zebzitabin,0,4/26/2019,1.57,1.16,Bazopamab,0,11/21/2019,2.54,1.14,Zebzitabin,0,5/9/2020,2.8,1.76,Bazopamab,0
QUARD423,1,66,20181100270176,2018-05-16,4.97,1.49,Bazopamab 800 mg daily,0,8/30/2018,4.05,1.4,Bazopamab,0,,,,,,,,,,,,,,,,,,,,
QQPWG456,1,51,20181100271642,2018-05-16,6.03,1.24,Zebzitabin,0,8/11/2018,4.13,1.49,Zebzitabin,0,11/10/2018,2.13,1.48,Bazopamab,1,5/27/2019,2.38,1.1,Zebzitabin,1,,,,,,,,,,
LOMHQ704,0,60,20181100270367,2018-05-17,5.99,2.08,Bazopamab,0,7/27/2018,5.28,1.7,Bazopamab,0,11/11/2018,4.17,1.34,Bazopamab,0,5/28/2019,3.11,1.41,Bazopamab,0,10/29/2019,2.13,1.57,Bazopamab,0,5/3/2020,1.89,1.89,Zebzitabin,0
CHFFY229,0,59,20181100273356,2018-05-17,3.54,0.91,Zebzitabin,0,,,,,,,,,,,,,,,,,,,,,,,,,
WDBQO074,1,38,20181100271860,2018-05-18,5.16,1.38,Zebzitabin,0,,,,,,,,,,,,,,,,,,,,,,,,,
KDNXN330,0,54,20181100271881,2018-05-18,5.24,1.52,Bazopamab,0,8/16/2018,3.67,1.04,Zebzitabin,0,12/2/2018,2.8,0.93,Bazopamab,0,6/12/2019,1.58,1.05,Zebzitabin,0,11/15/2019,1.42,1.31,Zebzitabin,0,5/8/2020,1.52,1.98,Zebzitabin,0
ZEXAD214,1,51,20181100273462,2018-05-18,5.93,1.48,Zebzitabin,0,8/22/2018,4.36,1.8,Bazopamab,0,11/23/2018,3.77,1.65,Bazopamab,0,,,,,,,,,,,,,,,
SNHCD647,1,59,20181100274854,2018-05-19,5.19,1.33,Zebzitabin,0,8/12/2018,4.18,1.56,Zebzitabin,0,11/20/2018,2.94,1.51,Bazopamab,0,6/11/2019,3.44,1.3,Zebzitabin,0,11/25/2019,3.07,1.83,Zebzitabin,0,,,,,
WCNYG669,0,52,20181100273142,2018-05-19,5.21,1.14,Bazopamab,0,8/19/2018,4.24,1.6,Bazopamab,0,11/16/2018,2.64,1.8,Zebzitabin,0,5/20/2019,3.55,1.63,Zebzitabin,0,11/14/2019,3.47,1.51,Bazopamab mono,0,6/3/2020,3.61,1.16,Zebzitabin,0
HSSLZ284,1,56,20181100270975,2018-05-20,4.88,0.86,Zebzitabin,0,8/26/2018,3.3,1.7,Zebzitabin,0,12/7/2018,3.63,1.96,Bazopamab,0,5/25/2019,3.51,1.38,Zebzitabin,0,11/24/2019,4.27,1.54,Zebzitabin,0,,,,,
EWBEG516,1,60,20181100270890,2018-05-20,3.98,1.57,Zebzitabin,0,8/29/2018,3.82,0.69,Bazopamab,0,12/13/2018,2.36,0.76,Bazopamab,0,5/18/2019,2.15,1.68,Bazopamab,0,11/18/2019,0.93,1.59,Zebzitabin,0,5/19/2020,1.87,1.61,Bazopamab 800mg/täglich,0
BHIKZ672,0,56,20181100271384,2018-05-20,6.62,1.68,Zebzitabin,1,8/6/2018,5.08,1.94,Bazopamab,1,11/20/2018,3.52,1.71,Bazopamab,1,,,,,,,,,,,,,,,
QZYTO439,1,56,20181100273727,2018-05-21,6.04,1.06,Bazopamab,0,8/9/2018,3.9,1.52,Zebzitabin,0,12/4/2018,2.1,1.63,Zebzitabin,0,5/23/2019,2.31,1.13,Bazopamab,0,10/26/2019,3,1.09,Zebzitabin,0,5/16/2020,3.33,1.18,Bazopamab,0
HLZDS026,1,56,20181100272589,2018-05-21,4.6,0.47,Bazopamab mono,0,8/10/2018,2.64,1.32,Bazopamab,0,,,,,,,,,,,,,,,,,,,,
QMKXM968,0,40,20181100270230,2018-05-22,5.24,1.24,Bazopamab,0,8/5/2018,4.13,1.62,Bazopamab,0,12/2/2018,3.08,1.68,Zebzitabin,0,6/10/2019,3.45,1.42,Zebzitabin,0,12/3/2019,3.36,1.64,Bazopamab,0,5/25/2020,2.87,1.53,Zebzitabin,0
KDDKF782,1,49,20181100270554,2018-05-22,2.98,1.11,Bazopamab,0,8/24/2018,3.28,0.93,Zebzitabin,0,11/27/2018,3.05,1.31,Bazopamab,0,5/10/2019,3.58,2.02,Zebzitabin,0,10/31/2019,2.65,1.96,Zebzitabin,0,5/7/2020,2.64,1.83,Bazopamab,0
XTZYV709,1,47,20181100273511,2018-05-22,7.51,2.07,Bazopamab,0,8/19/2018,5.77,2.07,Bazopamab,0,11/17/2018,3.83,1.61,Bazopamab 800 mg daily,0,6/2/2019,2.76,1.1,Zebzitabin,0,11/12/2019,2.5,1.14,Zebzitabin,0,5/20/2020,2.52,1.5,Bazopamab,0
CWHHQ340,0,56,20181100274580,2018-05-23,3.43,0.89,Zebzitabin,0,9/10/2018,2.75,0.96,Bazopamab,0,12/3/2018,2.81,1.33,Bazopamab,0,5/28/2019,2.96,1.6,Zebzitabin,0,12/2/2019,2.84,1.76,Zebzitabin,0,5/26/2020,2.46,1.97,Bazopamab,0
UEYHQ542,1,56,20181100271458,2018-05-23,5.3,1.56,Bazopamab,0,8/7/2018,4.85,1.83,Bazopamab,0,12/5/2018,4.12,1.88,Bazopamab,0,5/6/2019,4.04,1.84,Bazopamab,0,11/26/2019,3.51,1.58,Bazopamab,0,5/26/2020,3.33,1.66,Bazopamab,0
DRLIQ900,1,64,20181100273261,2018-05-24,6.27,0.98,Zebzitabin,0,8/25/2018,4.05,1.52,Zebzitabin,0,12/5/2018,1.39,1.65,Bazopamab,0,,,,,,,,,,,,,,,
XQZQQ108,1,59,20181100273294,2018-05-24,4.15,0.62,Bazopamab 800mg/täglich,0,8/21/2018,2.44,0.78,Zebzitabin,0,11/30/2018,1.42,1.27,Zebzitabin-Mono,0,5/30/2019,1.73,1.36,Zebzitabin,1,12/6/2019,2.41,1.16,Bazopamab,1,,,,,
GFHQF982,1,55,20181100272380,2018-05-24,5.66,1.25,Bazopamab,0,9/10/2018,4.05,1.73,Zebzitabin,0,11/4/2018,3.17,1.65,Zebzitabin,0,5/25/2019,3.27,1.08,Bazopamab,0,12/5/2019,3.44,1.69,Bazopamab,0,6/14/2020,2.36,1.7,Bazopamab,0
RAJZX606,1,45,20181100274207,2018-05-25,4.53,1,Bazopamab,0,8/23/2018,4.08,1.37,Bazopamab,0,11/14/2018,2.18,1.77,Zebzitabin,0,5/9/2019,3.66,1.97,Bazopamab,0,11/14/2019,3.34,1.5,Bazopamab,0,5/29/2020,4.14,0.9,Bazopamab mono,0
FOWVT185,0,50,20181100274364,2018-05-25,5.1,1.77,Zebzitabin,0,8/18/2018,5.15,1.65,Zebzitabin,0,12/8/2018,3.95,1.66,Bazopamab,0,6/4/2019,3.92,2.01,Zebzitabin,0,11/21/2019,2.83,1.6,Bazopamab,0,5/10/2020,3.2,1.53,Bazopamab,0
EPXNH407,0,53,20181100273097,2018-05-26,3.68,0.9,Zebzitabin,0,,,,,,,,,,,,,,,,,,,,,,,,,
UDBVU943,1,46,20181100274808,2018-05-26,4.35,0.97,Zebzitabin,0,,,,,,,,,,,,,,,,,,,,,,,,,
BMCQK084,1,63,20181100271893,2018-05-26,4.26,1.69,Bazopamab,0,8/24/2018,4.32,1.21,Bazopamab,0,11/18/2018,3.41,1.12,Bazopamab,0,5/16/2019,3.44,1.63,Bazopamab 800mg/täglich,0,12/7/2019,2.05,2.05,Bazopamab,0,5/31/2020,1.63,1.85,Bazopamab mono,0
WZQTT940,0,57,20181100274709,2018-05-27,6.22,1.2,Zebzitabin,0,8/25/2018,3.92,1.66,Bazopamab mono,0,11/29/2018,2.79,1.61,Zebzitabin,0,,,,,,,,,,,,,,,
MIQVK439,1,61,20181100272907,2018-05-27,6.03,1.86,Zebzitabin,0,,,,,,,,,,,,,,,,,,,,,,,,,
METOZ464,1,53,20181100273755,2018-05-28,4.57,1.25,Zebzitabin,0,8/23/2018,3.77,1.22,Bazopamab,0,,,,,,,,,,,,,,,,,,,,
WYAEX474,0,49,20181100271297,2018-05-28,6.31,1.84,Bazopamab 800 mg daily,0,8/8/2018,5.45,1.88,Zebzitabin,0,,,,,,,,,,,,,,,,,,,,
NZMHT451,1,68,20181100273415,2018-05-28,5.07,1.8,Zebzitabin,1,8/18/2018,4.68,0.91,Bazopamab,1,,,,,,,,,,,,,,,,,,,,
GRYVG474,0,48,20181100272854,2018-05-29,5.52,1.06,Zebzitabin,0,8/27/2018,3.43,1.38,Bazopamab,0,,,,,,,,,,,,,,,,,,,,
XPEWI765,0,72,20181100274595,2018-05-29,4.3,0.77,Zebzitabin,0,8/31/2018,2.73,1.11,Zebzitabin,0,11/20/2018,2.64,1.54,Zebzitabin,0,,,,,,,,,,,,,,,
KFKPN203,0,58,20181100271831,2018-05-30,4.08,1.25,Bazopamab,0,8/8/2018,3.05,1.02,Bazopamab,0,11/25/2018,3.43,1.13,Zebzitabin,0,5/26/2019,2.37,1.33,Zebzitabin,0,12/7/2019,2.22,1.62,Bazopamab,0,6/4/2020,1.68,2.36,Bazopamab 800mg/täglich,0
ZFXKN412,1,56,20181100274194,2018-05-30,7.29,2,Zebzitabin,0,,,,,,,,,,,,,,,,,,,,,,,,,
SKKFD379,1,41,20181100273059,2018-05-30,4.29,0.98,Zebzitabin,0,8/23/2018,2.76,0.72,Zebzitabin,0,12/15/2018,1.45,0.84,Bazopamab,0,,,,,,,,,,,,,,,
DIFCA096,1,52,20181100270130,2018-05-31,6.63,1.54,Zebzitabin,0,8/25/2018,4.78,2.09,Bazopamab,0,,,,,,,,,,,,,,,,,,,,
TEABL773,1,45,20181100271815,2018-05-31,4.39,1.1,Bazopamab,0,8/16/2018,3.94,1.96,Bazopamab,0,11/18/2018,4.75,2.21,Bazopamab,0,6/5/2019,4.87,1.86,Zebzitabin,0,11/26/2019,4.85,1.93,Zebzitabin,0,5/23/2020,3.4,2.15,Bazopamab,0
MLHXP278,1,72,20181100271400,2018-06-01,6.26,1.05,Bazopamab 800mg/täglich,1,8/26/2018,4.13,1.75,Zebzitabin,1,11/22/2018,2.56,1.92,Zebzitabin,1,5/13/2019,2.71,1.29,Bazopamab,1,,,,,,,,,,
JXOMA900,1,72,20181100270030,2018-06-01,3.79,1.22,Bazopamab,0,9/13/2018,3.52,1.02,Zebzitabin,0,11/14/2018,2.79,1.24,Zebzitabin,0,6/1/2019,3.09,1.73,Zebzitabin,0,12/3/2019,2.38,1.78,Zebzitabin-Mono,0,5/11/2020,2.45,1.71,Zebzitabin,0
FCESA828,1,55,20181100273391,2018-06-01,4.83,1.22,Zebzitabin,0,9/1/2018,3.49,0.98,Zebzitabin,0,11/25/2018,2.09,1.1,Bazopamab,0,6/15/2019,1.95,1.28,Bazopamab,0,12/3/2019,1.84,1.35,Bazopamab,0,6/16/2020,2.33,1.52,Zebzitabin,0
RLPIO143,1,50,20181100270489,2018-06-02,3.53,1.36,Bazopamab,0,9/12/2018,3.26,0.77,Zebzitabin,0,11/22/2018,2.93,0.9,Bazopamab,0,5/30/2019,2.51,1.58,Bazopamab,0,12/10/2019,1.62,1.81,Zebzitabin,0,6/10/2020,1.58,2.06,Zebzitabin,0
SHYZO691,1,50,20181100272901,2018-06-02,5.08,0.94,Bazopamab,0,9/1/2018,3.46,1.3,Zebzitabin,0,12/24/2018,2.14,1.55,Zebzitabin,0,5/30/2019,2.54,1.35,Bazopamab,0,12/18/2019,2.98,1.29,Bazopamab,0,5/29/2020,3.25,1.33,Bazopamab,0
DYRCQ440,1,41,20181100271371,2018-06-03,4.47,1.63,Bazopamab,0,8/10/2018,4.1,1.24,Bazopamab,0,11/24/2018,3.5,1.11,Zebzitabin,0,5/26/2019,3.15,1.42,Zebzitabin,0,11/25/2019,2.11,1.97,Zebzitabin,0,5/28/2020,1.42,2.03,Zebzitabin 600 mg/m,0
UNABO691,1,51,20181100271166,2018-06-03,6.23,1.41,Bazopamab,0,9/2/2018,4.3,1.22,Zebzitabin,0,12/15/2018,1.52,1.17,Zebzitabin,0,5/23/2019,1.57,1.09,Zebzitabin,0,11/19/2019,1.63,1,Zebzitabin,0,5/29/2020,2.76,0.96,Zebzitabin,0
DWPYQ187,1,75,20181100270380,2018-06-03,3.64,1.15,Zebzitabin,0,9/27/2018,3.4,1.22,Zebzitabin,0,12/2/2018,3.74,1.55,Zebzitabin mono,0,5/31/2019,3.5,1.91,Bazopamab,0,,,,,,,,,,
SQDDI276,0,61,20181100271401,2018-06-04,3.55,0.86,Zebzitabin,0,8/20/2018,2.81,1.01,Zebzitabin,0,12/29/2018,2.48,1.31,Bazopamab,0,6/10/2019,3.12,1.47,Zebzitabin,0,,,,,,,,,,
UOTEV895,0,50,20181100270764,2018-06-04,3.9,0.96,Bazopamab,0,8/21/2018,2.61,0.77,Zebzitabin,0,12/3/2018,2.02,0.94,Zebzitabin,0,6/4/2019,2.05,1.12,Zebzitabin,0,11/28/2019,2,1.73,Bazopamab,0,5/28/2020,1.56,1.88,Bazopamab,0
DGRXT547,0,58,20181100273285,2018-06-05,6.66,2.33,Bazopamab,0,9/16/2018,6.21,1.98,Zebzitabin,0,11/20/2018,4.26,1.5,Bazopamab,0,7/5/2019,3.6,1.54,Bazopamab,0,12/14/2019,2.25,1.57,Zebzitabin 600 mg/m,0,6/9/2020,2.28,1.52,Bazopamab,0
CLEEI555,1,76,20181100270511,2018-06-05,2.07,0.61,Bazopamab,0,8/28/2018,2.48,0.72,Bazopamab,0,12/21/2018,2.12,1.34,Zebzitabin,0,6/4/2019,3.88,2.06,Zebzitabin,0,12/2/2019,3.12,2.22,Zebzitabin,0,6/25/2020,2.88,1.56,Zebzitabin,0
ZYIZL469,1,51,20181100272789,2018-06-05,5.04,1.45,Bazopamab,0,9/10/2018,4.06,0.89,Bazopamab,0,12/1/2018,1.88,1.03,Zebzitabin,0,6/13/2019,1.7,1.58,Bazopamab,0,11/27/2019,1.22,1.06,Bazopamab,0,6/6/2020,2.89,1.19,Zebzitabin,0
JEVKB290,1,71,20181100272301,2018-06-06,6.84,1.44,Bazopamab,0,9/11/2018,4.97,2.32,Bazopamab 800 mg daily,0,11/28/2018,4.33,2.26,Zebzitabin,0,5/29/2019,3.67,1.37,Zebzitabin,0,12/14/2019,4.33,1.14,Bazopamab,0,5/29/2020,3.8,1.67,Bazopamab,0
GTMJM949,1,57,20181100272093,2018-06-06,5.22,1.27,Bazopamab,0,8/21/2018,3.53,1.17,Zebzitabin,0,11/30/2018,2.4,1.13,Bazopamab,0,6/8/2019,2.06,0.99,Zebzitabin,0,12/18/2019,2.11,1.49,Zebzitabin,0,6/3/2020,1.8,1.73,Bazopamab,0
EIDJP268,1,43,20181100270935,2018-06-07,5.4,1.52,Zebzitabin-Mono,0,9/6/2018,4.79,1.81,Zebzitabin,0,11/26/2018,3.96,1.87,Zebzitabin,0,6/2/2019,3.85,1.8,Bazopamab,0,,,,,,,,,,
NDEIU882,1,50,20181100271899,2018 06 07,5.84,1.08,Zebzitabin,0,9/4/2018,3.73,1.25,Bazopamab,0,11/11/2018,1.73,1.41,Zebzitabin,0,5/29/2019,1.74,1.18,Bazopamab,1,,,,,,,,,,
VHQOA582,0,57,20181100274698,2018-06-07,5.72,1.65,Bazopamab,0,8/22/2018,4.86,1.77,Zebzitabin,0,11/24/2018,3.88,1.71,Zebzitabin,0,5/31/2019,3.44,1.59,Zebzitabin,0,12/12/2019,3.04,1.44,Bazopamab,0,6/2/2020,2.97,1.67,Zebzitabin,0
CEZWP536,1,54,20181100271737,2018-06-08,5.41,1.77,Bazopamab,0,9/15/2018,5.06,1.75,Zebzitabin,0,12/5/2018,4.35,1.75,Zebzitabin,0,6/19/2019,3.68,1.9,Bazopamab,0,12/17/2019,2.98,1.41,Zebzitabin,0,6/15/2020,3.24,1.77,Zebzitabin,0
ECPAA438,1,59,20181100273501,2018-06-08,3.73,1.92,Zebzitabin,0,9/11/2018,4.59,0.85,Bazopamab,0,12/11/2018,3.11,0.81,Zebzitabin,0,6/20/2019,3.15,2,Zebzitabin,0,12/5/2019,1.01,1.97,Bazopamab,0,6/8/2020,1.7,1.65,Bazopamab,0
TRCDY624,0,58,20181100274528,2018-06-09,4.68,1.51,Bazopamab,0,9/11/2018,4.58,1.55,Zebzitabin,0,11/19/2018,3.66,1.65,Zebzitabin,0,6/10/2019,3.9,1.91,Zebzitabin,0,12/6/2019,3.06,1.71,Bazopamab,0,6/5/2020,3.09,1.59,Bazopamab,0
YJWOH782,0,52,20181100271510,2018-06-09,4.66,1.55,Zebzitabin,0,9/10/2018,4.61,1.85,Bazopamab,0,,,,,,,,,,,,,,,,,,,,
ARUTS121,0,43,20181100272248,2018-06-09,4.36,1.52,Bazopamab,0,9/1/2018,3.71,0.92,Bazopamab,0,12/5/2018,2.9,0.95,Bazopamab,0,6/18/2019,2.22,1.48,Bazopamab mono,0,12/15/2019,1.48,1.54,Bazopamab,0,6/5/2020,1.81,1.9,Zebzitabin,0
ZBKNC475,1,45,20181100272379,2018-06-10,3.26,0.66,Bazopamab,0,10/3/2018,2.38,0.91,Zebzitabin,0,12/17/2018,2.45,1.39,Bazopamab,0,6/26/2019,2.9,1.56,Zebzitabin,0,12/4/2019,3.08,1.75,Zebzitabin,0,6/14/2020,2.67,1.89,Bazopamab,0
FQCPE395,0,70,20181100270709,2018-06-10,6.42,1.44,Zebzitabin,0,9/5/2018,4.3,1.66,Zebzitabin,0,,,,,,,,,,,,,,,,,,,,
QWHGY702,1,42,20181100272062,2018-06-11,3.82,0.77,Zebzitabin,0,9/24/2018,2.72,0.95,Bazopamab,0,12/16/2018,2.34,1.42,Bazopamab,1,,,,,,,,,,,,,,,
KILZK903,1,38,20181100274312,2018-06-11,4.5,1.1,Zebzitabin,0,9/16/2018,3.62,1.27,Bazopamab,0,12/29/2018,2.84,1.54,Zebzitabin,0,5/16/2019,3,1.66,Bazopamab,0,12/8/2019,2.93,1.45,Bazopamab,0,,,,,
THFFU745,0,68,20181100270669,2018-06-11,5.54,1.31,Zebzitabin,0,9/20/2018,4.28,1.56,Zebzitabin,0,11/16/2018,2.73,1.58,Zebzitabin,0,6/1/2019,3.07,1.38,Bazopamab,0,,,,,,,,,,
NAPPQ476,1,56,20181100274381,2018-06-12,7.22,2.05,Zebzitabin,0,,,,,,,,,,,,,,,,,,,,,,,,,
VQZAN640,1,45,20181100270273,2018-06-12,6.91,1.96,Zebzitabin mono,0,8/30/2018,6.49,2.81,Zebzitabin,0,12/18/2018,5.5,2.58,Zebzitabin,0,6/3/2019,5.51,1.92,Bazopamab,0,12/12/2019,4.92,1.63,Bazopamab,0,,,,,
GNOKP442,0,51,20181100272095,2018-06-13,5.25,1.69,Zebzitabin 600 mg/m,1,9/2/2018,4.46,1.28,Bazopamab,1,,,,,,,,,,,,,,,,,,,,
RHZCW766,1,50,20181100272175,2018-06-13,5.49,1.85,Bazopamab,0,8/31/2018,5.15,1.78,Zebzitabin,0,12/3/2018,4.16,1.6,Bazopamab,0,6/3/2019,3.86,1.66,Zebzitabin,0,11/19/2019,2.88,1.75,Zebzitabin,0,6/4/2020,2.47,1.75,Bazopamab,0
SBLVN211,1,47,20181100270180,2018-06-13,6.73,1.86,Zebzitabin,0,9/23/2018,5.41,1.62,Bazopamab,0,,,,,,,,,,,,,,,,,,,,
RLCZQ661,0,47,20181100272871,2018-06-14,4.71,0.96,Zebzitabin,0,9/10/2018,3.85,1.85,Zebzitabin 600 mg/m,0,,,,,,,,,,,,,,,,,,,,
IAAZI380,1,73,20181100272440,2018-06-14,8.43,2.54,Bazopamab,0,9/11/2018,6.71,2.07,Bazopamab,0,11/28/2018,3.3,1.27,Zebzitabin,0,6/10/2019,2.36,0.87,Zebzitabin mono,0,11/30/2019,1.44,1.16,Bazopamab mono,0,6/13/2020,1.84,1.11,Zebzitabin,0
UFRCQ197,1,65,20181100272357,2018-06-15,5.46,1.78,Zebzitabin,0,9/6/2018,4.74,1.47,Bazopamab,1,,,,,,,,,,,,,,,,,,,,
CXVFU639,1,60,20181100270271,2018-06-15,4.08,1.58,Zebzitabin mono,0,9/29/2018,4.39,1.45,Zebzitabin,0,12/19/2018,4.05,1.5,Zebzitabin,0,6/19/2019,4.17,1.92,Zebzitabin,1,,,,,,,,,,
RNPPS418,1,63,20181100270645,2018-06-15,7.75,1.84,Bazopamab,0,9/9/2018,5.84,2.16,Zebzitabin,0,12/12/2018,3.25,1.88,Bazopamab,0,6/22/2019,2.88,1.26,Zebzitabin,0,12/14/2019,2.97,0.91,Zebzitabin,0,6/24/2020,3.61,1,Bazopamab mono,0
KABYS835,1,48,20181100270141,2018-06-16,5.13,1.19,Bazopamab,0,9/25/2018,3.51,1.18,Zebzitabin,0,12/20/2018,2.43,1.26,Zebzitabin,0,6/9/2019,2.13,1.16,Bazopamab,0,12/12/2019,2.3,1.35,Zebzitabin,0,6/6/2020,2.34,1.65,Zebzitabin,0
OUDRT304,1,63,20181100270535,2018-06-16,5.63,1.26,Bazopamab,0,9/11/2018,3.57,1.34,Bazopamab,0,12/20/2018,2.68,1.26,Bazopamab,0,6/11/2019,2.03,0.87,Bazopamab,0,12/12/2019,2.41,1.38,Zebzitabin mono,0,6/3/2020,1.89,1.83,Bazopamab mono,0
PRCRH855,1,74,20181100274596,2018-06-17,3.49,0.83,Zebzitabin,1,9/21/2018,2.83,0.92,Zebzitabin,1,12/18/2018,2.43,1.39,Zebzitabin 600 mg/m,1,6/20/2019,2.87,1.74,Bazopamab,1,,,,,,,,,,
TFNAL751,0,42,20181100273769,2018-06-17,5.59,1.46,Zebzitabin,0,,,,,,,,,,,,,,,,,,,,,,,,,
LLTMU804,0,73,20181100270863,2018-06-17,3.08,1.06,Bazopamab,0,9/6/2018,3.16,0.98,Bazopamab,0,12/12/2018,3.13,1.36,Zebzitabin,0,6/16/2019,3.52,1.94,Bazopamab,0,1/8/2020,2.8,1.92,Zebzitabin,0,6/11/2020,2.62,1.91,Bazopamab,0
EMZXB074,1,67,20181100272692,2018-06-18,6,1.59,Zebzitabin,0,9/5/2018,4.49,1.78,Bazopamab mono,0,12/13/2018,4.01,1.63,Zebzitabin,0,6/23/2019,2.95,1.23,Bazopamab,0,,,,,,,,,,
FPSJX003,1,47,20181100274471,2018-06-18,8.01,1.45,Zebzitabin,0,,,,,,,,,,,,,,,,,,,,,,,,,
MKEYA697,1,55,20181100272130,2018-06-19,3.44,0.92,Bazopamab,0,9/1/2018,2.72,0.83,Bazopamab,0,12/20/2018,2.43,1.15,Zebzitabin,0,6/22/2019,2.66,1.5,Zebzitabin,0,12/26/2019,2.42,1.78,Bazopamab,0,6/7/2020,2.18,1.88,Zebzitabin-Mono,0
CJWGS061,1,58,20181100272300,2018-06-19,5.66,1.39,Zebzitabin,0,9/11/2018,3.82,0.95,Bazopamab,0,12/24/2018,1.69,0.96,Bazopamab 800 mg daily,0,6/25/2019,1.12,1.12,Bazopamab,0,12/29/2019,1.17,0.95,Bazopamab,0,6/15/2020,2.4,1.3,Bazopamab,0
YVWHP831,1,52,20181100272046,2018-06-19,5.24,1.25,Bazopamab,0,9/12/2018,4.03,1.53,Zebzitabin,0,12/17/2018,2.91,1.56,Bazopamab,0,7/8/2019,3.19,1.33,Bazopamab,0,12/6/2019,3.1,1.63,Bazopamab,0,6/30/2020,2.64,1.55,Bazopamab 800mg/täglich,0
HLXDA344,1,37,20181100271040,2018-06-20,5.53,1.65,Bazopamab,0,9/22/2018,3.94,1.16,Bazopamab,0,12/5/2018,3.11,0.99,Bazopamab,0,6/13/2019,1.64,1.05,Bazopamab,0,1/10/2020,1.45,1.25,Zebzitabin,0,6/19/2020,1.56,2.03,Bazopamab,0
XLRSO695,0,51,20181100274013,2018-06-20,5.41,1.97,Bazopamab,0,9/14/2018,5.55,2.14,Bazopamab,0,12/28/2018,5.22,1.89,Bazopamab,0,6/26/2019,4.95,1.82,Zebzitabin,0,12/13/2019,3.71,2.06,Bazopamab,0,6/21/2020,2.49,2.01,Zebzitabin,0
SJAIS284,1,43,20181100270416,2018-06-21,2.63,0.4,Zebzitabin,0,9/17/2018,1.51,0.57,Bazopamab,0,12/23/2018,1.9,1.13,Zebzitabin,0,6/14/2019,2.38,1.36,Zebzitabin,0,12/21/2019,2.78,1.84,Zebzitabin-Mono,0,,,,,
DRYFY152,1,50,20181100271639,2018-06-21,4.5,1.29,Bazopamab,0,9/17/2018,3.84,1.19,Bazopamab,0,12/18/2018,2.99,1.41,Bazopamab,0,6/6/2019,2.85,1.73,Zebzitabin,0,12/15/2019,2.48,1.42,Zebzitabin,0,6/20/2020,2.98,1.64,Zebzitabin,0
SEZLS122,0,59,20181100273069,2018-06-21,2.75,0.9,Zebzitabin 600 mg/m,0,,,,,,,,,,,,,,,,,,,,,,,,,
CXGPT166,1,64,20181100273164,2018-06-22,4.45,1.17,Bazopamab,0,9/12/2018,3.97,1.66,Bazopamab,0,12/13/2018,4.25,2.03,Zebzitabin,0,7/8/2019,3.97,2.04,Bazopamab,0,1/5/2020,3.97,1.44,Bazopamab,0,6/14/2020,3.9,1.92,Bazopamab,0
IBMQP576,1,38,20181100274932,2018-06-22,5.88,1.47,Zebzitabin-Mono,0,,,,,,,,,,,,,,,,,,,,,,,,,
UFFNM233,0,62,20181100273071,2018-06-23,4.05,1.24,Bazopamab,0,9/13/2018,3.33,1.03,Bazopamab,0,1/11/2019,2.99,1.18,Zebzitabin,0,7/10/2019,2.7,1.48,Bazopamab,0,12/23/2019,2.28,1.7,Bazopamab,0,6/28/2020,2.03,1.97,Zebzitabin,0
JFOWJ163,1,56,20181100274558,2018-06-23,4.02,1.13,Zebzitabin,0,9/22/2018,3.63,1.41,Zebzitabin,0,,,,,,,,,,,,,,,,,,,,
SBFLZ707,1,56,20181100270250,2018-06-23,6.79,1.97,Bazopamab,0,9/23/2018,5.9,2.29,Zebzitabin,0,12/21/2018,4.05,1.79,Zebzitabin,0,6/22/2019,4.38,1.21,Zebzitabin,0,1/6/2020,3.5,1.98,Bazopamab,0,6/29/2020,2.16,1.45,Bazopamab,0
ZJRVH969,0,66,20181100273321,2018-06-24,5.02,0.85,Zebzitabin,0,,,,,,,,,,,,,,,,,,,,,,,,,
WFPAO827,1,50,20181100270898,2018-06-24,3.92,1.1,Bazopamab,0,9/15/2018,3.39,0.7,Bazopamab,0,12/26/2018,1.44,1,Zebzitabin,0,7/13/2019,2.28,1.66,Bazopamab,0,1/12/2020,1.63,1.53,Zebzitabin,0,6/19/2020,2.69,1.16,Bazopamab 800mg/täglich,0
VQGIZ213,1,40,20181100271518,2018-06-25,6.67,1.44,Zebzitabin,0,,,,,,,,,,,,,,,,,,,,,,,,,
IIUHV286,0,36,20181100270543,2018-06-25,4.97,1.35,Bazopamab,0,9/13/2018,3.36,1.24,Zebzitabin,0,12/29/2018,3.46,1.19,Bazopamab,0,6/22/2019,2.18,1.03,Bazopamab,0,12/21/2019,2.31,1.51,Bazopamab,0,6/15/2020,1.52,2.32,Zebzitabin-Mono,0
VMLAI775,1,63,20181100274055,2018-06-25,3.64,1.09,Bazopamab,0,9/29/2018,2.77,0.67,Bazopamab,0,12/27/2018,2.3,0.91,Bazopamab,0,7/6/2019,2,1.4,Bazopamab,0,1/11/2020,1.68,1.6,Bazopamab,0,6/22/2020,1.83,1.93,Bazopamab,0
JQKFZ797,1,61,20181100273985,2018-06-26,4.98,1.4,Bazopamab,0,10/6/2018,3.93,1.29,Zebzitabin,0,12/17/2018,2.95,1.28,Bazopamab,0,7/11/2019,2.71,1.34,Bazopamab,0,1/3/2020,2.36,1.58,Bazopamab,0,6/27/2020,2.18,1.73,Bazopamab,0
QJIPV112,1,50,20181100274038,2018-06-26,7.3,2.22,Zebzitabin,0,9/18/2018,6.42,2.75,Zebzitabin,0,1/2/2019,5.79,2.22,Zebzitabin,0,7/17/2019,4.85,1.44,Zebzitabin,0,,,,,,,,,,
MSJGV731,0,69,20181100273337,2018-06-27,5.37,1.38,Zebzitabin,0,9/27/2018,4.55,1.69,Bazopamab,0,12/9/2018,3.03,1.67,Bazopamab,0,7/16/2019,3.73,1.49,Bazopamab,0,12/6/2019,3.28,1.75,Zebzitabin,0,6/30/2020,2.86,1.35,Bazopamab,0
RTOXZ628,1,53,20181100272226,2018-06-27,4.6,1.01,Zebzitabin,1,9/27/2018,3.61,1.44,Bazopamab,1,12/26/2018,2.75,1.63,Zebzitabin,1,,,,,,,,,,,,,,,
MWPPG771,0,55,20181100272246,2018-06-27,5.73,2.19,Bazopamab,0,9/24/2018,6.28,2.5,Zebzitabin,0,1/4/2019,6.07,2.19,Zebzitabin,0,6/26/2019,5.79,2.06,Bazopamab,0,1/2/2020,4.27,2.14,Bazopamab,0,7/7/2020,2.89,2.03,Zebzitabin,0
SFWAV030,0,50,20181100270224,2018-06-28,4.6,1.68,Bazopamab,0,10/14/2018,4.17,1.3,Bazopamab,0,1/3/2019,4.03,1.26,Zebzitabin,0,6/24/2019,3.01,1.6,Bazopamab,0,12/16/2019,2.2,1.66,Zebzitabin-Mono,0,6/30/2020,1.92,2.19,Bazopamab,0
AOYAB663,1,40,20181100272165,2018-06-28,6.49,1.69,Zebzitabin,1,,,,,,,,,,,,,,,,,,,,,,,,,
WINSU972,0,46,20181100273549,2018-06-29,5.74,2,Zebzitabin,0,10/2/2018,5,1.49,Bazopamab 800mg/täglich,0,1/10/2019,3.86,1.22,Zebzitabin,0,7/13/2019,2.71,1.44,Zebzitabin,0,12/8/2019,1.79,1.44,Bazopamab,0,7/3/2020,1.96,1.87,Zebzitabin-Mono,0
PAKYL713,1,79,20181100272674,2018-06-29,7.13,1.87,Bazopamab,0,9/1/2018,5.64,2.02,Zebzitabin,0,1/9/2019,3.43,1.72,Bazopamab,0,6/25/2019,3.08,1.29,Bazopamab,0,12/20/2019,2.8,1.2,Zebzitabin,0,6/27/2020,3.03,1.23,Zebzitabin,0
LYHFW346,0,50,20181100270078,2018-06-29,6.69,1.6,Bazopamab,0,9/15/2018,5.44,2.19,Zebzitabin,0,12/26/2018,4.06,2.21,Zebzitabin,0,7/2/2019,3.72,1.76,Zebzitabin,0,12/27/2019,3.85,1.02,Bazopamab,0,7/5/2020,4.35,1.31,Zebzitabin,0
SOMQW142,1,71,20181100274700,2018-06-30,5.05,0.98,Bazopamab,0,9/27/2018,3.22,1.15,Zebzitabin,0,1/3/2019,2.28,1.42,Bazopamab,0,6/13/2019,1.95,1.29,Bazopamab,0,12/27/2019,2.56,1.08,Zebzitabin,0,7/1/2020,3.07,1.57,Zebzitabin,0
RFNCR902,0,50,20181100273648,2018-06-30,4.42,1.04,Zebzitabin,0,9/23/2018,3.79,1.52,Zebzitabin,0,1/5/2019,3.08,1.77,Bazopamab,0,7/7/2019,3.91,1.69,Zebzitabin,0,12/27/2019,3.71,1.81,Zebzitabin-Mono,0,6/11/2020,3.19,1.54,Zebzitabin,0
CIYOI719,1,44,20181100270364,2018-07-01,5.6,1.5,Zebzitabin,0,10/6/2018,4.77,1.7,Bazopamab,0,12/27/2018,3.27,1.71,Zebzitabin 600 mg/m,0,,,,,,,,,,,,,,,
WJGLW847,1,67,20181100272809,2018-07-01,3.71,0.71,Zebzitabin,0,,,,,,,,,,,,,,,,,,,,,,,,,
FLWDO143,1,65,20181100271031,2018-07-01,3.54,0.96,Zebzitabin,0,10/5/2018,2.99,0.85,Zebzitabin,0,1/7/2019,2.33,1.23,Zebzitabin,0,6/11/2019,2.72,1.7,Bazopamab,0,,,,,,,,,,
IGTQL024,0,69,20181100270109,2018-07-02,4.44,1.43,Zebzitabin,1,10/21/2018,4.11,1.33,Bazopamab,1,,,,,,,,,,,,,,,,,,,,
EAIBB262,1,53,20181100270254,2018-07-02,6.6,1.5,Bazopamab,0,9/12/2018,4.78,2.03,Zebzitabin,0,1/11/2019,3.87,1.94,Bazopamab,0,6/8/2019,3.17,1.28,Bazopamab mono,0,1/2/2020,3.59,1.17,Zebzitabin,0,7/16/2020,3.27,1.66,Bazopamab,0
QLJEX713,0,67,20181100274521,2018-07-03,4.82,1.52,Bazopamab,0,10/3/2018,4.92,1.98,Bazopamab,0,1/13/2019,4.6,2.07,Bazopamab,0,7/20/2019,4.94,2.05,Zebzitabin,0,12/17/2019,4.14,1.89,Bazopamab,0,7/3/2020,3.46,1.75,Zebzitabin,0
HIDJI558,1,50,20181100271266,2018-07-03,5.39,1.73,Zebzitabin,0,9/29/2018,4.84,1.77,Zebzitabin mono,0,12/22/2018,4.01,1.54,Bazopamab,0,7/20/2019,3.89,1.42,Bazopamab,0,,,,,,,,,,
OSJUP504,1,55,20181100274233,2018-07-03,4.35,0.86,Zebzitabin,0,,,,,,,,,,,,,,,,,,,,,,,,,
SQQZD463,1,72,20181100270700,2018-07-04,4.99,1.63,Bazopamab,0,10/19/2018,4.62,1.3,Bazopamab,0,12/29/2018,2.69,1.21,Bazopamab,0,7/5/2019,3.15,1.56,Zebzitabin,0,1/2/2020,2.05,1.77,Bazopamab mono,0,7/5/2020,2.24,1.34,Zebzitabin,0
BMPLJ598,1,53,20181100274550,2018-07-04,8.13,3.1,Zebzitabin,0,,,,,,,,,,,,,,,,,,,,,,,,,
ZGGWM535,0,69,20181100270207,2018-07-05,8.26,1.88,Bazopamab,0,10/12/2018,5.52,1.92,Zebzitabin,0,12/27/2018,2.85,1.57,Bazopamab,0,7/24/2019,1.52,0.89,Bazopamab,0,12/29/2019,2.06,0.49,Zebzitabin,0,7/1/2020,3.17,1.13,Zebzitabin,0
HVWVA037,0,63,20181100272908,2018-07-05,4.8,1.37,Zebzitabin,0,9/26/2018,3.89,1.4,Bazopamab,0,1/11/2019,3.34,1.39,Bazopamab,0,7/5/2019,3.14,1.36,Zebzitabin,0,,,,,,,,,,
OJZRQ304,1,60,20181100274762,2018-07-05,5.33,1.17,Zebzitabin,0,9/30/2018,3.35,1.28,Zebzitabin,0,1/13/2019,2.74,1.29,Zebzitabin,0,,,,,,,,,,,,,,,
VTSNQ451,1,36,20181100273659,2018-07-06,1.97,0.11,Bazopamab,0,9/29/2018,1.37,0.5,Bazopamab,0,12/29/2018,0.94,1.6,Zebzitabin,0,7/3/2019,2.97,2.09,Zebzitabin,0,12/26/2019,3.6,1.55,Bazopamab,0,6/19/2020,4.42,1.2,Zebzitabin,0
CGQCC857,1,44,20181100274574,2018-07-06,5.04,1.73,Zebzitabin,0,,,,,,,,,,,,,,,,,,,,,,,,,
OAOQF390,1,56,20181100271456,2018-07-07,5.4,1.56,Zebzitabin,0,10/20/2018,4.43,1.66,Zebzitabin,0,,,,,,,,,,,,,,,,,,,,
UVSNX347,1,48,20181100270777,2018-07-07,7.2,2.23,Bazopamab,0,9/16/2018,6.62,2.61,Zebzitabin,0,12/25/2018,5.51,2.26,Bazopamab,0,7/26/2019,4.63,1.82,Bazopamab,0,1/6/2020,3.9,1.37,Bazopamab,0,7/13/2020,3.62,1.65,Zebzitabin,0
LVPOL051,0,68,20181100270889,2018-07-07,5.12,0.83,Bazopamab,0,10/7/2018,2.89,1.3,Zebzitabin-Mono,0,12/23/2018,2.72,1.59,Bazopamab,0,7/30/2019,2.03,1.15,Zebzitabin,0,1/8/2020,3.14,1.07,Zebzitabin,0,7/13/2020,3.05,1.88,Bazopamab,0
QFSIU402,0,52,20181100273152,2018-07-08,5.55,1.6,Bazopamab,0,10/16/2018,4.36,1.4,Zebzitabin,0,1/3/2019,3.03,1.25,Bazopamab,0,6/29/2019,2.6,1.23,Bazopamab,0,1/15/2020,2.15,1.52,Zebzitabin,0,7/28/2020,2.03,1.67,Bazopamab,0
XTZVP766,0,48,20181100270225,2018-07-08,6.37,1.64,Bazopamab,0,9/26/2018,5.57,2.19,Bazopamab,0,1/2/2019,4.01,2.16,Zebzitabin,0,7/3/2019,4.21,1.81,Zebzitabin,0,1/15/2020,3.91,1.34,Bazopamab,0,6/26/2020,4.07,1.24,Zebzitabin,0
MZAWI193,1,32,20181100274510,2018-07-09,5.11,1.15,Bazopamab,0,10/17/2018,3.77,1.39,Zebzitabin,0,1/1/2019,2.72,1.54,Zebzitabin,0,7/9/2019,2.8,1.4,Bazopamab,0,1/2/2020,2.94,1.4,Bazopamab,0,7/2/2020,2.96,1.53,Zebzitabin,0
YRMSU993,1,46,20181100271272,2018-07-09,5.07,1.72,Bazopamab,0,9/28/2018,5,1.91,Bazopamab,0,1/23/2019,4.86,1.89,Zebzitabin,0,7/13/2019,4.42,1.93,Zebzitabin,0,1/5/2020,3.61,1.75,Zebzitabin,0,7/1/2020,3.03,1.98,Zebzitabin,0
EALHK697,1,55,20181100270876,2018-07-09,3.52,0.77,Bazopamab,0,10/11/2018,2.51,0.91,Zebzitabin,0,12/27/2018,2.46,1.29,Bazopamab,0,7/14/2019,2.68,1.46,Zebzitabin,0,12/30/2019,2.81,1.7,Bazopamab,0,6/25/2020,2.43,1.91,Zebzitabin,0
PTYWJ740,1,44,20181100273876,2018-07-10,4.08,1.01,Bazopamab,0,10/20/2018,3.35,0.97,Zebzitabin,0,1/4/2019,2.28,1.38,Zebzitabin,0,7/17/2019,2.57,1.81,Bazopamab,0,1/17/2020,2.43,1.3,Zebzitabin,0,7/20/2020,3.41,1.41,Zebzitabin,0
MUORI647,1,49,20181100273207,2018-07-10,3.57,1.08,Zebzitabin,0,10/1/2018,3.57,1.25,Zebzitabin mono,0,,,,,,,,,,,,,,,,,,,,
QHNIZ569,1,55,20181100270697,2018-07-11,5.85,2.12,Bazopamab mono,0,10/19/2018,5.57,1.81,Bazopamab,0,,,,,,,,,,,,,,,,,,,,
VAJQT030,1,55,20181100274726,2018-07-11,5.73,1.3,Zebzitabin,0,10/14/2018,4.68,1.76,Zebzitabin,0,1/27/2019,3.14,1.97,Bazopamab mono,0,,,,,,,,,,,,,,,
OXHKH580,1,48,20181100272276,2018-07-11,6.4,2.07,Zebzitabin,0,,,,,,,,,,,,,,,,,,,,,,,,,
WPUTX252,1,50,20181100274429,2018-07-12,5.34,1.67,Bazopamab,0,10/6/2018,5.29,2.27,Bazopamab,0,1/12/2019,5.23,2.23,Zebzitabin,0,7/17/2019,5.25,1.96,Bazopamab,0,1/25/2020,4.52,1.93,Bazopamab,0,7/3/2020,3.35,1.92,Bazopamab,0
MODZV339,1,56,20181100274855,2018-07-12,4.57,1.19,Zebzitabin,0,10/10/2018,3.66,1.36,Bazopamab,0,,,,,,,,,,,,,,,,,,,,
VMZDT452,1,47,20181100273469,2018-07-13,3.15,0.27,Bazopamab,0,10/11/2018,1.54,0.76,Zebzitabin,0,2/3/2019,1.9,1.38,Zebzitabin,0,7/6/2019,2.3,1.32,Zebzitabin,0,1/12/2020,3.24,1.56,Zebzitabin,0,7/19/2020,2.76,1.94,Zebzitabin,0
ERWGJ222,1,64,20181100273505,2018-07-13,5.72,1.87,Zebzitabin,0,10/15/2018,5,1.57,Bazopamab,0,1/15/2019,3.4,1.28,Bazopamab,0,7/11/2019,3.15,1.34,Zebzitabin,0,,,,,,,,,,
CFNGZ728,0,45,20181100272451,2018-07-13,4.92,1.61,Zebzitabin,0,10/12/2018,4.34,1.04,Bazopamab,0,12/31/2018,2.18,0.96,Zebzitabin,0,7/27/2019,2.46,1.45,Bazopamab,0,,,,,,,,,,
LFFIE426,1,65,20181100273552,2018-07-14,5.12,1.26,Bazopamab,0,10/23/2018,4.13,1.58,Bazopamab,0,12/23/2018,3.16,1.68,Bazopamab,0,6/30/2019,3.42,1.52,Zebzitabin,0,1/14/2020,3.28,1.58,Bazopamab,0,7/25/2020,3.01,1.55,Bazopamab,0
YQNLM465,1,39,20181100273983,2018-07-14,5.62,1.7,Zebzitabin,0,10/23/2018,4.93,1.82,Bazopamab,0,,,,,,,,,,,,,,,,,,,,
FWXVE440,1,78,20181100274890,2018-07-15,4.14,1.37,Bazopamab,0,10/18/2018,4.22,1.52,Zebzitabin,0,1/29/2019,3.89,1.7,Zebzitabin,0,7/17/2019,4.21,1.97,Bazopamab,0,1/8/2020,3.4,1.89,Zebzitabin,0,7/24/2020,3,1.8,Bazopamab,0
LNGSL099,1,47,20181100273419,2018-07-15,4.23,1.59,Zebzitabin 600 mg/m,1,10/29/2018,4.22,1.26,Zebzitabin,1,,,,,,,,,,,,,,,,,,,,
FHTFR680,0,47,20181100272381,2018-07-15,3.19,0.7,Bazopamab,0,10/25/2018,2.47,0.85,Zebzitabin,0,1/24/2019,2.39,1.36,Bazopamab,0,7/31/2019,2.84,1.69,Zebzitabin,0,1/6/2020,2.9,1.66,Bazopamab,0,7/23/2020,2.87,1.8,Zebzitabin,0
VRJTJ034,1,79,20181100274482,2018-07-16,6.05,1.63,Bazopamab,0,10/1/2018,5.02,2.06,Zebzitabin,0,1/10/2019,4.37,1.96,Zebzitabin,0,6/29/2019,3.88,1.54,Bazopamab,0,1/8/2020,3.7,1.49,Zebzitabin,0,7/8/2020,3.13,1.78,Bazopamab,0
GPMUE556,1,44,20181100271702,2018-07-16,4.2,1.5,Bazopamab,0,10/28/2018,3.93,0.98,Zebzitabin,0,1/26/2019,2.76,1.04,Bazopamab,0,7/24/2019,2.73,1.65,Zebzitabin,0,1/16/2020,1.72,1.7,Zebzitabin,0,7/11/2020,2.08,1.66,Zebzitabin mono,0
WANOB060,1,62,20181100273233,2018-07-17,4.94,0.66,Bazopamab,0,9/28/2018,2.97,1.46,Zebzitabin,0,1/11/2019,2.36,1.75,Zebzitabin,0,7/23/2019,2.92,1.14,Bazopamab,0,1/30/2020,3.83,1.5,Bazopamab,0,8/5/2020,3.09,1.57,Bazopamab,0
HZCDQ796,0,55,20181100272263,2018-07-17,5.3,1.63,Zebzitabin,0,10/2/2018,4.72,1.6,Zebzitabin,0,,,,,,,,,,,,,,,,,,,,
PYXRX558,1,64,20181100274468,2018-07-17,4.16,1.41,Bazopamab,0,10/16/2018,3.68,0.82,Zebzitabin,0,1/13/2019,2.31,0.93,Zebzitabin,0,7/8/2019,2.28,1.58,Zebzitabin,0,1/14/2020,1.43,1.57,Bazopamab,0,7/15/2020,2.1,1.58,Zebzitabin,0
UICDU489,0,54,20181100271072,2018-07-18,4.28,1.52,Bazopamab,0,10/20/2018,4.13,1.22,Zebzitabin,0,12/30/2018,3.12,1.19,Zebzitabin,0,7/15/2019,3.42,1.57,Bazopamab,0,1/20/2020,2.3,2.01,Bazopamab,0,7/12/2020,1.84,1.74,Bazopamab,0
PQOYW814,1,61,20181100272926,2018-07-18,4.26,1.13,Zebzitabin 600 mg/m,0,10/26/2018,3.81,1.31,Bazopamab,0,,,,,,,,,,,,,,,,,,,,
TNSBY701,1,53,20181100271237,2018-07-19,5.43,2.02,Bazopamab,0,10/19/2018,4.85,1.51,Bazopamab,0,1/22/2019,4.03,1.1,Bazopamab,0,7/20/2019,3.1,1.23,Zebzitabin,0,1/10/2020,1.9,1.91,Zebzitabin,0,7/19/2020,1.01,2.11,Zebzitabin,0
AOMWJ438,1,47,20181100272445,2018-07-19,3.39,1.14,Zebzitabin,0,10/11/2018,3.02,0.56,Bazopamab,0,,,,,,,,,,,,,,,,,,,,
CXXWY233,1,58,20181100274537,2018-07-20,4.07,0.92,Bazopamab,0,10/9/2018,3.69,1.52,Zebzitabin,0,1/15/2019,3.42,2.01,Bazopamab,0,7/25/2019,4.07,2.1,Bazopamab,0,1/15/2020,4.06,1.54,Bazopamab,0,6/27/2020,4.18,1.56,Bazopamab,0
