<?xml version="1.0" encoding="UTF-8" standalone="no"?>
<svg
   xmlns:dc="http://purl.org/dc/elements/1.1/"
   xmlns:cc="http://creativecommons.org/ns#"
   xmlns:rdf="http://www.w3.org/1999/02/22-rdf-syntax-ns#"
   xmlns:svg="http://www.w3.org/2000/svg"
   xmlns="http://www.w3.org/2000/svg"
   xmlns:sodipodi="http://sodipodi.sourceforge.net/DTD/sodipodi-0.dtd"
   xmlns:inkscape="http://www.inkscape.org/namespaces/inkscape"
   version="1.1"
   id="svg2"
   xml:space="preserve"
   width="258.88"
   height="128.26666"
   viewBox="0 0 258.88 128.26666"
   sodipodi:docname="ship.svg"
   inkscape:version="1.0.2 (e86c870879, 2021-01-15)"><metadata
     id="metadata8"><rdf:RDF><cc:Work
         rdf:about=""><dc:format>image/svg+xml</dc:format><dc:type
           rdf:resource="http://purl.org/dc/dcmitype/StillImage" /><dc:title></dc:title></cc:Work></rdf:RDF></metadata><defs
     id="defs6" /><sodipodi:namedview
     pagecolor="#ffffff"
     bordercolor="#666666"
     borderopacity="1"
     objecttolerance="10"
     gridtolerance="10"
     guidetolerance="10"
     inkscape:pageopacity="0"
     inkscape:pageshadow="2"
     inkscape:window-width="1920"
     inkscape:window-height="1016"
     id="namedview4"
     showgrid="false"
     inkscape:zoom="4.8323547"
     inkscape:cx="82.671912"
     inkscape:cy="64.133331"
     inkscape:window-x="0"
     inkscape:window-y="27"
     inkscape:window-maximized="1"
     inkscape:current-layer="g12" /><g
     id="g10"
     inkscape:groupmode="layer"
     inkscape:label="ink_ext_XXXXXX"
     transform="matrix(1.3333333,0,0,-1.3333333,0,128.26667)"><g
       id="g12"
       transform="scale(0.1)"><path
         d="m 848.086,534.871 c 39.258,18.859 72.5,30.856 72.5,30.856 l 0.012,-111.313 h -72.493 l -0.019,80.457"
         style="fill:#577faf;fill-opacity:1;fill-rule:nonzero;stroke:none"
         id="path14" /><path
         d="m 721.68,655.027 -0.02,306.942 C 346.25,825.477 108.789,541.551 0,283.934 l 93.7383,-0.125 C 187.297,492.109 370.527,715.16 649.004,848.484 l 0.344,-162.855 C 540.605,621.266 451.543,540.684 381.582,454.578 l 86.008,-0.117 c 67.801,75.988 152.344,145.852 254.09,200.566"
         style="fill:#577faf;fill-opacity:1;fill-rule:nonzero;stroke:none"
         id="path16" /><path
         d="M 920.781,675.938 C 816.063,644.574 725.598,596.941 649.004,539.93 l -0.078,-75.489 c 74.101,63.301 164.543,117.196 271.726,152.489 l 0.129,59.008"
         style="fill:#577faf;fill-opacity:1;fill-rule:nonzero;stroke:none"
         id="path18" /><path
         d="m 383.496,193.496 c -30.891,0 -57.812,12.297 -71.808,31.856 l 26.664,22.566 c 12.937,-14.297 29.57,-20.059 47.253,-20.059 21.915,0 32.208,5.762 32.208,19.063 0,11.281 -6.329,16.301 -41.18,23.82 -34.055,7.528 -57.817,17.813 -57.817,52.422 0,31.856 29.575,51.414 65.997,51.414 28.781,0 49.906,-10.281 67.328,-27.586 L 425.469,322.41 c -11.875,11.535 -25.078,18.059 -41.973,18.059 -19.797,0 -26.394,-8.028 -26.394,-15.801 0,-11.035 7.918,-14.551 37.214,-21.066 29.305,-6.524 61.778,-16.055 61.778,-54.18 0,-33.348 -22.176,-55.926 -72.598,-55.926"
         style="fill:#0d4d84;fill-opacity:1;fill-rule:nonzero;stroke:none"
         id="path20" /><path
         d="m 608.684,196.258 v 73.73 h -75.762 v -73.73 h -36.965 v 175.558 h 36.965 v -67.218 h 75.762 v 67.218 h 36.961 V 196.258 h -36.961"
         style="fill:#0d4d84;fill-opacity:1;fill-rule:nonzero;stroke:none"
         id="path22" /><path
         d="m 696.594,196.258 v 175.558 h 36.961 V 196.258 h -36.961"
         style="fill:#0d4d84;fill-opacity:1;fill-rule:nonzero;stroke:none"
         id="path24" /><path
         d="m 862.129,258.457 h -40.652 v -62.199 h -36.965 v 175.558 h 80.781 c 34.852,0 63.625,-18.312 63.625,-55.675 0,-40.633 -28.508,-57.684 -66.789,-57.684 z m 1.848,79.246 h -42.5 v -45.137 h 43.027 c 17.156,0 26.402,7.52 26.402,22.825 0,15.293 -10.562,22.312 -26.929,22.312"
         style="fill:#0d4d84;fill-opacity:1;fill-rule:nonzero;stroke:none"
         id="path26" /><path
         d="m 383.496,193.496 c -30.891,0 -57.812,12.297 -71.808,31.856 l 26.664,22.566 c 12.937,-14.297 29.57,-20.059 47.253,-20.059 21.915,0 32.208,5.762 32.208,19.063 0,11.281 -6.329,16.301 -41.18,23.82 -34.055,7.528 -57.817,17.813 -57.817,52.422 0,31.856 29.575,51.414 65.997,51.414 28.781,0 49.906,-10.281 67.328,-27.586 L 425.469,322.41 c -11.875,11.535 -25.078,18.059 -41.973,18.059 -19.797,0 -26.394,-8.028 -26.394,-15.801 0,-11.035 7.918,-14.551 37.214,-21.066 29.305,-6.524 61.778,-16.055 61.778,-54.18 0,-33.348 -22.176,-55.926 -72.598,-55.926"
         style="fill:#0d4d84;fill-opacity:1;fill-rule:nonzero;stroke:none"
         id="path28" /><path
         d="m 608.684,196.258 v 73.73 h -75.762 v -73.73 h -36.965 v 175.558 h 36.965 v -67.218 h 75.762 v 67.218 h 36.961 V 196.258 h -36.961"
         style="fill:#0d4d84;fill-opacity:1;fill-rule:nonzero;stroke:none"
         id="path30" /><path
         d="m 696.594,196.258 v 175.558 h 36.961 V 196.258 h -36.961"
         style="fill:#0d4d84;fill-opacity:1;fill-rule:nonzero;stroke:none"
         id="path32" /><path
         d="m 862.129,258.457 h -40.652 v -62.199 h -36.965 v 175.558 h 80.781 c 34.852,0 63.625,-18.312 63.625,-55.675 0,-40.633 -28.508,-57.684 -66.789,-57.684 z m 1.848,79.246 h -42.5 v -45.137 h 43.027 c 17.156,0 26.402,7.52 26.402,22.825 0,15.293 -10.562,22.312 -26.929,22.312"
         style="fill:#0d4d84;fill-opacity:1;fill-rule:nonzero;stroke:none"
         id="path34" /><path
         d="m 347.906,20.2539 c -12.246,0 -22.804,5.125 -29.883,13.1524 l 9.004,8.496 c 5.633,-5.9375 13.914,-9.6562 21.836,-9.6562 11.758,0 17.403,3.9531 17.403,11.875 0,6.2773 -4.922,9.4219 -18.965,13.4961 -17.754,5.125 -26.281,9.4336 -26.281,23.9844 0,14.082 12.246,22.6954 27.726,22.6954 11.395,0 20.039,-4.074 27.481,-11.0548 l -8.887,-8.7305 c -5.274,5.2344 -11.281,7.793 -19.563,7.793 -9.832,0 -14.031,-4.6484 -14.031,-10.1289 0,-5.7031 3.836,-8.4961 18.359,-12.6836 16.563,-4.8945 26.875,-10.0117 26.875,-24.5625 0,-14.668 -9.601,-24.6758 -31.074,-24.6758"
         style="fill:#0d4d84;fill-opacity:1;fill-rule:nonzero;stroke:none"
         id="path36" /><path
         d="m 424.938,23.0469 c -3,-1.6328 -7.2,-2.793 -12.122,-2.793 -8.757,0 -14.16,5.2422 -14.16,16.1797 v 35.2773 h -8.992 v 10.9336 h 8.992 v 17.4605 l 12.121,6.29 V 82.6445 h 15.606 V 71.7109 H 410.777 V 38.5352 c 0,-5.7149 1.922,-7.336 6.485,-7.336 3.242,0 6.836,1.1641 9.121,2.4414 l -1.445,-10.5937"
         style="fill:#0d4d84;fill-opacity:1;fill-rule:nonzero;stroke:none"
         id="path38" /><path
         d="m 480.629,21.5313 v 5.8203 c -3.125,-4.4219 -9.363,-7.0977 -15.84,-7.0977 -14.648,0 -22.441,9.3164 -22.441,27.3516 v 35.039 h 12.355 V 48.0742 c 0,-12.3437 4.805,-16.7656 12.969,-16.7656 8.269,0 12.957,5.7109 12.957,15.6055 v 35.7304 h 12.355 V 21.5313 h -12.355"
         style="fill:#0d4d84;fill-opacity:1;fill-rule:nonzero;stroke:none"
         id="path40" /><path
         d="m 549.742,21.5313 v 5.8203 c -4.562,-4.0703 -9.844,-7.0977 -16.445,-7.0977 -13.555,0 -24.238,9.5508 -24.238,32.8203 0,20.9571 11.757,30.8516 24.843,30.8516 6.356,0 12.364,-3.2617 15.84,-6.9844 v 23.2816 l 12.235,6.172 V 21.5313 Z m 0.117,43.3046 c -2.754,3.6094 -8.515,8.0352 -14.757,8.0352 -8.887,0 -13.68,-6.5234 -13.68,-19.4453 0,-15.3594 5.039,-22.1172 14.16,-22.1172 5.879,0 11.035,3.8477 14.277,7.8008 v 25.7265"
         style="fill:#0d4d84;fill-opacity:1;fill-rule:nonzero;stroke:none"
         id="path42" /><path
         d="m 602.789,0 h -13.086 l 9.121,22.6953 -23.164,59.9492 h 13.563 l 10.324,-29.9101 c 1.914,-5.3633 4.793,-14.4336 5.516,-17.8125 1.085,3.6133 3.722,12.332 5.644,17.5781 l 10.676,30.1445 h 13.086 L 602.789,0"
         style="fill:#0d4d84;fill-opacity:1;fill-rule:nonzero;stroke:none"
         id="path44" /><path
         d="m 705.855,20.2539 c -15.839,0 -27.714,12.6836 -27.714,31.7774 0,20.0195 12.234,31.8945 28.074,31.8945 16.086,0 28.086,-12.4531 28.086,-31.543 0,-20.2539 -12.246,-32.1289 -28.446,-32.1289 z m -0.117,52.2656 c -9.367,0 -15.117,-8.0273 -15.117,-20.1367 0,-13.3906 6.356,-20.7226 15.711,-20.7226 9.367,0 15.488,9.1992 15.488,20.3711 0,12.4609 -6.121,20.4882 -16.082,20.4882"
         style="fill:#0d4d84;fill-opacity:1;fill-rule:nonzero;stroke:none"
         id="path46" /><path
         d="m 770.648,95.5664 c -4.07,0 -5.75,-1.5156 -5.75,-5.9375 v -6.9844 h 11.641 V 71.4727 H 764.898 V 21.5313 h -12.363 v 49.9414 h -8.164 v 11.1718 h 8.164 v 8.0274 c 0,11.1831 7.078,15.3711 15.957,15.3711 3.242,0 6.719,-0.469 9.363,-1.16 V 94.4023 c -2.878,0.8125 -5.039,1.1641 -7.207,1.1641"
         style="fill:#0d4d84;fill-opacity:1;fill-rule:nonzero;stroke:none"
         id="path48" /><path
         d="M 878.414,21.5313 V 57.8516 H 839.77 V 21.5313 H 827.172 V 103.016 H 839.77 V 70.0781 h 38.644 v 32.9379 h 12.598 V 21.5313 h -12.598"
         style="fill:#0d4d84;fill-opacity:1;fill-rule:nonzero;stroke:none"
         id="path50" /><path
         d="m 962.418,47.8398 h -41.641 c 1.317,-11.7539 8.153,-16.7539 15.84,-16.7539 5.274,0 9.481,1.8516 13.68,4.8789 l 7.316,-7.6757 c -5.519,-5.125 -12.121,-8.0352 -21.718,-8.0352 -14.758,0 -27.239,11.5234 -27.239,31.7774 0,20.7226 11.282,31.8945 27.598,31.8945 17.883,0 26.523,-14.082 26.523,-30.6172 0,-2.207 -0.242,-4.1875 -0.359,-5.4688 z m -27.004,25.2657 c -8.281,0 -13.32,-5.5977 -14.402,-15.3711 h 29.285 c -0.606,8.3789 -4.688,15.3711 -14.883,15.3711"
         style="fill:#0d4d84;fill-opacity:1;fill-rule:nonzero;stroke:none"
         id="path52" /><path
         d="m 1014.02,21.5313 v 6.0546 c -4.32,-4.1875 -10.43,-7.332 -17.282,-7.332 -10.195,0 -21.84,5.5859 -21.84,20.6055 0,13.6133 10.805,19.7851 25.082,19.7851 5.88,0 10.56,-0.8086 14.04,-2.3242 v 4.5391 c 0,6.6328 -4.2,10.3515 -11.88,10.3515 -6.476,0 -11.527,-1.1601 -16.437,-3.8359 l -4.808,9.082 c 6,3.6016 12.726,5.4688 21.605,5.4688 14.04,0 23.64,-6.6328 23.64,-20.4883 V 21.5313 Z m 0,26.0742 c -3.36,1.6328 -7.68,2.6758 -14.403,2.6758 -7.918,0 -12.957,-3.4844 -12.957,-9.0704 0,-6.0546 3.953,-10.125 12.117,-10.125 6.603,0 12.363,3.9532 15.243,7.7891 v 8.7305"
         style="fill:#0d4d84;fill-opacity:1;fill-rule:nonzero;stroke:none"
         id="path54" /><path
         d="m 1045.1,21.5313 v 78.5737 l 12.36,6.29 V 21.5313 h -12.36"
         style="fill:#0d4d84;fill-opacity:1;fill-rule:nonzero;stroke:none"
         id="path56" /><path
         d="m 1107.01,23.0469 c -2.99,-1.6328 -7.2,-2.793 -12.12,-2.793 -8.76,0 -14.16,5.2422 -14.16,16.1797 v 35.2773 h -8.99 v 10.9336 h 8.99 v 17.4605 l 12.12,6.29 V 82.6445 h 15.61 V 71.7109 h -15.61 V 38.5352 c 0,-5.7149 1.92,-7.336 6.49,-7.336 3.24,0 6.83,1.1641 9.12,2.4414 l -1.45,-10.5937"
         style="fill:#0d4d84;fill-opacity:1;fill-rule:nonzero;stroke:none"
         id="path58" /><path
         d="m 1164.14,21.5313 v 34.5703 c 0,12.3437 -4.8,16.7695 -12.96,16.7695 -8.28,0 -12.96,-5.7031 -12.96,-15.5977 V 21.5313 h -12.36 v 78.5737 l 12.36,6.29 V 76.8242 c 3.12,4.4258 9.36,7.1016 15.84,7.1016 14.64,0 22.43,-9.3086 22.43,-27.3555 v -35.039 h -12.35"
         style="fill:#0d4d84;fill-opacity:1;fill-rule:nonzero;stroke:none"
         id="path60" /><path
         d="m 1234.7,90.5547 c -4.43,0 -8.04,3.4961 -8.04,7.6875 0,4.3048 3.61,7.8008 8.04,7.8008 4.32,0 7.92,-3.496 7.92,-7.8008 0,-4.1914 -3.6,-7.6875 -7.92,-7.6875 z m -6.24,-69.0234 v 61.1132 h 12.36 V 21.5313 h -12.36"
         style="fill:#0d4d84;fill-opacity:1;fill-rule:nonzero;stroke:none"
         id="path62" /><path
         d="m 1298.54,21.5313 v 34.5703 c 0,12.3437 -4.81,16.7695 -12.97,16.7695 -8.27,0 -12.95,-5.7031 -12.95,-15.5977 V 21.5313 h -12.37 v 61.1132 h 12.37 v -5.8203 c 3.11,4.4258 9.35,7.1016 15.84,7.1016 14.64,0 22.43,-9.3086 22.43,-27.3555 v -35.039 h -12.35"
         style="fill:#0d4d84;fill-opacity:1;fill-rule:nonzero;stroke:none"
         id="path64" /><path
         d="m 1398.38,51.9141 h -21.96 V 21.5313 h -12.37 v 81.4847 h 35.17 c 15.48,0 26.99,-8.6137 26.99,-25.4887 0,-16.7656 -11.51,-25.6132 -27.83,-25.6132 z m 0.6,39.5781 h -22.56 V 63.4375 h 22.56 c 9.59,0 14.4,5.3594 14.4,14.0898 0,8.9571 -5.65,13.9649 -14.4,13.9649"
         style="fill:#0d4d84;fill-opacity:1;fill-rule:nonzero;stroke:none"
         id="path66" /><path
         d="m 1463.54,20.2539 c -15.84,0 -27.72,12.6836 -27.72,31.7774 0,20.0195 12.24,31.8945 28.07,31.8945 16.09,0 28.09,-12.4531 28.09,-31.543 0,-20.2539 -12.25,-32.1289 -28.44,-32.1289 z m -0.12,52.2656 c -9.37,0 -15.12,-8.0273 -15.12,-20.1367 0,-13.3906 6.36,-20.7226 15.72,-20.7226 9.36,0 15.48,9.1992 15.48,20.3711 0,12.4609 -6.12,20.4882 -16.08,20.4882"
         style="fill:#0d4d84;fill-opacity:1;fill-rule:nonzero;stroke:none"
         id="path68" /><path
         d="m 1581.02,21.5313 v 34.5703 c 0,12.3437 -3.97,16.7695 -12.13,16.7695 -8.28,0 -12.12,-5.7031 -12.12,-15.5977 V 21.5313 h -12.36 v 34.5703 c 0,12.3437 -3.96,16.7695 -12.11,16.7695 -8.28,0 -12.12,-5.7031 -12.12,-15.5977 V 21.5313 h -12.37 v 61.1132 h 12.37 v -5.8203 c 3.11,4.4258 8.51,7.1016 15,7.1016 8.51,0 13.91,-3.1445 17.27,-8.9649 4.56,5.4688 9.48,8.9649 19.32,8.9649 14.65,0 21.6,-9.3086 21.6,-27.3555 v -35.039 h -12.35"
         style="fill:#0d4d84;fill-opacity:1;fill-rule:nonzero;stroke:none"
         id="path70" /><path
         d="m 1662.5,47.8398 h -41.64 c 1.32,-11.7539 8.16,-16.7539 15.84,-16.7539 5.27,0 9.48,1.8516 13.68,4.8789 l 7.32,-7.6757 c -5.52,-5.125 -12.13,-8.0352 -21.72,-8.0352 -14.76,0 -27.24,11.5234 -27.24,31.7774 0,20.7226 11.28,31.8945 27.6,31.8945 17.88,0 26.52,-14.082 26.52,-30.6172 0,-2.207 -0.24,-4.1875 -0.36,-5.4688 z m -27,25.2657 c -8.28,0 -13.32,-5.5977 -14.41,-15.3711 h 29.29 c -0.61,8.3789 -4.69,15.3711 -14.88,15.3711"
         style="fill:#0d4d84;fill-opacity:1;fill-rule:nonzero;stroke:none"
         id="path72" /><path
         d="m 1713.01,69.9609 c -2.64,1.3946 -5.4,2.2071 -9.49,2.2071 -7.8,0 -12.35,-5.3516 -12.35,-15.7149 V 21.5313 h -12.36 v 61.1132 h 12.36 v -5.8203 c 2.87,4.0742 8.15,7.1016 14.4,7.1016 5.04,0 8.16,-0.9297 10.68,-2.5586 l -3.24,-11.4063"
         style="fill:#0d4d84;fill-opacity:1;fill-rule:nonzero;stroke:none"
         id="path74" /><path
         d="m 1761.49,21.5313 v 6.0546 c -4.32,-4.1875 -10.44,-7.332 -17.28,-7.332 -10.19,0 -21.83,5.5859 -21.83,20.6055 0,13.6133 10.8,19.7851 25.07,19.7851 5.88,0 10.56,-0.8086 14.04,-2.3242 v 4.5391 c 0,6.6328 -4.19,10.3515 -11.88,10.3515 -6.47,0 -11.52,-1.1601 -16.43,-3.8359 l -4.81,9.082 c 6.01,3.6016 12.72,5.4688 21.6,5.4688 14.05,0 23.64,-6.6328 23.64,-20.4883 V 21.5313 Z m 0,26.0742 c -3.35,1.6328 -7.68,2.6758 -14.4,2.6758 -7.92,0 -12.96,-3.4844 -12.96,-9.0704 0,-6.0546 3.96,-10.125 12.12,-10.125 6.6,0 12.36,3.9532 15.24,7.7891 v 8.7305"
         style="fill:#0d4d84;fill-opacity:1;fill-rule:nonzero;stroke:none"
         id="path76" /><path
         d="m 1830.25,21.5313 v 34.5703 c 0,12.3437 -4.8,16.7695 -12.95,16.7695 -8.28,0 -12.96,-5.7031 -12.96,-15.5977 V 21.5313 h -12.37 v 61.1132 h 12.37 v -5.8203 c 3.11,4.4258 9.35,7.1016 15.84,7.1016 14.63,0 22.43,-9.3086 22.43,-27.3555 v -35.039 h -12.36"
         style="fill:#0d4d84;fill-opacity:1;fill-rule:nonzero;stroke:none"
         id="path78" /><path
         d="m 1867.8,90.5547 c -4.43,0 -8.03,3.4961 -8.03,7.6875 0,4.3048 3.6,7.8008 8.03,7.8008 4.33,0 7.92,-3.496 7.92,-7.8008 0,-4.1914 -3.59,-7.6875 -7.92,-7.6875 z m -6.24,-69.0234 v 61.1132 h 12.37 V 21.5313 h -12.37"
         style="fill:#0d4d84;fill-opacity:1;fill-rule:nonzero;stroke:none"
         id="path80" /><path
         d="m 1929.49,21.5313 v 6.0546 c -4.32,-4.1875 -10.44,-7.332 -17.28,-7.332 -10.2,0 -21.84,5.5859 -21.84,20.6055 0,13.6133 10.8,19.7851 25.08,19.7851 5.88,0 10.56,-0.8086 14.04,-2.3242 v 4.5391 c 0,6.6328 -4.2,10.3515 -11.88,10.3515 -6.48,0 -11.52,-1.1601 -16.44,-3.8359 l -4.8,9.082 c 5.99,3.6016 12.72,5.4688 21.6,5.4688 14.04,0 23.64,-6.6328 23.64,-20.4883 V 21.5313 Z m 0,26.0742 c -3.36,1.6328 -7.68,2.6758 -14.4,2.6758 -7.92,0 -12.96,-3.4844 -12.96,-9.0704 0,-6.0546 3.96,-10.125 12.12,-10.125 6.6,0 12.36,3.9532 15.24,7.7891 v 8.7305"
         style="fill:#0d4d84;fill-opacity:1;fill-rule:nonzero;stroke:none"
         id="path82" /></g></g></svg>
