(kicad_sch
	(version 20231120)
	(generator "eeschema")
	(generator_version "8.0")
	(uuid "75dddff6-93a4-4c56-972d-f6638a4e6d2d")
	(paper "A4")
	(lib_symbols
		(symbol "Device:R"
			(pin_numbers hide)
			(pin_names
				(offset 0)
			)
			(exclude_from_sim no)
			(in_bom yes)
			(on_board yes)
			(property "Reference" "R"
				(at 2.032 0 90)
				(effects
					(font
						(size 1.27 1.27)
					)
				)
			)
			(property "Value" "R"
				(at 0 0 90)
				(effects
					(font
						(size 1.27 1.27)
					)
				)
			)
			(property "Footprint" ""
				(at -1.778 0 90)
				(effects
					(font
						(size 1.27 1.27)
					)
					(hide yes)
				)
			)
			(property "Datasheet" "~"
				(at 0 0 0)
				(effects
					(font
						(size 1.27 1.27)
					)
					(hide yes)
				)
			)
			(property "Description" "Resistor"
				(at 0 0 0)
				(effects
					(font
						(size 1.27 1.27)
					)
					(hide yes)
				)
			)
			(property "ki_keywords" "R res resistor"
				(at 0 0 0)
				(effects
					(font
						(size 1.27 1.27)
					)
					(hide yes)
				)
			)
			(property "ki_fp_filters" "R_*"
				(at 0 0 0)
				(effects
					(font
						(size 1.27 1.27)
					)
					(hide yes)
				)
			)
			(symbol "R_0_1"
				(rectangle
					(start -1.016 -2.54)
					(end 1.016 2.54)
					(stroke
						(width 0.254)
						(type default)
					)
					(fill
						(type none)
					)
				)
			)
			(symbol "R_1_1"
				(pin passive line
					(at 0 3.81 270)
					(length 1.27)
					(name "~"
						(effects
							(font
								(size 1.27 1.27)
							)
						)
					)
					(number "1"
						(effects
							(font
								(size 1.27 1.27)
							)
						)
					)
				)
				(pin passive line
					(at 0 -3.81 90)
					(length 1.27)
					(name "~"
						(effects
							(font
								(size 1.27 1.27)
							)
						)
					)
					(number "2"
						(effects
							(font
								(size 1.27 1.27)
							)
						)
					)
				)
			)
		)
		(symbol "lsf-kicad:FDN537N"
			(exclude_from_sim no)
			(in_bom yes)
			(on_board yes)
			(property "Reference" "Q"
				(at 3.81 3.81 0)
				(effects
					(font
						(size 1.27 1.27)
					)
					(justify left)
				)
			)
			(property "Value" "FDN537N"
				(at 5.08 1.27 0)
				(effects
					(font
						(size 1.27 1.27)
					)
					(justify left)
				)
			)
			(property "Footprint" "Package_TO_SOT_SMD:SuperSOT-3"
				(at 6.35 -1.27 0)
				(effects
					(font
						(size 1.27 1.27)
						(italic yes)
					)
					(justify left)
					(hide yes)
				)
			)
			(property "Datasheet" "https://www.onsemi.com/pub/Collateral/FDN537N-D.pdf"
				(at -13.208 -34.798 90)
				(effects
					(font
						(size 1.27 1.27)
					)
					(justify left)
					(hide yes)
				)
			)
			(property "Description" "6.5A Id, 30V Vds,  Single N-Channel Power Trench MOSFET , 23mOhm Ron, -55 to 150 °C"
				(at 0 0 0)
				(effects
					(font
						(size 1.27 1.27)
					)
					(hide yes)
				)
			)
			(property "ki_keywords" "Power MOSFET N-MOS"
				(at 0 0 0)
				(effects
					(font
						(size 1.27 1.27)
					)
					(hide yes)
				)
			)
			(property "ki_fp_filters" "*SuperSOT?3*"
				(at 0 0 0)
				(effects
					(font
						(size 1.27 1.27)
					)
					(hide yes)
				)
			)
			(symbol "FDN537N_0_0"
				(polyline
					(pts
						(xy 0.0078 2.6609) (xy 0.0078 -2.4191)
					)
					(stroke
						(width 0)
						(type default)
					)
					(fill
						(type none)
					)
				)
				(polyline
					(pts
						(xy 0.592 -1.4031) (xy 0.592 -2.4191)
					)
					(stroke
						(width 0)
						(type default)
					)
					(fill
						(type none)
					)
				)
				(polyline
					(pts
						(xy 0.592 0.6289) (xy 0.592 -0.3871)
					)
					(stroke
						(width 0)
						(type default)
					)
					(fill
						(type none)
					)
				)
				(polyline
					(pts
						(xy 0.592 2.6609) (xy 0.592 1.6449)
					)
					(stroke
						(width 0)
						(type default)
					)
					(fill
						(type none)
					)
				)
				(polyline
					(pts
						(xy 3.64 0.3749) (xy 3.132 0.3749)
					)
					(stroke
						(width 0)
						(type default)
					)
					(fill
						(type none)
					)
				)
				(polyline
					(pts
						(xy 0.592 -1.9111) (xy 3.386 -1.9111) (xy 3.386 2.1529) (xy 0.592 2.1529)
					)
					(stroke
						(width 0)
						(type default)
					)
					(fill
						(type none)
					)
				)
				(polyline
					(pts
						(xy 0.592 0.1209) (xy 1.3794 -0.3871) (xy 1.3794 0.6289) (xy 0.592 0.1209)
					)
					(stroke
						(width 0.1524)
						(type default)
					)
					(fill
						(type none)
					)
				)
				(polyline
					(pts
						(xy 3.386 0.4511) (xy 2.878 -0.3363) (xy 3.894 -0.3363) (xy 3.386 0.4511)
					)
					(stroke
						(width 0.1524)
						(type default)
					)
					(fill
						(type none)
					)
				)
			)
			(symbol "FDN537N_0_1"
				(polyline
					(pts
						(xy 2.54 2.54) (xy 2.54 2.1844)
					)
					(stroke
						(width 0)
						(type default)
					)
					(fill
						(type none)
					)
				)
				(polyline
					(pts
						(xy 2.54 -2.54) (xy 2.54 0.1524) (xy 1.4224 0.1524)
					)
					(stroke
						(width 0)
						(type default)
					)
					(fill
						(type none)
					)
				)
			)
			(symbol "FDN537N_1_1"
				(pin input line
					(at -2.54 0 0)
					(length 2.54)
					(name ""
						(effects
							(font
								(size 1.27 1.27)
							)
						)
					)
					(number "1"
						(effects
							(font
								(size 1.27 1.27)
							)
						)
					)
				)
				(pin passive line
					(at 2.54 -5.08 90)
					(length 2.54)
					(name ""
						(effects
							(font
								(size 1.27 1.27)
							)
						)
					)
					(number "2"
						(effects
							(font
								(size 1.27 1.27)
							)
						)
					)
				)
				(pin passive line
					(at 2.54 5.08 270)
					(length 2.54)
					(name ""
						(effects
							(font
								(size 1.27 1.27)
							)
						)
					)
					(number "3"
						(effects
							(font
								(size 1.27 1.27)
							)
						)
					)
				)
			)
		)
		(symbol "power:GND"
			(power)
			(pin_numbers hide)
			(pin_names
				(offset 0) hide)
			(exclude_from_sim no)
			(in_bom yes)
			(on_board yes)
			(property "Reference" "#PWR"
				(at 0 -6.35 0)
				(effects
					(font
						(size 1.27 1.27)
					)
					(hide yes)
				)
			)
			(property "Value" "GND"
				(at 0 -3.81 0)
				(effects
					(font
						(size 1.27 1.27)
					)
				)
			)
			(property "Footprint" ""
				(at 0 0 0)
				(effects
					(font
						(size 1.27 1.27)
					)
					(hide yes)
				)
			)
			(property "Datasheet" ""
				(at 0 0 0)
				(effects
					(font
						(size 1.27 1.27)
					)
					(hide yes)
				)
			)
			(property "Description" "Power symbol creates a global label with name \"GND\" , ground"
				(at 0 0 0)
				(effects
					(font
						(size 1.27 1.27)
					)
					(hide yes)
				)
			)
			(property "ki_keywords" "global power"
				(at 0 0 0)
				(effects
					(font
						(size 1.27 1.27)
					)
					(hide yes)
				)
			)
			(symbol "GND_0_1"
				(polyline
					(pts
						(xy 0 0) (xy 0 -1.27) (xy 1.27 -1.27) (xy 0 -2.54) (xy -1.27 -1.27) (xy 0 -1.27)
					)
					(stroke
						(width 0)
						(type default)
					)
					(fill
						(type none)
					)
				)
			)
			(symbol "GND_1_1"
				(pin power_in line
					(at 0 0 270)
					(length 0)
					(name "~"
						(effects
							(font
								(size 1.27 1.27)
							)
						)
					)
					(number "1"
						(effects
							(font
								(size 1.27 1.27)
							)
						)
					)
				)
			)
		)
	)
	(junction
		(at 106.68 87.63)
		(diameter 0)
		(color 0 0 0 0)
		(uuid "246bf986-83d8-470d-9eca-a96c5e5d3572")
	)
	(junction
		(at 106.68 71.12)
		(diameter 0)
		(color 0 0 0 0)
		(uuid "50117ddc-6e86-4e17-8aa6-a8d1fdaa1177")
	)
	(junction
		(at 111.76 100.33)
		(diameter 0)
		(color 0 0 0 0)
		(uuid "9a36a2a7-d4f1-4e4a-817f-7b6168b2038c")
	)
	(junction
		(at 116.84 87.63)
		(diameter 0)
		(color 0 0 0 0)
		(uuid "aa6f0f69-792d-4dd3-8b1d-b9f2e6d0e6d4")
	)
	(wire
		(pts
			(xy 95.25 92.71) (xy 101.6 92.71)
		)
		(stroke
			(width 0)
			(type default)
		)
		(uuid "08edb32f-8304-4881-8a22-ed6816b17aa7")
	)
	(wire
		(pts
			(xy 111.76 100.33) (xy 116.84 100.33)
		)
		(stroke
			(width 0)
			(type default)
		)
		(uuid "0cecc6f2-13bf-4f97-8c35-81c0a2be4ffb")
	)
	(wire
		(pts
			(xy 106.68 100.33) (xy 111.76 100.33)
		)
		(stroke
			(width 0)
			(type default)
		)
		(uuid "155df38b-b7f0-48ad-878b-fe1e2998dc03")
	)
	(wire
		(pts
			(xy 116.84 74.93) (xy 116.84 71.12)
		)
		(stroke
			(width 0)
			(type default)
		)
		(uuid "197bcb68-24b3-4894-b4e6-dd9c5d48470f")
	)
	(wire
		(pts
			(xy 106.68 82.55) (xy 106.68 87.63)
		)
		(stroke
			(width 0)
			(type default)
		)
		(uuid "3f872b44-7e48-4799-9266-a842790b5438")
	)
	(wire
		(pts
			(xy 102.87 67.31) (xy 106.68 67.31)
		)
		(stroke
			(width 0)
			(type default)
		)
		(uuid "42bb7f9f-3671-415f-b94c-79e67274673f")
	)
	(wire
		(pts
			(xy 106.68 71.12) (xy 99.06 71.12)
		)
		(stroke
			(width 0)
			(type default)
		)
		(uuid "44e57fbc-4b2f-44a8-ac76-6963d6d9886c")
	)
	(wire
		(pts
			(xy 116.84 71.12) (xy 106.68 71.12)
		)
		(stroke
			(width 0)
			(type default)
		)
		(uuid "6aa968c2-755c-4e11-8174-0ec282ffe1b9")
	)
	(wire
		(pts
			(xy 106.68 71.12) (xy 106.68 74.93)
		)
		(stroke
			(width 0)
			(type default)
		)
		(uuid "74418ed4-96f5-48b2-bd7b-98bcc51c612e")
	)
	(wire
		(pts
			(xy 106.68 87.63) (xy 116.84 87.63)
		)
		(stroke
			(width 0)
			(type default)
		)
		(uuid "82246688-89f5-4da9-8d88-3dba91c271b0")
	)
	(wire
		(pts
			(xy 116.84 82.55) (xy 116.84 87.63)
		)
		(stroke
			(width 0)
			(type default)
		)
		(uuid "b560d390-7e24-483e-936c-e8f68141a142")
	)
	(wire
		(pts
			(xy 116.84 100.33) (xy 116.84 97.79)
		)
		(stroke
			(width 0)
			(type default)
		)
		(uuid "bfaf7970-5348-4130-a4fb-f80bf53a9de2")
	)
	(wire
		(pts
			(xy 95.25 92.71) (xy 95.25 95.25)
		)
		(stroke
			(width 0)
			(type default)
		)
		(uuid "cacd0428-1e5c-4b4b-85ca-ff63fbb166e9")
	)
	(wire
		(pts
			(xy 106.68 97.79) (xy 106.68 100.33)
		)
		(stroke
			(width 0)
			(type default)
		)
		(uuid "e5ef088f-6b95-4dc4-bde7-2347cb12c778")
	)
	(wire
		(pts
			(xy 121.92 92.71) (xy 130.81 92.71)
		)
		(stroke
			(width 0)
			(type default)
		)
		(uuid "e72e899e-3141-44e8-9d4f-2a36fc977442")
	)
	(label "ANT_DEP"
		(at 106.68 67.31 0)
		(effects
			(font
				(size 1.27 1.27)
			)
			(justify left bottom)
		)
		(uuid "0b5df363-a7dc-4589-98ee-393869780f38")
	)
	(label "ANT_DEP"
		(at 95.25 92.71 180)
		(effects
			(font
				(size 1.27 1.27)
			)
			(justify right bottom)
		)
		(uuid "96d64ec3-74dd-45f3-9f77-b1b10a62a585")
	)
	(label "ANT_DEP"
		(at 130.81 92.71 0)
		(effects
			(font
				(size 1.27 1.27)
			)
			(justify left bottom)
		)
		(uuid "bff81813-536f-4f95-b914-1131645cd7c2")
	)
	(hierarchical_label "ANT_DEP"
		(shape input)
		(at 102.87 67.31 180)
		(effects
			(font
				(size 1.27 1.27)
			)
			(justify right)
		)
		(uuid "759b1a55-294e-410b-9a7a-1887fe40748d")
	)
	(hierarchical_label "BAT+"
		(shape input)
		(at 99.06 71.12 180)
		(effects
			(font
				(size 1.27 1.27)
			)
			(justify right)
		)
		(uuid "976c9ba6-a413-4b99-894e-8441516220e8")
	)
	(symbol
		(lib_id "power:GND")
		(at 111.76 100.33 0)
		(unit 1)
		(exclude_from_sim no)
		(in_bom yes)
		(on_board yes)
		(dnp no)
		(fields_autoplaced yes)
		(uuid "098c8f83-2b8d-40a1-bb41-a130e0c6ad65")
		(property "Reference" "#PWR0902"
			(at 111.76 106.68 0)
			(effects
				(font
					(size 1.27 1.27)
				)
				(hide yes)
			)
		)
		(property "Value" "GND"
			(at 111.76 105.41 0)
			(effects
				(font
					(size 1.27 1.27)
				)
			)
		)
		(property "Footprint" ""
			(at 111.76 100.33 0)
			(effects
				(font
					(size 1.27 1.27)
				)
				(hide yes)
			)
		)
		(property "Datasheet" ""
			(at 111.76 100.33 0)
			(effects
				(font
					(size 1.27 1.27)
				)
				(hide yes)
			)
		)
		(property "Description" "Power symbol creates a global label with name \"GND\" , ground"
			(at 111.76 100.33 0)
			(effects
				(font
					(size 1.27 1.27)
				)
				(hide yes)
			)
		)
		(pin "1"
			(uuid "91c7a936-e610-4dfc-8839-9939e0341a3f")
		)
		(instances
			(project "thermal-knife-side-panel"
				(path "/939a66ab-75af-461c-af1d-e60f86ed6142/7084cfe2-b357-413a-9b43-243023daa4f7"
					(reference "#PWR0902")
					(unit 1)
				)
			)
			(project "sidloc-mcu"
				(path "/c360b637-6f5d-44e0-97f7-af09c2986ed7/40a24e63-c8f7-46df-99b9-106b8430836e"
					(reference "#PWR0902")
					(unit 1)
				)
			)
			(project "sidloc"
				(path "/e63e39d7-6ac0-4ffd-8aa3-1841a4541b55/f5c159c6-76d5-4ef9-a42b-1b678af64652"
					(reference "#PWR0902")
					(unit 1)
				)
			)
		)
	)
	(symbol
		(lib_id "lsf-kicad:FDN537N")
		(at 119.38 92.71 0)
		(mirror y)
		(unit 1)
		(exclude_from_sim no)
		(in_bom yes)
		(on_board yes)
		(dnp no)
		(uuid "1d6473b6-a0df-43b9-9a82-3fae03e8f825")
		(property "Reference" "Q902"
			(at 123.19 86.36 0)
			(effects
				(font
					(size 1.27 1.27)
				)
				(justify left)
			)
		)
		(property "Value" "FDN337N"
			(at 127 88.9 0)
			(effects
				(font
					(size 1.27 1.27)
				)
				(justify left)
			)
		)
		(property "Footprint" "Package_TO_SOT_SMD:SuperSOT-3"
			(at 113.03 94.615 0)
			(effects
				(font
					(size 1.27 1.27)
					(italic yes)
				)
				(justify left)
				(hide yes)
			)
		)
		(property "Datasheet" "https://www.onsemi.com/pub/Collateral/FDN337N-D.pdf"
			(at 118.11 92.71 90)
			(effects
				(font
					(size 1.27 1.27)
				)
				(justify left)
				(hide yes)
			)
		)
		(property "Description" ""
			(at 119.38 92.71 0)
			(effects
				(font
					(size 1.27 1.27)
				)
				(hide yes)
			)
		)
		(property "Part Number" "FDN337N"
			(at 119.38 92.71 0)
			(effects
				(font
					(size 1.27 1.27)
				)
				(hide yes)
			)
		)
		(pin "1"
			(uuid "321bc2c8-2bfc-481e-a12a-1105c8e49a98")
		)
		(pin "2"
			(uuid "73d20170-b0b9-47f5-ad75-7ad152eda666")
		)
		(pin "3"
			(uuid "e98aa069-b4d7-4ef7-8631-db8798dff242")
		)
		(instances
			(project "thermal-knife-side-panel"
				(path "/939a66ab-75af-461c-af1d-e60f86ed6142/7084cfe2-b357-413a-9b43-243023daa4f7"
					(reference "Q902")
					(unit 1)
				)
			)
			(project "sidloc-mcu"
				(path "/c360b637-6f5d-44e0-97f7-af09c2986ed7/40a24e63-c8f7-46df-99b9-106b8430836e"
					(reference "Q902")
					(unit 1)
				)
			)
			(project "sidloc"
				(path "/e63e39d7-6ac0-4ffd-8aa3-1841a4541b55/f5c159c6-76d5-4ef9-a42b-1b678af64652"
					(reference "Q902")
					(unit 1)
				)
			)
		)
	)
	(symbol
		(lib_id "Device:R")
		(at 95.25 99.06 0)
		(unit 1)
		(exclude_from_sim no)
		(in_bom yes)
		(on_board yes)
		(dnp no)
		(fields_autoplaced yes)
		(uuid "5e0d2edd-4def-46d6-9dbc-b4eebdc02300")
		(property "Reference" "R901"
			(at 97.79 97.7899 0)
			(effects
				(font
					(size 1.27 1.27)
				)
				(justify left)
			)
		)
		(property "Value" "10k"
			(at 97.79 100.3299 0)
			(effects
				(font
					(size 1.27 1.27)
				)
				(justify left)
			)
		)
		(property "Footprint" "Resistor_SMD:R_0402_1005Metric"
			(at 93.472 99.06 90)
			(effects
				(font
					(size 1.27 1.27)
				)
				(hide yes)
			)
		)
		(property "Datasheet" "~"
			(at 95.25 99.06 0)
			(effects
				(font
					(size 1.27 1.27)
				)
				(hide yes)
			)
		)
		(property "Description" ""
			(at 95.25 99.06 0)
			(effects
				(font
					(size 1.27 1.27)
				)
				(hide yes)
			)
		)
		(property "Part Number" "RC0402JR-1310KL"
			(at 95.25 99.06 0)
			(effects
				(font
					(size 1.27 1.27)
				)
				(hide yes)
			)
		)
		(pin "1"
			(uuid "e8f34cce-ec43-494a-b8a9-0fc4315f5de6")
		)
		(pin "2"
			(uuid "9347aa54-408b-41c0-a5e6-e2ef0b295036")
		)
		(instances
			(project "sidloc-mcu"
				(path "/c360b637-6f5d-44e0-97f7-af09c2986ed7/40a24e63-c8f7-46df-99b9-106b8430836e"
					(reference "R901")
					(unit 1)
				)
			)
			(project "sidloc"
				(path "/e63e39d7-6ac0-4ffd-8aa3-1841a4541b55/f5c159c6-76d5-4ef9-a42b-1b678af64652"
					(reference "R901")
					(unit 1)
				)
			)
		)
	)
	(symbol
		(lib_id "power:GND")
		(at 95.25 102.87 0)
		(unit 1)
		(exclude_from_sim no)
		(in_bom yes)
		(on_board yes)
		(dnp no)
		(fields_autoplaced yes)
		(uuid "7524e0ca-0c29-49e7-a273-81bb3a4eaa1c")
		(property "Reference" "#PWR0901"
			(at 95.25 109.22 0)
			(effects
				(font
					(size 1.27 1.27)
				)
				(hide yes)
			)
		)
		(property "Value" "GND"
			(at 95.25 107.95 0)
			(effects
				(font
					(size 1.27 1.27)
				)
			)
		)
		(property "Footprint" ""
			(at 95.25 102.87 0)
			(effects
				(font
					(size 1.27 1.27)
				)
				(hide yes)
			)
		)
		(property "Datasheet" ""
			(at 95.25 102.87 0)
			(effects
				(font
					(size 1.27 1.27)
				)
				(hide yes)
			)
		)
		(property "Description" "Power symbol creates a global label with name \"GND\" , ground"
			(at 95.25 102.87 0)
			(effects
				(font
					(size 1.27 1.27)
				)
				(hide yes)
			)
		)
		(pin "1"
			(uuid "dd5a5850-05ec-4ff8-a350-19a948107a76")
		)
		(instances
			(project "thermal-knife-side-panel"
				(path "/939a66ab-75af-461c-af1d-e60f86ed6142/7084cfe2-b357-413a-9b43-243023daa4f7"
					(reference "#PWR0901")
					(unit 1)
				)
			)
			(project "sidloc-mcu"
				(path "/c360b637-6f5d-44e0-97f7-af09c2986ed7/40a24e63-c8f7-46df-99b9-106b8430836e"
					(reference "#PWR0901")
					(unit 1)
				)
			)
			(project "sidloc"
				(path "/e63e39d7-6ac0-4ffd-8aa3-1841a4541b55/f5c159c6-76d5-4ef9-a42b-1b678af64652"
					(reference "#PWR0901")
					(unit 1)
				)
			)
		)
	)
	(symbol
		(lib_id "lsf-kicad:FDN537N")
		(at 104.14 92.71 0)
		(unit 1)
		(exclude_from_sim no)
		(in_bom yes)
		(on_board yes)
		(dnp no)
		(uuid "943ca142-8800-4826-bd0d-c8f9d0472c20")
		(property "Reference" "Q901"
			(at 100.33 86.36 0)
			(effects
				(font
					(size 1.27 1.27)
				)
				(justify left)
			)
		)
		(property "Value" "FDN337N"
			(at 92.6116 89.0519 0)
			(effects
				(font
					(size 1.27 1.27)
				)
				(justify left)
			)
		)
		(property "Footprint" "Package_TO_SOT_SMD:SuperSOT-3"
			(at 110.49 94.615 0)
			(effects
				(font
					(size 1.27 1.27)
					(italic yes)
				)
				(justify left)
				(hide yes)
			)
		)
		(property "Datasheet" "https://www.onsemi.com/pub/Collateral/FDN337N-D.pdf"
			(at 105.41 92.71 90)
			(effects
				(font
					(size 1.27 1.27)
				)
				(justify left)
				(hide yes)
			)
		)
		(property "Description" ""
			(at 104.14 92.71 0)
			(effects
				(font
					(size 1.27 1.27)
				)
				(hide yes)
			)
		)
		(property "Part Number" "FDN337N"
			(at 104.14 92.71 0)
			(effects
				(font
					(size 1.27 1.27)
				)
				(hide yes)
			)
		)
		(pin "1"
			(uuid "3301e223-856b-43e4-b912-8023cdc3f22e")
		)
		(pin "2"
			(uuid "7a3d6d77-28ac-4d4d-94a6-e4a0b60ad6c2")
		)
		(pin "3"
			(uuid "edbe115c-0d3a-41aa-93d1-40ef78fa4db5")
		)
		(instances
			(project "thermal-knife-side-panel"
				(path "/939a66ab-75af-461c-af1d-e60f86ed6142/7084cfe2-b357-413a-9b43-243023daa4f7"
					(reference "Q901")
					(unit 1)
				)
			)
			(project "sidloc-mcu"
				(path "/c360b637-6f5d-44e0-97f7-af09c2986ed7/40a24e63-c8f7-46df-99b9-106b8430836e"
					(reference "Q901")
					(unit 1)
				)
			)
			(project "sidloc"
				(path "/e63e39d7-6ac0-4ffd-8aa3-1841a4541b55/f5c159c6-76d5-4ef9-a42b-1b678af64652"
					(reference "Q901")
					(unit 1)
				)
			)
		)
	)
	(symbol
		(lib_id "Device:R")
		(at 106.68 78.74 0)
		(unit 1)
		(exclude_from_sim no)
		(in_bom yes)
		(on_board yes)
		(dnp no)
		(fields_autoplaced yes)
		(uuid "95c964bf-7353-4927-b4b8-95143242a707")
		(property "Reference" "R902"
			(at 104.14 77.4699 0)
			(effects
				(font
					(size 1.27 1.27)
				)
				(justify right)
			)
		)
		(property "Value" "12Ω, 1/8W"
			(at 104.14 80.0099 0)
			(effects
				(font
					(size 1.27 1.27)
				)
				(justify right)
			)
		)
		(property "Footprint" "Resistor_THT:R_Axial_DIN0204_L3.6mm_D1.6mm_P7.62mm_Horizontal"
			(at 104.902 78.74 90)
			(effects
				(font
					(size 1.27 1.27)
				)
				(hide yes)
			)
		)
		(property "Datasheet" "~"
			(at 106.68 78.74 0)
			(effects
				(font
					(size 1.27 1.27)
				)
				(hide yes)
			)
		)
		(property "Description" ""
			(at 106.68 78.74 0)
			(effects
				(font
					(size 1.27 1.27)
				)
				(hide yes)
			)
		)
		(pin "1"
			(uuid "36dfc32d-4ffa-4b3b-a684-51c5844b221f")
		)
		(pin "2"
			(uuid "ec5bc8f4-75de-4b0b-8edc-98733e739a04")
		)
		(instances
			(project "thermal-knife-side-panel"
				(path "/939a66ab-75af-461c-af1d-e60f86ed6142/7084cfe2-b357-413a-9b43-243023daa4f7"
					(reference "R902")
					(unit 1)
				)
			)
			(project "sidloc-mcu"
				(path "/c360b637-6f5d-44e0-97f7-af09c2986ed7/40a24e63-c8f7-46df-99b9-106b8430836e"
					(reference "R902")
					(unit 1)
				)
			)
			(project "sidloc"
				(path "/e63e39d7-6ac0-4ffd-8aa3-1841a4541b55/f5c159c6-76d5-4ef9-a42b-1b678af64652"
					(reference "R902")
					(unit 1)
				)
			)
		)
	)
	(symbol
		(lib_id "Device:R")
		(at 116.84 78.74 0)
		(unit 1)
		(exclude_from_sim no)
		(in_bom yes)
		(on_board yes)
		(dnp no)
		(fields_autoplaced yes)
		(uuid "9784282a-b8b7-4596-a74c-a9fe26c692e5")
		(property "Reference" "R903"
			(at 119.38 77.4699 0)
			(effects
				(font
					(size 1.27 1.27)
				)
				(justify left)
			)
		)
		(property "Value" "12Ω, 1/8W"
			(at 119.38 80.0099 0)
			(effects
				(font
					(size 1.27 1.27)
				)
				(justify left)
			)
		)
		(property "Footprint" "Resistor_THT:R_Axial_DIN0204_L3.6mm_D1.6mm_P7.62mm_Horizontal"
			(at 115.062 78.74 90)
			(effects
				(font
					(size 1.27 1.27)
				)
				(hide yes)
			)
		)
		(property "Datasheet" "~"
			(at 116.84 78.74 0)
			(effects
				(font
					(size 1.27 1.27)
				)
				(hide yes)
			)
		)
		(property "Description" ""
			(at 116.84 78.74 0)
			(effects
				(font
					(size 1.27 1.27)
				)
				(hide yes)
			)
		)
		(pin "1"
			(uuid "08c0c97a-1e3a-482c-8a11-d172b32725da")
		)
		(pin "2"
			(uuid "690323a3-1c05-46f5-9181-0c7bd326a406")
		)
		(instances
			(project "thermal-knife-side-panel"
				(path "/939a66ab-75af-461c-af1d-e60f86ed6142/7084cfe2-b357-413a-9b43-243023daa4f7"
					(reference "R903")
					(unit 1)
				)
			)
			(project "sidloc-mcu"
				(path "/c360b637-6f5d-44e0-97f7-af09c2986ed7/40a24e63-c8f7-46df-99b9-106b8430836e"
					(reference "R903")
					(unit 1)
				)
			)
			(project "sidloc"
				(path "/e63e39d7-6ac0-4ffd-8aa3-1841a4541b55/f5c159c6-76d5-4ef9-a42b-1b678af64652"
					(reference "R903")
					(unit 1)
				)
			)
		)
	)
)
