(kicad_sch
	(version 20231120)
	(generator "eeschema")
	(generator_version "8.0")
	(uuid "e63e39d7-6ac0-4ffd-8aa3-1841a4541b55")
	(paper "A4")
	(title_block
		(title "SIDLOC")
		(date "2022-03-16")
		(company "Libre Space Foundation")
	)
	(lib_symbols
		(symbol "Connector:Conn_Coaxial"
			(pin_names
				(offset 1.016) hide)
			(exclude_from_sim no)
			(in_bom yes)
			(on_board yes)
			(property "Reference" "J"
				(at 0.254 3.048 0)
				(effects
					(font
						(size 1.27 1.27)
					)
				)
			)
			(property "Value" "Conn_Coaxial"
				(at 2.921 0 90)
				(effects
					(font
						(size 1.27 1.27)
					)
				)
			)
			(property "Footprint" ""
				(at 0 0 0)
				(effects
					(font
						(size 1.27 1.27)
					)
					(hide yes)
				)
			)
			(property "Datasheet" "~"
				(at 0 0 0)
				(effects
					(font
						(size 1.27 1.27)
					)
					(hide yes)
				)
			)
			(property "Description" "coaxial connector (BNC, SMA, SMB, SMC, Cinch/RCA, LEMO, ...)"
				(at 0 0 0)
				(effects
					(font
						(size 1.27 1.27)
					)
					(hide yes)
				)
			)
			(property "ki_keywords" "BNC SMA SMB SMC LEMO coaxial connector CINCH RCA MCX MMCX U.FL UMRF"
				(at 0 0 0)
				(effects
					(font
						(size 1.27 1.27)
					)
					(hide yes)
				)
			)
			(property "ki_fp_filters" "*BNC* *SMA* *SMB* *SMC* *Cinch* *LEMO* *UMRF* *MCX* *U.FL*"
				(at 0 0 0)
				(effects
					(font
						(size 1.27 1.27)
					)
					(hide yes)
				)
			)
			(symbol "Conn_Coaxial_0_1"
				(arc
					(start -1.778 -0.508)
					(mid 0.2311 -1.8066)
					(end 1.778 0)
					(stroke
						(width 0.254)
						(type default)
					)
					(fill
						(type none)
					)
				)
				(polyline
					(pts
						(xy -2.54 0) (xy -0.508 0)
					)
					(stroke
						(width 0)
						(type default)
					)
					(fill
						(type none)
					)
				)
				(polyline
					(pts
						(xy 0 -2.54) (xy 0 -1.778)
					)
					(stroke
						(width 0)
						(type default)
					)
					(fill
						(type none)
					)
				)
				(circle
					(center 0 0)
					(radius 0.508)
					(stroke
						(width 0.2032)
						(type default)
					)
					(fill
						(type none)
					)
				)
				(arc
					(start 1.778 0)
					(mid 0.2099 1.8101)
					(end -1.778 0.508)
					(stroke
						(width 0.254)
						(type default)
					)
					(fill
						(type none)
					)
				)
			)
			(symbol "Conn_Coaxial_1_1"
				(pin passive line
					(at -5.08 0 0)
					(length 2.54)
					(name "In"
						(effects
							(font
								(size 1.27 1.27)
							)
						)
					)
					(number "1"
						(effects
							(font
								(size 1.27 1.27)
							)
						)
					)
				)
				(pin passive line
					(at 0 -5.08 90)
					(length 2.54)
					(name "Ext"
						(effects
							(font
								(size 1.27 1.27)
							)
						)
					)
					(number "2"
						(effects
							(font
								(size 1.27 1.27)
							)
						)
					)
				)
			)
		)
		(symbol "Connector_Generic:Conn_01x02"
			(pin_names
				(offset 1.016) hide)
			(exclude_from_sim no)
			(in_bom yes)
			(on_board yes)
			(property "Reference" "J"
				(at 0 2.54 0)
				(effects
					(font
						(size 1.27 1.27)
					)
				)
			)
			(property "Value" "Conn_01x02"
				(at 0 -5.08 0)
				(effects
					(font
						(size 1.27 1.27)
					)
				)
			)
			(property "Footprint" ""
				(at 0 0 0)
				(effects
					(font
						(size 1.27 1.27)
					)
					(hide yes)
				)
			)
			(property "Datasheet" "~"
				(at 0 0 0)
				(effects
					(font
						(size 1.27 1.27)
					)
					(hide yes)
				)
			)
			(property "Description" "Generic connector, single row, 01x02, script generated (kicad-library-utils/schlib/autogen/connector/)"
				(at 0 0 0)
				(effects
					(font
						(size 1.27 1.27)
					)
					(hide yes)
				)
			)
			(property "ki_keywords" "connector"
				(at 0 0 0)
				(effects
					(font
						(size 1.27 1.27)
					)
					(hide yes)
				)
			)
			(property "ki_fp_filters" "Connector*:*_1x??_*"
				(at 0 0 0)
				(effects
					(font
						(size 1.27 1.27)
					)
					(hide yes)
				)
			)
			(symbol "Conn_01x02_1_1"
				(rectangle
					(start -1.27 -2.413)
					(end 0 -2.667)
					(stroke
						(width 0.1524)
						(type default)
					)
					(fill
						(type none)
					)
				)
				(rectangle
					(start -1.27 0.127)
					(end 0 -0.127)
					(stroke
						(width 0.1524)
						(type default)
					)
					(fill
						(type none)
					)
				)
				(rectangle
					(start -1.27 1.27)
					(end 1.27 -3.81)
					(stroke
						(width 0.254)
						(type default)
					)
					(fill
						(type background)
					)
				)
				(pin passive line
					(at -5.08 0 0)
					(length 3.81)
					(name "Pin_1"
						(effects
							(font
								(size 1.27 1.27)
							)
						)
					)
					(number "1"
						(effects
							(font
								(size 1.27 1.27)
							)
						)
					)
				)
				(pin passive line
					(at -5.08 -2.54 0)
					(length 3.81)
					(name "Pin_2"
						(effects
							(font
								(size 1.27 1.27)
							)
						)
					)
					(number "2"
						(effects
							(font
								(size 1.27 1.27)
							)
						)
					)
				)
			)
		)
		(symbol "Connector_Generic:Conn_01x03"
			(pin_names
				(offset 1.016) hide)
			(exclude_from_sim no)
			(in_bom yes)
			(on_board yes)
			(property "Reference" "J"
				(at 0 5.08 0)
				(effects
					(font
						(size 1.27 1.27)
					)
				)
			)
			(property "Value" "Conn_01x03"
				(at 0 -5.08 0)
				(effects
					(font
						(size 1.27 1.27)
					)
				)
			)
			(property "Footprint" ""
				(at 0 0 0)
				(effects
					(font
						(size 1.27 1.27)
					)
					(hide yes)
				)
			)
			(property "Datasheet" "~"
				(at 0 0 0)
				(effects
					(font
						(size 1.27 1.27)
					)
					(hide yes)
				)
			)
			(property "Description" "Generic connector, single row, 01x03, script generated (kicad-library-utils/schlib/autogen/connector/)"
				(at 0 0 0)
				(effects
					(font
						(size 1.27 1.27)
					)
					(hide yes)
				)
			)
			(property "ki_keywords" "connector"
				(at 0 0 0)
				(effects
					(font
						(size 1.27 1.27)
					)
					(hide yes)
				)
			)
			(property "ki_fp_filters" "Connector*:*_1x??_*"
				(at 0 0 0)
				(effects
					(font
						(size 1.27 1.27)
					)
					(hide yes)
				)
			)
			(symbol "Conn_01x03_1_1"
				(rectangle
					(start -1.27 -2.413)
					(end 0 -2.667)
					(stroke
						(width 0.1524)
						(type default)
					)
					(fill
						(type none)
					)
				)
				(rectangle
					(start -1.27 0.127)
					(end 0 -0.127)
					(stroke
						(width 0.1524)
						(type default)
					)
					(fill
						(type none)
					)
				)
				(rectangle
					(start -1.27 2.667)
					(end 0 2.413)
					(stroke
						(width 0.1524)
						(type default)
					)
					(fill
						(type none)
					)
				)
				(rectangle
					(start -1.27 3.81)
					(end 1.27 -3.81)
					(stroke
						(width 0.254)
						(type default)
					)
					(fill
						(type background)
					)
				)
				(pin passive line
					(at -5.08 2.54 0)
					(length 3.81)
					(name "Pin_1"
						(effects
							(font
								(size 1.27 1.27)
							)
						)
					)
					(number "1"
						(effects
							(font
								(size 1.27 1.27)
							)
						)
					)
				)
				(pin passive line
					(at -5.08 0 0)
					(length 3.81)
					(name "Pin_2"
						(effects
							(font
								(size 1.27 1.27)
							)
						)
					)
					(number "2"
						(effects
							(font
								(size 1.27 1.27)
							)
						)
					)
				)
				(pin passive line
					(at -5.08 -2.54 0)
					(length 3.81)
					(name "Pin_3"
						(effects
							(font
								(size 1.27 1.27)
							)
						)
					)
					(number "3"
						(effects
							(font
								(size 1.27 1.27)
							)
						)
					)
				)
			)
		)
		(symbol "Connector_Generic:Conn_01x06"
			(pin_names
				(offset 1.016) hide)
			(exclude_from_sim no)
			(in_bom yes)
			(on_board yes)
			(property "Reference" "J"
				(at 0 7.62 0)
				(effects
					(font
						(size 1.27 1.27)
					)
				)
			)
			(property "Value" "Conn_01x06"
				(at 0 -10.16 0)
				(effects
					(font
						(size 1.27 1.27)
					)
				)
			)
			(property "Footprint" ""
				(at 0 0 0)
				(effects
					(font
						(size 1.27 1.27)
					)
					(hide yes)
				)
			)
			(property "Datasheet" "~"
				(at 0 0 0)
				(effects
					(font
						(size 1.27 1.27)
					)
					(hide yes)
				)
			)
			(property "Description" "Generic connector, single row, 01x06, script generated (kicad-library-utils/schlib/autogen/connector/)"
				(at 0 0 0)
				(effects
					(font
						(size 1.27 1.27)
					)
					(hide yes)
				)
			)
			(property "ki_keywords" "connector"
				(at 0 0 0)
				(effects
					(font
						(size 1.27 1.27)
					)
					(hide yes)
				)
			)
			(property "ki_fp_filters" "Connector*:*_1x??_*"
				(at 0 0 0)
				(effects
					(font
						(size 1.27 1.27)
					)
					(hide yes)
				)
			)
			(symbol "Conn_01x06_1_1"
				(rectangle
					(start -1.27 -7.493)
					(end 0 -7.747)
					(stroke
						(width 0.1524)
						(type default)
					)
					(fill
						(type none)
					)
				)
				(rectangle
					(start -1.27 -4.953)
					(end 0 -5.207)
					(stroke
						(width 0.1524)
						(type default)
					)
					(fill
						(type none)
					)
				)
				(rectangle
					(start -1.27 -2.413)
					(end 0 -2.667)
					(stroke
						(width 0.1524)
						(type default)
					)
					(fill
						(type none)
					)
				)
				(rectangle
					(start -1.27 0.127)
					(end 0 -0.127)
					(stroke
						(width 0.1524)
						(type default)
					)
					(fill
						(type none)
					)
				)
				(rectangle
					(start -1.27 2.667)
					(end 0 2.413)
					(stroke
						(width 0.1524)
						(type default)
					)
					(fill
						(type none)
					)
				)
				(rectangle
					(start -1.27 5.207)
					(end 0 4.953)
					(stroke
						(width 0.1524)
						(type default)
					)
					(fill
						(type none)
					)
				)
				(rectangle
					(start -1.27 6.35)
					(end 1.27 -8.89)
					(stroke
						(width 0.254)
						(type default)
					)
					(fill
						(type background)
					)
				)
				(pin passive line
					(at -5.08 5.08 0)
					(length 3.81)
					(name "Pin_1"
						(effects
							(font
								(size 1.27 1.27)
							)
						)
					)
					(number "1"
						(effects
							(font
								(size 1.27 1.27)
							)
						)
					)
				)
				(pin passive line
					(at -5.08 2.54 0)
					(length 3.81)
					(name "Pin_2"
						(effects
							(font
								(size 1.27 1.27)
							)
						)
					)
					(number "2"
						(effects
							(font
								(size 1.27 1.27)
							)
						)
					)
				)
				(pin passive line
					(at -5.08 0 0)
					(length 3.81)
					(name "Pin_3"
						(effects
							(font
								(size 1.27 1.27)
							)
						)
					)
					(number "3"
						(effects
							(font
								(size 1.27 1.27)
							)
						)
					)
				)
				(pin passive line
					(at -5.08 -2.54 0)
					(length 3.81)
					(name "Pin_4"
						(effects
							(font
								(size 1.27 1.27)
							)
						)
					)
					(number "4"
						(effects
							(font
								(size 1.27 1.27)
							)
						)
					)
				)
				(pin passive line
					(at -5.08 -5.08 0)
					(length 3.81)
					(name "Pin_5"
						(effects
							(font
								(size 1.27 1.27)
							)
						)
					)
					(number "5"
						(effects
							(font
								(size 1.27 1.27)
							)
						)
					)
				)
				(pin passive line
					(at -5.08 -7.62 0)
					(length 3.81)
					(name "Pin_6"
						(effects
							(font
								(size 1.27 1.27)
							)
						)
					)
					(number "6"
						(effects
							(font
								(size 1.27 1.27)
							)
						)
					)
				)
			)
		)
		(symbol "Device:NetTie_2"
			(pin_numbers hide)
			(pin_names
				(offset 0) hide)
			(exclude_from_sim no)
			(in_bom no)
			(on_board yes)
			(property "Reference" "NT"
				(at 0 1.27 0)
				(effects
					(font
						(size 1.27 1.27)
					)
				)
			)
			(property "Value" "NetTie_2"
				(at 0 -1.27 0)
				(effects
					(font
						(size 1.27 1.27)
					)
				)
			)
			(property "Footprint" ""
				(at 0 0 0)
				(effects
					(font
						(size 1.27 1.27)
					)
					(hide yes)
				)
			)
			(property "Datasheet" "~"
				(at 0 0 0)
				(effects
					(font
						(size 1.27 1.27)
					)
					(hide yes)
				)
			)
			(property "Description" "Net tie, 2 pins"
				(at 0 0 0)
				(effects
					(font
						(size 1.27 1.27)
					)
					(hide yes)
				)
			)
			(property "ki_keywords" "net tie short"
				(at 0 0 0)
				(effects
					(font
						(size 1.27 1.27)
					)
					(hide yes)
				)
			)
			(property "ki_fp_filters" "Net*Tie*"
				(at 0 0 0)
				(effects
					(font
						(size 1.27 1.27)
					)
					(hide yes)
				)
			)
			(symbol "NetTie_2_0_1"
				(polyline
					(pts
						(xy -1.27 0) (xy 1.27 0)
					)
					(stroke
						(width 0.254)
						(type default)
					)
					(fill
						(type none)
					)
				)
			)
			(symbol "NetTie_2_1_1"
				(pin passive line
					(at -2.54 0 0)
					(length 2.54)
					(name "1"
						(effects
							(font
								(size 1.27 1.27)
							)
						)
					)
					(number "1"
						(effects
							(font
								(size 1.27 1.27)
							)
						)
					)
				)
				(pin passive line
					(at 2.54 0 180)
					(length 2.54)
					(name "2"
						(effects
							(font
								(size 1.27 1.27)
							)
						)
					)
					(number "2"
						(effects
							(font
								(size 1.27 1.27)
							)
						)
					)
				)
			)
		)
		(symbol "power:GND"
			(power)
			(pin_numbers hide)
			(pin_names
				(offset 0) hide)
			(exclude_from_sim no)
			(in_bom yes)
			(on_board yes)
			(property "Reference" "#PWR"
				(at 0 -6.35 0)
				(effects
					(font
						(size 1.27 1.27)
					)
					(hide yes)
				)
			)
			(property "Value" "GND"
				(at 0 -3.81 0)
				(effects
					(font
						(size 1.27 1.27)
					)
				)
			)
			(property "Footprint" ""
				(at 0 0 0)
				(effects
					(font
						(size 1.27 1.27)
					)
					(hide yes)
				)
			)
			(property "Datasheet" ""
				(at 0 0 0)
				(effects
					(font
						(size 1.27 1.27)
					)
					(hide yes)
				)
			)
			(property "Description" "Power symbol creates a global label with name \"GND\" , ground"
				(at 0 0 0)
				(effects
					(font
						(size 1.27 1.27)
					)
					(hide yes)
				)
			)
			(property "ki_keywords" "global power"
				(at 0 0 0)
				(effects
					(font
						(size 1.27 1.27)
					)
					(hide yes)
				)
			)
			(symbol "GND_0_1"
				(polyline
					(pts
						(xy 0 0) (xy 0 -1.27) (xy 1.27 -1.27) (xy 0 -2.54) (xy -1.27 -1.27) (xy 0 -1.27)
					)
					(stroke
						(width 0)
						(type default)
					)
					(fill
						(type none)
					)
				)
			)
			(symbol "GND_1_1"
				(pin power_in line
					(at 0 0 270)
					(length 0)
					(name "~"
						(effects
							(font
								(size 1.27 1.27)
							)
						)
					)
					(number "1"
						(effects
							(font
								(size 1.27 1.27)
							)
						)
					)
				)
			)
		)
		(symbol "power:GNDA"
			(power)
			(pin_numbers hide)
			(pin_names
				(offset 0) hide)
			(exclude_from_sim no)
			(in_bom yes)
			(on_board yes)
			(property "Reference" "#PWR"
				(at 0 -6.35 0)
				(effects
					(font
						(size 1.27 1.27)
					)
					(hide yes)
				)
			)
			(property "Value" "GNDA"
				(at 0 -3.81 0)
				(effects
					(font
						(size 1.27 1.27)
					)
				)
			)
			(property "Footprint" ""
				(at 0 0 0)
				(effects
					(font
						(size 1.27 1.27)
					)
					(hide yes)
				)
			)
			(property "Datasheet" ""
				(at 0 0 0)
				(effects
					(font
						(size 1.27 1.27)
					)
					(hide yes)
				)
			)
			(property "Description" "Power symbol creates a global label with name \"GNDA\" , analog ground"
				(at 0 0 0)
				(effects
					(font
						(size 1.27 1.27)
					)
					(hide yes)
				)
			)
			(property "ki_keywords" "global power"
				(at 0 0 0)
				(effects
					(font
						(size 1.27 1.27)
					)
					(hide yes)
				)
			)
			(symbol "GNDA_0_1"
				(polyline
					(pts
						(xy 0 0) (xy 0 -1.27) (xy 1.27 -1.27) (xy 0 -2.54) (xy -1.27 -1.27) (xy 0 -1.27)
					)
					(stroke
						(width 0)
						(type default)
					)
					(fill
						(type none)
					)
				)
			)
			(symbol "GNDA_1_1"
				(pin power_in line
					(at 0 0 270)
					(length 0)
					(name "~"
						(effects
							(font
								(size 1.27 1.27)
							)
						)
					)
					(number "1"
						(effects
							(font
								(size 1.27 1.27)
							)
						)
					)
				)
			)
		)
		(symbol "power:PWR_FLAG"
			(power)
			(pin_numbers hide)
			(pin_names
				(offset 0) hide)
			(exclude_from_sim no)
			(in_bom yes)
			(on_board yes)
			(property "Reference" "#FLG"
				(at 0 1.905 0)
				(effects
					(font
						(size 1.27 1.27)
					)
					(hide yes)
				)
			)
			(property "Value" "PWR_FLAG"
				(at 0 3.81 0)
				(effects
					(font
						(size 1.27 1.27)
					)
				)
			)
			(property "Footprint" ""
				(at 0 0 0)
				(effects
					(font
						(size 1.27 1.27)
					)
					(hide yes)
				)
			)
			(property "Datasheet" "~"
				(at 0 0 0)
				(effects
					(font
						(size 1.27 1.27)
					)
					(hide yes)
				)
			)
			(property "Description" "Special symbol for telling ERC where power comes from"
				(at 0 0 0)
				(effects
					(font
						(size 1.27 1.27)
					)
					(hide yes)
				)
			)
			(property "ki_keywords" "flag power"
				(at 0 0 0)
				(effects
					(font
						(size 1.27 1.27)
					)
					(hide yes)
				)
			)
			(symbol "PWR_FLAG_0_0"
				(pin power_out line
					(at 0 0 90)
					(length 0)
					(name "~"
						(effects
							(font
								(size 1.27 1.27)
							)
						)
					)
					(number "1"
						(effects
							(font
								(size 1.27 1.27)
							)
						)
					)
				)
			)
			(symbol "PWR_FLAG_0_1"
				(polyline
					(pts
						(xy 0 0) (xy 0 1.27) (xy -1.016 1.905) (xy 0 2.54) (xy 1.016 1.905) (xy 0 1.27)
					)
					(stroke
						(width 0)
						(type default)
					)
					(fill
						(type none)
					)
				)
			)
		)
	)
	(junction
		(at 55.88 82.55)
		(diameter 0)
		(color 0 0 0 0)
		(uuid "522bfd5a-8abb-40b6-8552-f478064999a5")
	)
	(junction
		(at 215.9 81.28)
		(diameter 0)
		(color 0 0 0 0)
		(uuid "7e77998b-2739-4246-9437-5155f55eed68")
	)
	(junction
		(at 107.95 95.25)
		(diameter 0)
		(color 0 0 0 0)
		(uuid "872aec7b-e690-41a6-a6e9-9b6128d4b78b")
	)
	(junction
		(at 218.44 78.74)
		(diameter 0)
		(color 0 0 0 0)
		(uuid "a95e4dd6-792e-41fc-99bb-747bf0e6498c")
	)
	(junction
		(at 220.98 76.2)
		(diameter 0)
		(color 0 0 0 0)
		(uuid "e3e9a696-46cb-46c0-bc5a-f554f3ed4f59")
	)
	(no_connect
		(at 151.13 57.15)
		(uuid "02522133-bb18-4237-b625-d5a7179291a4")
	)
	(no_connect
		(at 241.3 140.97)
		(uuid "03687fc0-63d8-487f-86b0-49ce21dd408f")
	)
	(no_connect
		(at 33.02 99.06)
		(uuid "2f2530ba-9f3f-4f7d-b8f4-baf7366c477b")
	)
	(no_connect
		(at 264.16 68.58)
		(uuid "349eea22-6db4-481e-90ac-94159448c3cc")
	)
	(no_connect
		(at 264.16 63.5)
		(uuid "3a920f32-5818-4020-95b6-37f9bba859fe")
	)
	(no_connect
		(at 224.79 109.22)
		(uuid "43329cbe-956b-4fa8-989c-0519877a1ea6")
	)
	(no_connect
		(at 81.28 92.71)
		(uuid "4de947b9-14ab-443a-9a24-709c579992b1")
	)
	(no_connect
		(at 81.28 86.36)
		(uuid "576737f4-2b44-41d7-b6cf-03bf6f3b975c")
	)
	(no_connect
		(at 156.21 100.33)
		(uuid "7335e5e6-941d-4379-985e-879778ebc398")
	)
	(no_connect
		(at 224.79 50.8)
		(uuid "74fe3e49-9b18-4310-a92b-3b194dea20aa")
	)
	(no_connect
		(at 264.16 60.96)
		(uuid "7c5c3c50-c4ae-4ae6-be21-82f34f8c7b64")
	)
	(no_connect
		(at 264.16 101.6)
		(uuid "7e3c4619-808b-416b-a156-b771a410dc26")
	)
	(no_connect
		(at 224.79 113.03)
		(uuid "7e3c4619-808b-416b-a156-b771a410dc27")
	)
	(no_connect
		(at 224.79 115.57)
		(uuid "7e3c4619-808b-416b-a156-b771a410dc28")
	)
	(no_connect
		(at 156.21 92.71)
		(uuid "84e826af-87dd-4818-8bd5-d5943fb7e42d")
	)
	(no_connect
		(at 33.02 101.6)
		(uuid "a881f48e-d59c-47fc-8bed-9a34eed9d4a2")
	)
	(no_connect
		(at 264.16 55.88)
		(uuid "afde05bf-6aa7-4691-94c1-6e2c26f20b5b")
	)
	(no_connect
		(at 264.16 66.04)
		(uuid "b1d2ec1a-a1d2-4ca0-8f8d-9808cede64f1")
	)
	(no_connect
		(at 264.16 58.42)
		(uuid "ccb794b7-ab26-46fd-aad6-5576c8a90c2f")
	)
	(no_connect
		(at 241.3 143.51)
		(uuid "dde065dd-5108-4e54-9bc7-1ff3b2be2ad8")
	)
	(no_connect
		(at 118.11 53.34)
		(uuid "df5db653-9825-433b-9b88-ecfdf07d8b71")
	)
	(no_connect
		(at 118.11 50.8)
		(uuid "df5db653-9825-433b-9b88-ecfdf07d8b73")
	)
	(no_connect
		(at 264.16 53.34)
		(uuid "e1179d21-9da6-4391-a055-a686ece6c747")
	)
	(no_connect
		(at 264.16 50.8)
		(uuid "e1179d21-9da6-4391-a055-a686ece6c748")
	)
	(no_connect
		(at 264.16 71.12)
		(uuid "e25ec1fa-2c1e-43bc-8917-ee45a9cd8bce")
	)
	(no_connect
		(at 156.21 78.74)
		(uuid "eda0c7a3-91aa-447a-a915-485e0135ab3c")
	)
	(no_connect
		(at 156.21 81.28)
		(uuid "eda0c7a3-91aa-447a-a915-485e0135ab3e")
	)
	(no_connect
		(at 156.21 88.9)
		(uuid "eda0c7a3-91aa-447a-a915-485e0135ab49")
	)
	(no_connect
		(at 156.21 85.09)
		(uuid "eda0c7a3-91aa-447a-a915-485e0135ab51")
	)
	(no_connect
		(at 35.56 82.55)
		(uuid "f2334357-72cc-4d43-b95e-419d61f72744")
	)
	(no_connect
		(at 35.56 85.09)
		(uuid "f62b2951-ff0e-449a-ab80-5fddccc4ef69")
	)
	(wire
		(pts
			(xy 224.79 92.71) (xy 218.44 92.71)
		)
		(stroke
			(width 0)
			(type default)
		)
		(uuid "00633b64-b54d-4cb0-9ae4-1539b7ed2c58")
	)
	(wire
		(pts
			(xy 195.58 52.07) (xy 204.47 52.07)
		)
		(stroke
			(width 0)
			(type default)
		)
		(uuid "0460eeea-bdcc-4171-be90-3fc5a4245b50")
	)
	(wire
		(pts
			(xy 88.9 187.96) (xy 85.09 187.96)
		)
		(stroke
			(width 0)
			(type default)
		)
		(uuid "04b11f63-109d-40e4-903d-72a2052457c6")
	)
	(wire
		(pts
			(xy 195.58 68.58) (xy 224.79 68.58)
		)
		(stroke
			(width 0)
			(type default)
		)
		(uuid "0a64d7b0-badf-4ff5-9bdd-835374d65140")
	)
	(wire
		(pts
			(xy 195.58 101.6) (xy 224.79 101.6)
		)
		(stroke
			(width 0)
			(type default)
		)
		(uuid "0f99c99e-220e-42f5-974e-0687ba335df1")
	)
	(wire
		(pts
			(xy 224.79 95.25) (xy 215.9 95.25)
		)
		(stroke
			(width 0)
			(type default)
		)
		(uuid "11568587-b992-48b1-abdd-eca15d381311")
	)
	(wire
		(pts
			(xy 195.58 76.2) (xy 220.98 76.2)
		)
		(stroke
			(width 0)
			(type default)
		)
		(uuid "118a27fe-dc62-4323-a60f-0ff340e5c3f3")
	)
	(wire
		(pts
			(xy 107.95 95.25) (xy 107.95 106.68)
		)
		(stroke
			(width 0)
			(type default)
		)
		(uuid "12dba090-9be1-4615-8b9f-2fbd2db16cb8")
	)
	(wire
		(pts
			(xy 195.58 59.69) (xy 224.79 59.69)
		)
		(stroke
			(width 0)
			(type default)
		)
		(uuid "1405b019-ffc0-4b51-8819-8d607f97397f")
	)
	(wire
		(pts
			(xy 195.58 78.74) (xy 218.44 78.74)
		)
		(stroke
			(width 0)
			(type default)
		)
		(uuid "15ffd19b-beee-466b-86c4-5ef306b21238")
	)
	(wire
		(pts
			(xy 217.17 62.23) (xy 224.79 62.23)
		)
		(stroke
			(width 0)
			(type default)
		)
		(uuid "16eef63d-64ea-4096-8024-2b49c0469edc")
	)
	(wire
		(pts
			(xy 52.07 82.55) (xy 55.88 82.55)
		)
		(stroke
			(width 0)
			(type default)
		)
		(uuid "17d1175a-5079-4ff2-b328-f861b2bdc7c9")
	)
	(wire
		(pts
			(xy 195.58 127) (xy 196.85 127)
		)
		(stroke
			(width 0)
			(type default)
		)
		(uuid "1b54e3d5-c011-4317-912f-4e083ca6311c")
	)
	(wire
		(pts
			(xy 195.58 71.12) (xy 224.79 71.12)
		)
		(stroke
			(width 0)
			(type default)
		)
		(uuid "1b57331b-e179-4c3b-8fa3-b3525e1b179e")
	)
	(wire
		(pts
			(xy 195.58 106.68) (xy 224.79 106.68)
		)
		(stroke
			(width 0)
			(type default)
		)
		(uuid "1b88281a-9c66-469e-a3ad-8eb989bce69a")
	)
	(wire
		(pts
			(xy 242.57 83.82) (xy 242.57 87.63)
		)
		(stroke
			(width 0)
			(type default)
		)
		(uuid "1c64f9ce-e30b-4978-b2d2-8bc0ba70819a")
	)
	(wire
		(pts
			(xy 151.13 104.14) (xy 156.21 104.14)
		)
		(stroke
			(width 0)
			(type default)
		)
		(uuid "20540e7b-8f15-4bba-897f-079491897786")
	)
	(wire
		(pts
			(xy 220.98 140.97) (xy 224.79 140.97)
		)
		(stroke
			(width 0)
			(type default)
		)
		(uuid "2c077c6b-b946-4ce6-abb2-84da27d42237")
	)
	(wire
		(pts
			(xy 195.58 66.04) (xy 224.79 66.04)
		)
		(stroke
			(width 0)
			(type default)
		)
		(uuid "335277d2-0e02-4860-94fe-4b753e1ce2b9")
	)
	(wire
		(pts
			(xy 105.41 78.74) (xy 118.11 78.74)
		)
		(stroke
			(width 0)
			(type default)
		)
		(uuid "345786b9-2fb1-42a5-bee5-5343dbd84a98")
	)
	(wire
		(pts
			(xy 107.95 83.82) (xy 107.95 95.25)
		)
		(stroke
			(width 0)
			(type default)
		)
		(uuid "49a8e1ec-7714-478b-a0e8-6b1e8fd048b1")
	)
	(wire
		(pts
			(xy 55.88 82.55) (xy 55.88 99.06)
		)
		(stroke
			(width 0)
			(type default)
		)
		(uuid "54714eab-3a15-4d1b-90f0-dab81179bd94")
	)
	(wire
		(pts
			(xy 215.9 81.28) (xy 224.79 81.28)
		)
		(stroke
			(width 0)
			(type default)
		)
		(uuid "5a934cf9-dac1-4f19-be96-dce276a8098e")
	)
	(wire
		(pts
			(xy 115.57 104.14) (xy 118.11 104.14)
		)
		(stroke
			(width 0)
			(type default)
		)
		(uuid "5e951365-d6e6-41d5-8048-2176e8f17d1c")
	)
	(wire
		(pts
			(xy 107.95 95.25) (xy 105.41 95.25)
		)
		(stroke
			(width 0)
			(type default)
		)
		(uuid "6068f629-edb1-4e7c-a4b4-b7fabc4415a0")
	)
	(wire
		(pts
			(xy 245.11 83.82) (xy 245.11 87.63)
		)
		(stroke
			(width 0)
			(type default)
		)
		(uuid "62405211-5cfd-4ada-b4cb-b112ecfed197")
	)
	(wire
		(pts
			(xy 220.98 149.86) (xy 224.79 149.86)
		)
		(stroke
			(width 0)
			(type default)
		)
		(uuid "685ed265-e29a-494a-bead-f15976eb5d92")
	)
	(wire
		(pts
			(xy 181.61 107.95) (xy 181.61 114.3)
		)
		(stroke
			(width 0)
			(type default)
		)
		(uuid "693296c0-d786-42d5-a286-99c58aff2589")
	)
	(wire
		(pts
			(xy 195.58 62.23) (xy 204.47 62.23)
		)
		(stroke
			(width 0)
			(type default)
		)
		(uuid "6a790164-d0ec-46e6-984a-b1f43888c9e3")
	)
	(wire
		(pts
			(xy 55.88 99.06) (xy 52.07 99.06)
		)
		(stroke
			(width 0)
			(type default)
		)
		(uuid "6abc9ab2-1ca1-4bcf-b5d9-cdda4a93f9d9")
	)
	(wire
		(pts
			(xy 195.58 73.66) (xy 224.79 73.66)
		)
		(stroke
			(width 0)
			(type default)
		)
		(uuid "72ef37a2-2236-4992-97c9-b5146f39521e")
	)
	(wire
		(pts
			(xy 220.98 76.2) (xy 224.79 76.2)
		)
		(stroke
			(width 0)
			(type default)
		)
		(uuid "7376a5e2-022f-4d13-8621-b0c078fe8504")
	)
	(wire
		(pts
			(xy 260.35 83.82) (xy 260.35 87.63)
		)
		(stroke
			(width 0)
			(type default)
		)
		(uuid "76455cae-37a6-4935-88c3-7ea25a9cab15")
	)
	(wire
		(pts
			(xy 107.95 106.68) (xy 29.21 106.68)
		)
		(stroke
			(width 0)
			(type default)
		)
		(uuid "7782d675-f6df-4706-90cc-496f4583853a")
	)
	(wire
		(pts
			(xy 215.9 81.28) (xy 215.9 95.25)
		)
		(stroke
			(width 0)
			(type default)
		)
		(uuid "7b75ed5b-972c-4cd8-9f01-523da5cfa857")
	)
	(wire
		(pts
			(xy 29.21 106.68) (xy 29.21 96.52)
		)
		(stroke
			(width 0)
			(type default)
		)
		(uuid "7c529b0d-41d3-4533-941e-0f426e8390c7")
	)
	(wire
		(pts
			(xy 195.58 54.61) (xy 224.79 54.61)
		)
		(stroke
			(width 0)
			(type default)
		)
		(uuid "7ea2471b-3846-4a24-8cf6-f9f8d10432dc")
	)
	(wire
		(pts
			(xy 97.79 190.5) (xy 97.79 187.96)
		)
		(stroke
			(width 0)
			(type default)
		)
		(uuid "83e40211-f9da-4df5-a3b8-444dd28c12ff")
	)
	(wire
		(pts
			(xy 218.44 78.74) (xy 224.79 78.74)
		)
		(stroke
			(width 0)
			(type default)
		)
		(uuid "84438c42-04ce-4ee3-9bed-bf804cc962e7")
	)
	(wire
		(pts
			(xy 85.09 187.96) (xy 85.09 190.5)
		)
		(stroke
			(width 0)
			(type default)
		)
		(uuid "87bcbbc6-1718-4cb4-84d8-c99928236502")
	)
	(wire
		(pts
			(xy 113.03 64.77) (xy 118.11 64.77)
		)
		(stroke
			(width 0)
			(type default)
		)
		(uuid "891aa439-92b2-40c0-aa74-dec86b728680")
	)
	(wire
		(pts
			(xy 151.13 54.61) (xy 156.21 54.61)
		)
		(stroke
			(width 0)
			(type default)
		)
		(uuid "90cffb9e-6bba-41bb-9ae6-eb5e075bb549")
	)
	(wire
		(pts
			(xy 195.58 119.38) (xy 224.79 119.38)
		)
		(stroke
			(width 0)
			(type default)
		)
		(uuid "9569e574-25cc-497e-a190-f8db498f4bb5")
	)
	(wire
		(pts
			(xy 173.99 107.95) (xy 173.99 114.3)
		)
		(stroke
			(width 0)
			(type default)
		)
		(uuid "95da53c0-5776-4c2c-a5bb-6c3f1cdfd289")
	)
	(wire
		(pts
			(xy 201.93 134.62) (xy 201.93 132.08)
		)
		(stroke
			(width 0)
			(type default)
		)
		(uuid "9a6f0dbb-afb8-4e01-8052-478e683306d9")
	)
	(wire
		(pts
			(xy 224.79 90.17) (xy 220.98 90.17)
		)
		(stroke
			(width 0)
			(type default)
		)
		(uuid "9ad9c585-1e92-405a-9553-c2ba6847941f")
	)
	(wire
		(pts
			(xy 195.58 57.15) (xy 224.79 57.15)
		)
		(stroke
			(width 0)
			(type default)
		)
		(uuid "9bcc93ba-7246-444b-b0ab-53aa897d1f3a")
	)
	(wire
		(pts
			(xy 257.81 83.82) (xy 257.81 87.63)
		)
		(stroke
			(width 0)
			(type default)
		)
		(uuid "9ee5c850-4cfb-4fff-ba91-82cc0e141513")
	)
	(wire
		(pts
			(xy 176.53 107.95) (xy 176.53 114.3)
		)
		(stroke
			(width 0)
			(type default)
		)
		(uuid "9ef4997d-4c70-45cd-a554-3324f0e12765")
	)
	(wire
		(pts
			(xy 113.03 67.31) (xy 118.11 67.31)
		)
		(stroke
			(width 0)
			(type default)
		)
		(uuid "a0adae9b-f007-4c1f-8252-2e8237e8ac03")
	)
	(wire
		(pts
			(xy 97.79 187.96) (xy 93.98 187.96)
		)
		(stroke
			(width 0)
			(type default)
		)
		(uuid "a233ee98-f68b-40d7-89d9-1199d1faa8e7")
	)
	(wire
		(pts
			(xy 151.13 62.23) (xy 156.21 62.23)
		)
		(stroke
			(width 0)
			(type default)
		)
		(uuid "a515e706-1b89-4e3a-8e0d-e6f597057e3d")
	)
	(wire
		(pts
			(xy 105.41 59.69) (xy 118.11 59.69)
		)
		(stroke
			(width 0)
			(type default)
		)
		(uuid "a54d35d4-68e0-434d-8eae-0804b2927a0c")
	)
	(wire
		(pts
			(xy 252.73 83.82) (xy 252.73 87.63)
		)
		(stroke
			(width 0)
			(type default)
		)
		(uuid "a81a5692-e84f-430c-9583-c4d3358d7291")
	)
	(wire
		(pts
			(xy 195.58 81.28) (xy 215.9 81.28)
		)
		(stroke
			(width 0)
			(type default)
		)
		(uuid "acafb7c7-9360-491e-8505-c4d48f2d6883")
	)
	(wire
		(pts
			(xy 255.27 83.82) (xy 255.27 87.63)
		)
		(stroke
			(width 0)
			(type default)
		)
		(uuid "afbe3a01-0071-44de-9213-669ff4c7cf07")
	)
	(wire
		(pts
			(xy 240.03 83.82) (xy 240.03 87.63)
		)
		(stroke
			(width 0)
			(type default)
		)
		(uuid "b71364e9-8a82-4d0a-b22e-f80c1a5edcf3")
	)
	(wire
		(pts
			(xy 113.03 62.23) (xy 118.11 62.23)
		)
		(stroke
			(width 0)
			(type default)
		)
		(uuid "b732adf3-330d-4405-b507-4ad0c558ede4")
	)
	(wire
		(pts
			(xy 88.9 69.85) (xy 92.71 69.85)
		)
		(stroke
			(width 0)
			(type default)
		)
		(uuid "bca986ab-ae44-4c81-bade-80ab2a2c5777")
	)
	(wire
		(pts
			(xy 151.13 69.85) (xy 156.21 69.85)
		)
		(stroke
			(width 0)
			(type default)
		)
		(uuid "bedd3e6f-8550-4909-abc3-8f983b495a6c")
	)
	(wire
		(pts
			(xy 118.11 83.82) (xy 107.95 83.82)
		)
		(stroke
			(width 0)
			(type default)
		)
		(uuid "c1946360-c487-4702-bdb4-3393e573a27e")
	)
	(wire
		(pts
			(xy 74.93 78.74) (xy 81.28 78.74)
		)
		(stroke
			(width 0)
			(type default)
		)
		(uuid "c3104c88-0174-47ed-a2b8-93fd04b68949")
	)
	(wire
		(pts
			(xy 195.58 104.14) (xy 224.79 104.14)
		)
		(stroke
			(width 0)
			(type default)
		)
		(uuid "c86c8d86-4891-4bf4-972e-8f86070f824a")
	)
	(wire
		(pts
			(xy 195.58 97.79) (xy 224.79 97.79)
		)
		(stroke
			(width 0)
			(type default)
		)
		(uuid "cf745731-b855-43e5-a486-e0d7442243ec")
	)
	(wire
		(pts
			(xy 220.98 157.48) (xy 224.79 157.48)
		)
		(stroke
			(width 0)
			(type default)
		)
		(uuid "d07f61e4-c650-43ef-9942-bee5f974a2dc")
	)
	(wire
		(pts
			(xy 81.28 82.55) (xy 55.88 82.55)
		)
		(stroke
			(width 0)
			(type default)
		)
		(uuid "d193e117-20c3-46ed-bb5a-608d4d655260")
	)
	(wire
		(pts
			(xy 218.44 78.74) (xy 218.44 92.71)
		)
		(stroke
			(width 0)
			(type default)
		)
		(uuid "d96ce7fc-dbca-4266-b22e-24e502b7a466")
	)
	(wire
		(pts
			(xy 220.98 152.4) (xy 224.79 152.4)
		)
		(stroke
			(width 0)
			(type default)
		)
		(uuid "da1bfcde-c2bf-4c15-8c38-2e62888f9f0a")
	)
	(wire
		(pts
			(xy 220.98 76.2) (xy 220.98 90.17)
		)
		(stroke
			(width 0)
			(type default)
		)
		(uuid "e1def7ad-10f7-4993-b521-cddf298626af")
	)
	(wire
		(pts
			(xy 220.98 154.94) (xy 224.79 154.94)
		)
		(stroke
			(width 0)
			(type default)
		)
		(uuid "e717c5ee-651d-49a9-a93b-2aa8a2fa047d")
	)
	(wire
		(pts
			(xy 247.65 83.82) (xy 247.65 87.63)
		)
		(stroke
			(width 0)
			(type default)
		)
		(uuid "e7fc3b1b-eb99-4f31-8d9e-7cd951ee7292")
	)
	(wire
		(pts
			(xy 179.07 107.95) (xy 179.07 114.3)
		)
		(stroke
			(width 0)
			(type default)
		)
		(uuid "f0d6f75a-4dc3-42ea-94f7-5177883658a6")
	)
	(wire
		(pts
			(xy 151.13 64.77) (xy 156.21 64.77)
		)
		(stroke
			(width 0)
			(type default)
		)
		(uuid "f46e2f1b-b7f6-42fc-9233-0525d5feb31c")
	)
	(wire
		(pts
			(xy 29.21 96.52) (xy 33.02 96.52)
		)
		(stroke
			(width 0)
			(type default)
		)
		(uuid "f634f780-b4c6-497b-8d8b-9e68ea376a9c")
	)
	(label "PV+"
		(at 88.9 69.85 180)
		(effects
			(font
				(size 1.27 1.27)
			)
			(justify right bottom)
		)
		(uuid "0a0079cf-32a9-4bee-a1fb-e41928acc054")
	)
	(label "3V3_MCU"
		(at 220.98 140.97 180)
		(effects
			(font
				(size 1.27 1.27)
			)
			(justify right bottom)
		)
		(uuid "0eb1d08c-8c4b-4248-ae2b-c30f7868a39a")
	)
	(label "JTDO"
		(at 123.19 171.45 180)
		(effects
			(font
				(size 1.27 1.27)
			)
			(justify right bottom)
		)
		(uuid "104917a8-a159-42f9-a0c8-f5934aa337ad")
	)
	(label "TBat"
		(at 113.03 64.77 180)
		(effects
			(font
				(size 1.27 1.27)
			)
			(justify right bottom)
		)
		(uuid "146e5a93-66a0-4f6a-adb1-dccf7fbbcc6a")
	)
	(label "JTDO"
		(at 217.17 62.23 0)
		(effects
			(font
				(size 1.27 1.27)
			)
			(justify left bottom)
		)
		(uuid "25842ec6-575f-4742-8d28-3bf3a5d361c1")
	)
	(label "BAT+"
		(at 115.57 104.14 180)
		(effects
			(font
				(size 1.27 1.27)
			)
			(justify right bottom)
		)
		(uuid "28e43e41-d000-4881-a9bc-35b33091c005")
	)
	(label "JTDI"
		(at 123.19 168.91 180)
		(effects
			(font
				(size 1.27 1.27)
			)
			(justify right bottom)
		)
		(uuid "30dd8a3e-9c66-41da-9d00-b9d197ee15bb")
	)
	(label "CAN1_STB"
		(at 220.98 154.94 180)
		(effects
			(font
				(size 1.27 1.27)
			)
			(justify right bottom)
		)
		(uuid "34313072-ccb4-4de0-8e89-e8a74eae74f7")
	)
	(label "CAN1_RX"
		(at 220.98 152.4 180)
		(effects
			(font
				(size 1.27 1.27)
			)
			(justify right bottom)
		)
		(uuid "3bffd460-7c42-452a-a88f-2d823a6aa899")
	)
	(label "JTRST"
		(at 123.19 161.29 180)
		(effects
			(font
				(size 1.27 1.27)
			)
			(justify right bottom)
		)
		(uuid "422027a6-dc58-4062-9217-546bcf0a5b44")
	)
	(label "JTRST"
		(at 204.47 52.07 180)
		(effects
			(font
				(size 1.27 1.27)
			)
			(justify right bottom)
		)
		(uuid "454271c1-5466-4e78-b76b-93c1e6414ed0")
	)
	(label "CAN1_TX"
		(at 220.98 149.86 180)
		(effects
			(font
				(size 1.27 1.27)
			)
			(justify right bottom)
		)
		(uuid "4633207e-03ce-4596-a996-fb687830cc18")
	)
	(label "CAN1_SHDN"
		(at 220.98 157.48 180)
		(effects
			(font
				(size 1.27 1.27)
			)
			(justify right bottom)
		)
		(uuid "51cd19a8-8a04-4241-a07b-44c92fff40d7")
	)
	(label "JTMS"
		(at 200.66 57.15 0)
		(effects
			(font
				(size 1.27 1.27)
			)
			(justify left bottom)
		)
		(uuid "5de1978b-ff0b-4a21-84e9-1f1266ec34c4")
	)
	(label "JTMS"
		(at 123.19 163.83 180)
		(effects
			(font
				(size 1.27 1.27)
			)
			(justify right bottom)
		)
		(uuid "5f246307-ee96-49ca-a1d0-e4786341a2e1")
	)
	(label "CAN1_STB"
		(at 195.58 87.63 0)
		(effects
			(font
				(size 1.27 1.27)
			)
			(justify left bottom)
		)
		(uuid "6a6d5cc8-1e8e-4f4c-bd26-ef1100f29d37")
	)
	(label "PV+"
		(at 149.86 172.72 180)
		(effects
			(font
				(size 1.27 1.27)
			)
			(justify right bottom)
		)
		(uuid "7064f457-f5d1-4305-86ed-1595eae00efb")
	)
	(label "JTCK"
		(at 123.19 166.37 180)
		(effects
			(font
				(size 1.27 1.27)
			)
			(justify right bottom)
		)
		(uuid "79778d39-6a09-4750-a3de-d40b1bb9d4bd")
	)
	(label "CAN1_RX"
		(at 195.58 90.17 0)
		(effects
			(font
				(size 1.27 1.27)
			)
			(justify left bottom)
		)
		(uuid "96bb9c2e-e4d7-4171-98d8-5ad3a6366138")
	)
	(label "JTDI"
		(at 204.47 62.23 180)
		(effects
			(font
				(size 1.27 1.27)
			)
			(justify right bottom)
		)
		(uuid "9bd3f9c6-209e-46e0-8127-acfb92b11e4c")
	)
	(label "CAN1_TX"
		(at 195.58 92.71 0)
		(effects
			(font
				(size 1.27 1.27)
			)
			(justify left bottom)
		)
		(uuid "9ef5a804-3bbf-4350-b52e-fbaf41d65a2f")
	)
	(label "BAT-"
		(at 149.86 163.83 180)
		(effects
			(font
				(size 1.27 1.27)
			)
			(justify right bottom)
		)
		(uuid "a0d5f4ac-4246-4b0d-9cae-8f90ffa73963")
	)
	(label "VIN"
		(at 113.03 67.31 180)
		(effects
			(font
				(size 1.27 1.27)
			)
			(justify right bottom)
		)
		(uuid "a1367e4a-9a56-4443-9d5e-c4c8474b6a64")
	)
	(label "JTCK"
		(at 200.66 59.69 0)
		(effects
			(font
				(size 1.27 1.27)
			)
			(justify left bottom)
		)
		(uuid "a9478c4d-8d86-41ec-9784-077de97f1b66")
	)
	(label "BAT+"
		(at 114.3 59.69 180)
		(effects
			(font
				(size 1.27 1.27)
			)
			(justify right bottom)
		)
		(uuid "b1fadb03-c9dc-49d2-8938-f1fd9dbf6bc3")
	)
	(label "VIN"
		(at 149.86 186.69 180)
		(effects
			(font
				(size 1.27 1.27)
			)
			(justify right bottom)
		)
		(uuid "b51aa26f-f3c1-4a0d-bc9a-0850523c3e25")
	)
	(label "BAT-"
		(at 113.03 62.23 180)
		(effects
			(font
				(size 1.27 1.27)
			)
			(justify right bottom)
		)
		(uuid "d0d1baa7-2755-48a2-878d-9f57df43fd73")
	)
	(label "TBat"
		(at 149.86 161.29 180)
		(effects
			(font
				(size 1.27 1.27)
			)
			(justify right bottom)
		)
		(uuid "d7801689-72a4-4bf5-a868-c7fc2118391c")
	)
	(label "BAT+"
		(at 149.86 166.37 180)
		(effects
			(font
				(size 1.27 1.27)
			)
			(justify right bottom)
		)
		(uuid "dac01128-de63-4d37-b2ac-2a5ff440627f")
	)
	(label "3V3_MCU"
		(at 195.58 95.25 0)
		(effects
			(font
				(size 1.27 1.27)
			)
			(justify left bottom)
		)
		(uuid "e4464889-44be-48c9-981e-7e4da9c51a90")
	)
	(label "BAT+"
		(at 74.93 78.74 180)
		(effects
			(font
				(size 1.27 1.27)
			)
			(justify right bottom)
		)
		(uuid "e8c8c9ba-00cf-4e49-a91f-288def966bde")
	)
	(label "CAN1_SHDN"
		(at 195.58 85.09 0)
		(effects
			(font
				(size 1.27 1.27)
			)
			(justify left bottom)
		)
		(uuid "ed51e0ef-802b-41b0-9a85-0c7c93ddf575")
	)
	(global_label "3V3"
		(shape input)
		(at 99.06 173.99 270)
		(fields_autoplaced yes)
		(effects
			(font
				(size 1.27 1.27)
			)
			(justify right)
		)
		(uuid "9df0a8f3-058c-4ee6-9933-435bad328f3b")
		(property "Intersheetrefs" "${INTERSHEET_REFS}"
			(at 98.9806 179.9107 90)
			(effects
				(font
					(size 1.27 1.27)
				)
				(justify right)
				(hide yes)
			)
		)
	)
	(symbol
		(lib_id "power:GND")
		(at 149.86 189.23 0)
		(unit 1)
		(exclude_from_sim no)
		(in_bom yes)
		(on_board yes)
		(dnp no)
		(fields_autoplaced yes)
		(uuid "22d15d86-8908-47fe-9af1-0c062ea6434f")
		(property "Reference" "#PWR0103"
			(at 149.86 195.58 0)
			(effects
				(font
					(size 1.27 1.27)
				)
				(hide yes)
			)
		)
		(property "Value" "GND"
			(at 149.86 193.6734 0)
			(effects
				(font
					(size 1.27 1.27)
				)
			)
		)
		(property "Footprint" ""
			(at 149.86 189.23 0)
			(effects
				(font
					(size 1.27 1.27)
				)
				(hide yes)
			)
		)
		(property "Datasheet" ""
			(at 149.86 189.23 0)
			(effects
				(font
					(size 1.27 1.27)
				)
				(hide yes)
			)
		)
		(property "Description" ""
			(at 149.86 189.23 0)
			(effects
				(font
					(size 1.27 1.27)
				)
				(hide yes)
			)
		)
		(pin "1"
			(uuid "3b453018-ba4d-49a6-9508-c036783359a5")
		)
		(instances
			(project "sidloc"
				(path "/e63e39d7-6ac0-4ffd-8aa3-1841a4541b55"
					(reference "#PWR0103")
					(unit 1)
				)
			)
		)
	)
	(symbol
		(lib_id "power:GND")
		(at 201.93 134.62 0)
		(unit 1)
		(exclude_from_sim no)
		(in_bom yes)
		(on_board yes)
		(dnp no)
		(fields_autoplaced yes)
		(uuid "26ae6040-4f6f-4dbd-a5be-6913f38fc308")
		(property "Reference" "#PWR0104"
			(at 201.93 140.97 0)
			(effects
				(font
					(size 1.27 1.27)
				)
				(hide yes)
			)
		)
		(property "Value" "GND"
			(at 201.93 139.0634 0)
			(effects
				(font
					(size 1.27 1.27)
				)
			)
		)
		(property "Footprint" ""
			(at 201.93 134.62 0)
			(effects
				(font
					(size 1.27 1.27)
				)
				(hide yes)
			)
		)
		(property "Datasheet" ""
			(at 201.93 134.62 0)
			(effects
				(font
					(size 1.27 1.27)
				)
				(hide yes)
			)
		)
		(property "Description" ""
			(at 201.93 134.62 0)
			(effects
				(font
					(size 1.27 1.27)
				)
				(hide yes)
			)
		)
		(pin "1"
			(uuid "6d6f4a0d-a3d3-4b80-bc7d-c166c374c1f7")
		)
		(instances
			(project "sidloc"
				(path "/e63e39d7-6ac0-4ffd-8aa3-1841a4541b55"
					(reference "#PWR0104")
					(unit 1)
				)
			)
		)
	)
	(symbol
		(lib_id "power:GNDA")
		(at 85.09 190.5 0)
		(unit 1)
		(exclude_from_sim no)
		(in_bom yes)
		(on_board yes)
		(dnp no)
		(uuid "2c8a4995-dad9-4833-80f6-31ba7f2e0b3b")
		(property "Reference" "#PWR0120"
			(at 85.09 196.85 0)
			(effects
				(font
					(size 1.27 1.27)
				)
				(hide yes)
			)
		)
		(property "Value" "GNDA"
			(at 82.55 194.31 0)
			(effects
				(font
					(size 1.27 1.27)
				)
				(justify left)
			)
		)
		(property "Footprint" ""
			(at 85.09 190.5 0)
			(effects
				(font
					(size 1.27 1.27)
				)
				(hide yes)
			)
		)
		(property "Datasheet" ""
			(at 85.09 190.5 0)
			(effects
				(font
					(size 1.27 1.27)
				)
				(hide yes)
			)
		)
		(property "Description" ""
			(at 85.09 190.5 0)
			(effects
				(font
					(size 1.27 1.27)
				)
				(hide yes)
			)
		)
		(pin "1"
			(uuid "420ba7b2-684e-46cf-98fa-a33a4ceb7417")
		)
		(instances
			(project "sidloc"
				(path "/e63e39d7-6ac0-4ffd-8aa3-1841a4541b55"
					(reference "#PWR0120")
					(unit 1)
				)
			)
		)
	)
	(symbol
		(lib_id "power:PWR_FLAG")
		(at 99.06 173.99 0)
		(unit 1)
		(exclude_from_sim no)
		(in_bom yes)
		(on_board yes)
		(dnp no)
		(fields_autoplaced yes)
		(uuid "2e47cf04-6f87-4829-99fb-d1e189c144dd")
		(property "Reference" "#FLG0102"
			(at 99.06 172.085 0)
			(effects
				(font
					(size 1.27 1.27)
				)
				(hide yes)
			)
		)
		(property "Value" "PWR_FLAG"
			(at 99.06 170.4142 0)
			(effects
				(font
					(size 1.27 1.27)
				)
			)
		)
		(property "Footprint" ""
			(at 99.06 173.99 0)
			(effects
				(font
					(size 1.27 1.27)
				)
				(hide yes)
			)
		)
		(property "Datasheet" "~"
			(at 99.06 173.99 0)
			(effects
				(font
					(size 1.27 1.27)
				)
				(hide yes)
			)
		)
		(property "Description" ""
			(at 99.06 173.99 0)
			(effects
				(font
					(size 1.27 1.27)
				)
				(hide yes)
			)
		)
		(pin "1"
			(uuid "358223e4-0fa8-4c2f-84c6-bd4e64320bd4")
		)
		(instances
			(project "sidloc"
				(path "/e63e39d7-6ac0-4ffd-8aa3-1841a4541b55"
					(reference "#FLG0102")
					(unit 1)
				)
			)
		)
	)
	(symbol
		(lib_id "Connector_Generic:Conn_01x02")
		(at 154.94 172.72 0)
		(unit 1)
		(exclude_from_sim no)
		(in_bom yes)
		(on_board yes)
		(dnp no)
		(fields_autoplaced yes)
		(uuid "42f80769-b28a-4811-88ba-102526f477c8")
		(property "Reference" "J103"
			(at 156.972 173.1553 0)
			(effects
				(font
					(size 1.27 1.27)
				)
				(justify left)
			)
		)
		(property "Value" "Conn_01x02"
			(at 156.972 175.6922 0)
			(effects
				(font
					(size 1.27 1.27)
				)
				(justify left)
			)
		)
		(property "Footprint" ""
			(at 154.94 172.72 0)
			(effects
				(font
					(size 1.27 1.27)
				)
				(hide yes)
			)
		)
		(property "Datasheet" "~"
			(at 154.94 172.72 0)
			(effects
				(font
					(size 1.27 1.27)
				)
				(hide yes)
			)
		)
		(property "Description" ""
			(at 154.94 172.72 0)
			(effects
				(font
					(size 1.27 1.27)
				)
				(hide yes)
			)
		)
		(pin "1"
			(uuid "084a05db-9aca-4f21-ae3c-8653ee17fa16")
		)
		(pin "2"
			(uuid "956bbd2e-5985-4681-959e-f727253e176b")
		)
		(instances
			(project "sidloc"
				(path "/e63e39d7-6ac0-4ffd-8aa3-1841a4541b55"
					(reference "J103")
					(unit 1)
				)
			)
		)
	)
	(symbol
		(lib_id "power:PWR_FLAG")
		(at 92.71 173.99 0)
		(unit 1)
		(exclude_from_sim no)
		(in_bom yes)
		(on_board yes)
		(dnp no)
		(fields_autoplaced yes)
		(uuid "525dd86a-d4e8-4a60-8c41-568ee9eee9e7")
		(property "Reference" "#FLG0101"
			(at 92.71 172.085 0)
			(effects
				(font
					(size 1.27 1.27)
				)
				(hide yes)
			)
		)
		(property "Value" "~"
			(at 92.2762 170.8151 90)
			(effects
				(font
					(size 1.27 1.27)
				)
				(justify left)
			)
		)
		(property "Footprint" ""
			(at 92.71 173.99 0)
			(effects
				(font
					(size 1.27 1.27)
				)
				(hide yes)
			)
		)
		(property "Datasheet" "~"
			(at 92.71 173.99 0)
			(effects
				(font
					(size 1.27 1.27)
				)
				(hide yes)
			)
		)
		(property "Description" ""
			(at 92.71 173.99 0)
			(effects
				(font
					(size 1.27 1.27)
				)
				(hide yes)
			)
		)
		(pin "1"
			(uuid "2bea8ece-7633-4b06-81ee-f5ef507c124d")
		)
		(instances
			(project "sidloc"
				(path "/e63e39d7-6ac0-4ffd-8aa3-1841a4541b55"
					(reference "#FLG0101")
					(unit 1)
				)
			)
		)
	)
	(symbol
		(lib_id "power:PWR_FLAG")
		(at 86.36 173.99 0)
		(unit 1)
		(exclude_from_sim no)
		(in_bom yes)
		(on_board yes)
		(dnp no)
		(fields_autoplaced yes)
		(uuid "5a0c5fa1-9555-4751-aab7-9367408a141b")
		(property "Reference" "#FLG0104"
			(at 86.36 172.085 0)
			(effects
				(font
					(size 1.27 1.27)
				)
				(hide yes)
			)
		)
		(property "Value" "~"
			(at 85.9262 170.8151 90)
			(effects
				(font
					(size 1.27 1.27)
				)
				(justify left)
			)
		)
		(property "Footprint" ""
			(at 86.36 173.99 0)
			(effects
				(font
					(size 1.27 1.27)
				)
				(hide yes)
			)
		)
		(property "Datasheet" "~"
			(at 86.36 173.99 0)
			(effects
				(font
					(size 1.27 1.27)
				)
				(hide yes)
			)
		)
		(property "Description" ""
			(at 86.36 173.99 0)
			(effects
				(font
					(size 1.27 1.27)
				)
				(hide yes)
			)
		)
		(pin "1"
			(uuid "ca4b3f64-59d8-4647-bacf-536e23d51baf")
		)
		(instances
			(project "sidloc"
				(path "/e63e39d7-6ac0-4ffd-8aa3-1841a4541b55"
					(reference "#FLG0104")
					(unit 1)
				)
			)
		)
	)
	(symbol
		(lib_id "power:GND")
		(at 149.86 175.26 0)
		(unit 1)
		(exclude_from_sim no)
		(in_bom yes)
		(on_board yes)
		(dnp no)
		(fields_autoplaced yes)
		(uuid "5e67521a-7cb1-4678-8e7a-dc136b542602")
		(property "Reference" "#PWR0102"
			(at 149.86 181.61 0)
			(effects
				(font
					(size 1.27 1.27)
				)
				(hide yes)
			)
		)
		(property "Value" "GND"
			(at 149.86 179.7034 0)
			(effects
				(font
					(size 1.27 1.27)
				)
			)
		)
		(property "Footprint" ""
			(at 149.86 175.26 0)
			(effects
				(font
					(size 1.27 1.27)
				)
				(hide yes)
			)
		)
		(property "Datasheet" ""
			(at 149.86 175.26 0)
			(effects
				(font
					(size 1.27 1.27)
				)
				(hide yes)
			)
		)
		(property "Description" ""
			(at 149.86 175.26 0)
			(effects
				(font
					(size 1.27 1.27)
				)
				(hide yes)
			)
		)
		(pin "1"
			(uuid "d5bd95ac-70fb-45b8-adaf-10f0d139e3fb")
		)
		(instances
			(project "sidloc"
				(path "/e63e39d7-6ac0-4ffd-8aa3-1841a4541b55"
					(reference "#PWR0102")
					(unit 1)
				)
			)
		)
	)
	(symbol
		(lib_id "Connector_Generic:Conn_01x02")
		(at 154.94 186.69 0)
		(unit 1)
		(exclude_from_sim no)
		(in_bom yes)
		(on_board yes)
		(dnp no)
		(fields_autoplaced yes)
		(uuid "6f7333b6-005a-4540-809e-a2a1ba48bcbf")
		(property "Reference" "J104"
			(at 156.972 187.1253 0)
			(effects
				(font
					(size 1.27 1.27)
				)
				(justify left)
			)
		)
		(property "Value" "Conn_01x02"
			(at 156.972 189.6622 0)
			(effects
				(font
					(size 1.27 1.27)
				)
				(justify left)
			)
		)
		(property "Footprint" ""
			(at 154.94 186.69 0)
			(effects
				(font
					(size 1.27 1.27)
				)
				(hide yes)
			)
		)
		(property "Datasheet" "~"
			(at 154.94 186.69 0)
			(effects
				(font
					(size 1.27 1.27)
				)
				(hide yes)
			)
		)
		(property "Description" ""
			(at 154.94 186.69 0)
			(effects
				(font
					(size 1.27 1.27)
				)
				(hide yes)
			)
		)
		(pin "1"
			(uuid "9c5841d7-2587-4e27-82ad-f0d73a8ce78f")
		)
		(pin "2"
			(uuid "c9c898ca-033f-4eb2-bddc-aad9848a9bc7")
		)
		(instances
			(project "sidloc"
				(path "/e63e39d7-6ac0-4ffd-8aa3-1841a4541b55"
					(reference "J104")
					(unit 1)
				)
			)
		)
	)
	(symbol
		(lib_id "Connector_Generic:Conn_01x03")
		(at 154.94 163.83 0)
		(unit 1)
		(exclude_from_sim no)
		(in_bom yes)
		(on_board yes)
		(dnp no)
		(fields_autoplaced yes)
		(uuid "73bfb572-8a06-469a-97e1-92246a601e94")
		(property "Reference" "J102"
			(at 156.972 162.9953 0)
			(effects
				(font
					(size 1.27 1.27)
				)
				(justify left)
			)
		)
		(property "Value" "Conn_01x03"
			(at 156.972 165.5322 0)
			(effects
				(font
					(size 1.27 1.27)
				)
				(justify left)
			)
		)
		(property "Footprint" ""
			(at 154.94 163.83 0)
			(effects
				(font
					(size 1.27 1.27)
				)
				(hide yes)
			)
		)
		(property "Datasheet" "~"
			(at 154.94 163.83 0)
			(effects
				(font
					(size 1.27 1.27)
				)
				(hide yes)
			)
		)
		(property "Description" ""
			(at 154.94 163.83 0)
			(effects
				(font
					(size 1.27 1.27)
				)
				(hide yes)
			)
		)
		(pin "1"
			(uuid "50926247-11cd-44e2-aa43-feeff2111293")
		)
		(pin "2"
			(uuid "f3257ca0-c5cc-4515-9412-466b4377404b")
		)
		(pin "3"
			(uuid "8fa417ea-5447-4df9-9d80-f1521bc1d82f")
		)
		(instances
			(project "sidloc"
				(path "/e63e39d7-6ac0-4ffd-8aa3-1841a4541b55"
					(reference "J102")
					(unit 1)
				)
			)
		)
	)
	(symbol
		(lib_id "power:GNDA")
		(at 86.36 173.99 0)
		(unit 1)
		(exclude_from_sim no)
		(in_bom yes)
		(on_board yes)
		(dnp no)
		(uuid "95356322-57d0-4ba2-bb53-4ca367207abc")
		(property "Reference" "#PWR0119"
			(at 86.36 180.34 0)
			(effects
				(font
					(size 1.27 1.27)
				)
				(hide yes)
			)
		)
		(property "Value" "GNDA"
			(at 83.82 177.8 0)
			(effects
				(font
					(size 1.27 1.27)
				)
				(justify left)
			)
		)
		(property "Footprint" ""
			(at 86.36 173.99 0)
			(effects
				(font
					(size 1.27 1.27)
				)
				(hide yes)
			)
		)
		(property "Datasheet" ""
			(at 86.36 173.99 0)
			(effects
				(font
					(size 1.27 1.27)
				)
				(hide yes)
			)
		)
		(property "Description" ""
			(at 86.36 173.99 0)
			(effects
				(font
					(size 1.27 1.27)
				)
				(hide yes)
			)
		)
		(pin "1"
			(uuid "e92e669b-90f5-4d8a-b0a8-ed9c89eef131")
		)
		(instances
			(project "sidloc"
				(path "/e63e39d7-6ac0-4ffd-8aa3-1841a4541b55"
					(reference "#PWR0119")
					(unit 1)
				)
			)
		)
	)
	(symbol
		(lib_id "power:GND")
		(at 123.19 173.99 0)
		(unit 1)
		(exclude_from_sim no)
		(in_bom yes)
		(on_board yes)
		(dnp no)
		(fields_autoplaced yes)
		(uuid "9b3bb1a0-06c4-4a43-b260-6c8ea90205f3")
		(property "Reference" "#PWR0101"
			(at 123.19 180.34 0)
			(effects
				(font
					(size 1.27 1.27)
				)
				(hide yes)
			)
		)
		(property "Value" "GND"
			(at 123.19 178.4334 0)
			(effects
				(font
					(size 1.27 1.27)
				)
			)
		)
		(property "Footprint" ""
			(at 123.19 173.99 0)
			(effects
				(font
					(size 1.27 1.27)
				)
				(hide yes)
			)
		)
		(property "Datasheet" ""
			(at 123.19 173.99 0)
			(effects
				(font
					(size 1.27 1.27)
				)
				(hide yes)
			)
		)
		(property "Description" ""
			(at 123.19 173.99 0)
			(effects
				(font
					(size 1.27 1.27)
				)
				(hide yes)
			)
		)
		(pin "1"
			(uuid "59e90474-7331-4f70-89f9-67c318cca069")
		)
		(instances
			(project "sidloc"
				(path "/e63e39d7-6ac0-4ffd-8aa3-1841a4541b55"
					(reference "#PWR0101")
					(unit 1)
				)
			)
		)
	)
	(symbol
		(lib_id "Connector_Generic:Conn_01x06")
		(at 128.27 166.37 0)
		(unit 1)
		(exclude_from_sim no)
		(in_bom yes)
		(on_board yes)
		(dnp no)
		(fields_autoplaced yes)
		(uuid "9cc92e23-1563-4765-8fee-6e1782280c04")
		(property "Reference" "J101"
			(at 130.302 166.8053 0)
			(effects
				(font
					(size 1.27 1.27)
				)
				(justify left)
			)
		)
		(property "Value" "Conn_01x06"
			(at 130.302 169.3422 0)
			(effects
				(font
					(size 1.27 1.27)
				)
				(justify left)
			)
		)
		(property "Footprint" ""
			(at 128.27 166.37 0)
			(effects
				(font
					(size 1.27 1.27)
				)
				(hide yes)
			)
		)
		(property "Datasheet" "~"
			(at 128.27 166.37 0)
			(effects
				(font
					(size 1.27 1.27)
				)
				(hide yes)
			)
		)
		(property "Description" ""
			(at 128.27 166.37 0)
			(effects
				(font
					(size 1.27 1.27)
				)
				(hide yes)
			)
		)
		(pin "1"
			(uuid "68525067-bf10-481f-8e22-210e788ee174")
		)
		(pin "2"
			(uuid "679e293a-ff66-4551-b49b-faefff104775")
		)
		(pin "3"
			(uuid "654b633c-81e1-4459-a1a4-505c06f16f77")
		)
		(pin "4"
			(uuid "140d003f-1313-4013-b644-98048d06d6bf")
		)
		(pin "5"
			(uuid "286b47c7-87de-4d3b-975a-1cd4c5f4b3b2")
		)
		(pin "6"
			(uuid "88bde738-40c5-41ed-9bd4-d1d8b0a572ef")
		)
		(instances
			(project "sidloc"
				(path "/e63e39d7-6ac0-4ffd-8aa3-1841a4541b55"
					(reference "J101")
					(unit 1)
				)
			)
		)
	)
	(symbol
		(lib_id "power:GND")
		(at 92.71 173.99 0)
		(unit 1)
		(exclude_from_sim no)
		(in_bom yes)
		(on_board yes)
		(dnp no)
		(fields_autoplaced yes)
		(uuid "a75da3e3-781d-43da-bc86-af1d438cba5b")
		(property "Reference" "#PWR0105"
			(at 92.71 180.34 0)
			(effects
				(font
					(size 1.27 1.27)
				)
				(hide yes)
			)
		)
		(property "Value" "GND"
			(at 92.71 178.4334 0)
			(effects
				(font
					(size 1.27 1.27)
				)
			)
		)
		(property "Footprint" ""
			(at 92.71 173.99 0)
			(effects
				(font
					(size 1.27 1.27)
				)
				(hide yes)
			)
		)
		(property "Datasheet" ""
			(at 92.71 173.99 0)
			(effects
				(font
					(size 1.27 1.27)
				)
				(hide yes)
			)
		)
		(property "Description" ""
			(at 92.71 173.99 0)
			(effects
				(font
					(size 1.27 1.27)
				)
				(hide yes)
			)
		)
		(pin "1"
			(uuid "a0742145-c4ae-4e5a-ab60-f7b76f2658d3")
		)
		(instances
			(project "sidloc"
				(path "/e63e39d7-6ac0-4ffd-8aa3-1841a4541b55"
					(reference "#PWR0105")
					(unit 1)
				)
			)
		)
	)
	(symbol
		(lib_id "Connector:Conn_Coaxial")
		(at 201.93 127 0)
		(unit 1)
		(exclude_from_sim no)
		(in_bom yes)
		(on_board yes)
		(dnp no)
		(uuid "b83666b6-72c9-402d-8513-af40c195284c")
		(property "Reference" "J105"
			(at 204.47 126.4585 0)
			(effects
				(font
					(size 1.27 1.27)
				)
				(justify left)
			)
		)
		(property "Value" "Conn_Coaxial"
			(at 204.47 129.54 0)
			(effects
				(font
					(size 1.27 1.27)
				)
				(justify left)
			)
		)
		(property "Footprint" ""
			(at 201.93 127 0)
			(effects
				(font
					(size 1.27 1.27)
				)
				(hide yes)
			)
		)
		(property "Datasheet" " ~"
			(at 201.93 127 0)
			(effects
				(font
					(size 1.27 1.27)
				)
				(hide yes)
			)
		)
		(property "Description" ""
			(at 201.93 127 0)
			(effects
				(font
					(size 1.27 1.27)
				)
				(hide yes)
			)
		)
		(pin "1"
			(uuid "fd0c81db-8c3f-4908-bd34-061e61b5fd9b")
		)
		(pin "2"
			(uuid "fef0f441-0528-4495-a08a-6190a9db8ee7")
		)
		(instances
			(project "sidloc"
				(path "/e63e39d7-6ac0-4ffd-8aa3-1841a4541b55"
					(reference "J105")
					(unit 1)
				)
			)
		)
	)
	(symbol
		(lib_id "power:GND")
		(at 97.79 190.5 0)
		(unit 1)
		(exclude_from_sim no)
		(in_bom yes)
		(on_board yes)
		(dnp no)
		(fields_autoplaced yes)
		(uuid "d3b2508d-205d-444b-9076-1e2744542cde")
		(property "Reference" "#PWR0121"
			(at 97.79 196.85 0)
			(effects
				(font
					(size 1.27 1.27)
				)
				(hide yes)
			)
		)
		(property "Value" "GND"
			(at 97.79 194.9434 0)
			(effects
				(font
					(size 1.27 1.27)
				)
			)
		)
		(property "Footprint" ""
			(at 97.79 190.5 0)
			(effects
				(font
					(size 1.27 1.27)
				)
				(hide yes)
			)
		)
		(property "Datasheet" ""
			(at 97.79 190.5 0)
			(effects
				(font
					(size 1.27 1.27)
				)
				(hide yes)
			)
		)
		(property "Description" ""
			(at 97.79 190.5 0)
			(effects
				(font
					(size 1.27 1.27)
				)
				(hide yes)
			)
		)
		(pin "1"
			(uuid "80bb8ee4-08e9-4c40-aa12-d1f431297fb0")
		)
		(instances
			(project "sidloc"
				(path "/e63e39d7-6ac0-4ffd-8aa3-1841a4541b55"
					(reference "#PWR0121")
					(unit 1)
				)
			)
		)
	)
	(symbol
		(lib_id "Device:NetTie_2")
		(at 91.44 187.96 0)
		(unit 1)
		(exclude_from_sim no)
		(in_bom yes)
		(on_board yes)
		(dnp no)
		(fields_autoplaced yes)
		(uuid "fb8291dd-d4bc-4f4a-a2a1-0e0c0b6db002")
		(property "Reference" "NT101"
			(at 91.44 182.88 0)
			(effects
				(font
					(size 1.27 1.27)
				)
			)
		)
		(property "Value" "NetTie_2"
			(at 91.44 185.42 0)
			(effects
				(font
					(size 1.27 1.27)
				)
			)
		)
		(property "Footprint" ""
			(at 91.44 187.96 0)
			(effects
				(font
					(size 1.27 1.27)
				)
				(hide yes)
			)
		)
		(property "Datasheet" "~"
			(at 91.44 187.96 0)
			(effects
				(font
					(size 1.27 1.27)
				)
				(hide yes)
			)
		)
		(property "Description" ""
			(at 91.44 187.96 0)
			(effects
				(font
					(size 1.27 1.27)
				)
				(hide yes)
			)
		)
		(pin "1"
			(uuid "244ffd67-3caf-4ab0-90e0-5fe031251e37")
		)
		(pin "2"
			(uuid "45036d0e-81c5-4007-b8bd-99d39c243f79")
		)
		(instances
			(project "sidloc"
				(path "/e63e39d7-6ac0-4ffd-8aa3-1841a4541b55"
					(reference "NT101")
					(unit 1)
				)
			)
		)
	)
	(sheet
		(at 35.56 80.01)
		(size 16.51 7.62)
		(fields_autoplaced yes)
		(stroke
			(width 0.1524)
			(type solid)
		)
		(fill
			(color 0 0 0 0.0000)
		)
		(uuid "480e9ef9-552f-4dc1-bb0e-938657adfd37")
		(property "Sheetname" "Trgger Voltage"
			(at 35.56 79.2984 0)
			(effects
				(font
					(size 1.27 1.27)
				)
				(justify left bottom)
			)
		)
		(property "Sheetfile" "trigger_voltage.kicad_sch"
			(at 35.56 87.5796 0)
			(effects
				(font
					(size 1.27 1.27)
				)
				(justify left top)
				(hide yes)
			)
		)
		(pin "Out" tri_state
			(at 52.07 82.55 0)
			(effects
				(font
					(size 1.27 1.27)
				)
				(justify right)
			)
			(uuid "2c652f22-b3b7-4a5c-94b2-ca9132e6dd95")
		)
		(pin "Trigger-" input
			(at 35.56 82.55 180)
			(effects
				(font
					(size 1.27 1.27)
				)
				(justify left)
			)
			(uuid "38048758-ba1e-4f98-a19e-935b00d0cae8")
		)
		(pin "Trigger+" input
			(at 35.56 85.09 180)
			(effects
				(font
					(size 1.27 1.27)
				)
				(justify left)
			)
			(uuid "7cf94728-9669-4901-9f04-c3c7b741e7c6")
		)
		(instances
			(project "sidloc"
				(path "/e63e39d7-6ac0-4ffd-8aa3-1841a4541b55"
					(page "11")
				)
			)
		)
	)
	(sheet
		(at 81.28 76.2)
		(size 24.13 22.86)
		(fields_autoplaced yes)
		(stroke
			(width 0.1524)
			(type solid)
		)
		(fill
			(color 0 0 0 0.0000)
		)
		(uuid "4aa9d887-b1a0-4330-9019-2ea8f8b40048")
		(property "Sheetname" "Activator"
			(at 81.28 75.4884 0)
			(effects
				(font
					(size 1.27 1.27)
				)
				(justify left bottom)
			)
		)
		(property "Sheetfile" "activator.kicad_sch"
			(at 81.28 99.0096 0)
			(effects
				(font
					(size 1.27 1.27)
				)
				(justify left top)
			)
		)
		(pin "EN_Out" output
			(at 105.41 78.74 0)
			(effects
				(font
					(size 1.27 1.27)
				)
				(justify right)
			)
			(uuid "67c3aedd-0481-4a88-993e-1141409bb63b")
		)
		(pin "~{KFC1}" input
			(at 81.28 92.71 180)
			(effects
				(font
					(size 1.27 1.27)
				)
				(justify left)
			)
			(uuid "d86c76c8-a343-4c9c-9469-9bce67a20c75")
		)
		(pin "VBat_In" input
			(at 81.28 78.74 180)
			(effects
				(font
					(size 1.27 1.27)
				)
				(justify left)
			)
			(uuid "30397cc7-4ac0-4abe-8987-23e2be611f09")
		)
		(pin "~{RBF_PIN1}" input
			(at 81.28 86.36 180)
			(effects
				(font
					(size 1.27 1.27)
				)
				(justify left)
			)
			(uuid "88a27493-1341-4200-bde9-b2a49533ded4")
		)
		(pin "~{Activate}" input
			(at 81.28 82.55 180)
			(effects
				(font
					(size 1.27 1.27)
				)
				(justify left)
			)
			(uuid "c7886642-2851-4a98-9d6b-ff60d658fb90")
		)
		(pin "BAT_SW" output
			(at 105.41 95.25 0)
			(effects
				(font
					(size 1.27 1.27)
				)
				(justify right)
			)
			(uuid "01f63a6d-f0c7-4130-af83-e68da5a4ac9d")
		)
		(instances
			(project "sidloc"
				(path "/e63e39d7-6ac0-4ffd-8aa3-1841a4541b55"
					(page "10")
				)
			)
		)
	)
	(sheet
		(at 33.02 93.98)
		(size 19.05 10.16)
		(fields_autoplaced yes)
		(stroke
			(width 0.1524)
			(type solid)
		)
		(fill
			(color 0 0 0 0.0000)
		)
		(uuid "5b37d4b6-c597-4ccd-a3b4-4dcc44465f5e")
		(property "Sheetname" "Triger Sense Switch"
			(at 33.02 93.2684 0)
			(effects
				(font
					(size 1.27 1.27)
				)
				(justify left bottom)
			)
		)
		(property "Sheetfile" "trigger_sense_switch.kicad_sch"
			(at 33.02 104.0896 0)
			(effects
				(font
					(size 1.27 1.27)
				)
				(justify left top)
				(hide yes)
			)
		)
		(pin "Out" tri_state
			(at 52.07 99.06 0)
			(effects
				(font
					(size 1.27 1.27)
				)
				(justify right)
			)
			(uuid "c3cefa70-8073-474e-b849-32e1a48eeda0")
		)
		(pin "KillSwitch-" input
			(at 33.02 99.06 180)
			(effects
				(font
					(size 1.27 1.27)
				)
				(justify left)
			)
			(uuid "6bc98a50-773a-494a-bb8e-30feccc92fbb")
		)
		(pin "KillSwitch+" input
			(at 33.02 101.6 180)
			(effects
				(font
					(size 1.27 1.27)
				)
				(justify left)
			)
			(uuid "b22c0f6f-46d0-49c2-b4e5-fba5aa2a215a")
		)
		(pin "V_IN" input
			(at 33.02 96.52 180)
			(effects
				(font
					(size 1.27 1.27)
				)
				(justify left)
			)
			(uuid "ccab5097-1336-4a67-8083-76bd5b3247f0")
		)
		(instances
			(project "sidloc"
				(path "/e63e39d7-6ac0-4ffd-8aa3-1841a4541b55"
					(page "12")
				)
			)
		)
	)
	(sheet
		(at 92.71 48.26)
		(size 12.7 24.13)
		(stroke
			(width 0.1524)
			(type solid)
		)
		(fill
			(color 0 0 0 0.0000)
		)
		(uuid "6b354ff5-0b65-492c-8665-55bb5ce5ef57")
		(property "Sheetname" "PV"
			(at 92.71 47.5484 0)
			(effects
				(font
					(size 1.27 1.27)
				)
				(justify left bottom)
			)
		)
		(property "Sheetfile" "pv.kicad_sch"
			(at 92.71 43.18 0)
			(effects
				(font
					(size 1.27 1.27)
				)
				(justify left top)
			)
		)
		(pin "PV+" input
			(at 92.71 69.85 180)
			(effects
				(font
					(size 1.27 1.27)
				)
				(justify left)
			)
			(uuid "c8177731-2a31-4518-bb2d-b94975c52a86")
		)
		(pin "BAT+" input
			(at 105.41 59.69 0)
			(effects
				(font
					(size 1.27 1.27)
				)
				(justify right)
			)
			(uuid "56fc7df3-6435-4e3d-9cd2-ae4377b04e27")
		)
		(instances
			(project "sidloc"
				(path "/e63e39d7-6ac0-4ffd-8aa3-1841a4541b55"
					(page "5")
				)
			)
		)
	)
	(sheet
		(at 224.79 87.63)
		(size 39.37 34.29)
		(stroke
			(width 0.1524)
			(type solid)
		)
		(fill
			(color 0 0 0 0.0000)
		)
		(uuid "79c89831-4746-4b3d-ad67-9c7b9b0fae72")
		(property "Sheetname" "Transceiver"
			(at 224.79 127.6854 0)
			(effects
				(font
					(size 1.27 1.27)
				)
				(justify left bottom)
			)
		)
		(property "Sheetfile" "transceiver.kicad_sch"
			(at 224.79 123.19 0)
			(effects
				(font
					(size 1.27 1.27)
				)
				(justify left top)
			)
		)
		(pin "TXDATAP" input
			(at 245.11 87.63 90)
			(effects
				(font
					(size 1.27 1.27)
				)
				(justify right)
			)
			(uuid "4c1091d4-5196-4478-a9f3-04a4aae0bbdc")
		)
		(pin "TXDATAN" input
			(at 247.65 87.63 90)
			(effects
				(font
					(size 1.27 1.27)
				)
				(justify right)
			)
			(uuid "114958e0-53e8-4648-9520-96ade9fb5883")
		)
		(pin "TXCLOCKN" input
			(at 240.03 87.63 90)
			(effects
				(font
					(size 1.27 1.27)
				)
				(justify right)
			)
			(uuid "50ba28ac-4294-4a4a-ac7d-52f89cb143e4")
		)
		(pin "TXCLOCKP" input
			(at 242.57 87.63 90)
			(effects
				(font
					(size 1.27 1.27)
				)
				(justify right)
			)
			(uuid "10f03a33-883a-4f56-a1af-4eb0b057a803")
		)
		(pin "RXCLOCKP" output
			(at 255.27 87.63 90)
			(effects
				(font
					(size 1.27 1.27)
				)
				(justify right)
			)
			(uuid "560fd130-6735-409f-98a4-235acb8af8b7")
		)
		(pin "RXCLOCKN" output
			(at 252.73 87.63 90)
			(effects
				(font
					(size 1.27 1.27)
				)
				(justify right)
			)
			(uuid "9cf3e333-4320-412d-aeff-addd8b363998")
		)
		(pin "RXDATAP" output
			(at 257.81 87.63 90)
			(effects
				(font
					(size 1.27 1.27)
				)
				(justify right)
			)
			(uuid "d929764f-8550-4413-a4fe-8d708a5ca351")
		)
		(pin "RXDATAN" output
			(at 260.35 87.63 90)
			(effects
				(font
					(size 1.27 1.27)
				)
				(justify right)
			)
			(uuid "d243c7aa-67b9-4fd0-b9af-ebb1739957db")
		)
		(pin "SPI_MOSI" input
			(at 224.79 95.25 180)
			(effects
				(font
					(size 1.27 1.27)
				)
				(justify left)
			)
			(uuid "f03e5428-ca3d-4736-9610-36ccdcd7e251")
		)
		(pin "SPI_CLK" input
			(at 224.79 90.17 180)
			(effects
				(font
					(size 1.27 1.27)
				)
				(justify left)
			)
			(uuid "cf7c3643-08a1-4f6f-9626-2d0bdcc0fef7")
		)
		(pin "SPI_CS" input
			(at 224.79 97.79 180)
			(effects
				(font
					(size 1.27 1.27)
				)
				(justify left)
			)
			(uuid "c1d51f25-0ff6-4322-90d8-14ad1e9a5228")
		)
		(pin "SPI_MISO" output
			(at 224.79 92.71 180)
			(effects
				(font
					(size 1.27 1.27)
				)
				(justify left)
			)
			(uuid "1dcfbe9d-56d2-4af8-bcd9-3eb1c8e8dcaf")
		)
		(pin "IRQ" output
			(at 224.79 101.6 180)
			(effects
				(font
					(size 1.27 1.27)
				)
				(justify left)
			)
			(uuid "c51a9299-7533-4a60-9258-c4ca2fcec197")
		)
		(pin "RST" input
			(at 224.79 104.14 180)
			(effects
				(font
					(size 1.27 1.27)
				)
				(justify left)
			)
			(uuid "bb1f8165-4f60-42a7-903e-a36dc0684c9c")
		)
		(pin "RFIO" bidirectional
			(at 224.79 119.38 180)
			(effects
				(font
					(size 1.27 1.27)
				)
				(justify left)
			)
			(uuid "dc493a39-144e-4f16-8096-bd65618184b1")
		)
		(pin "FEA09" output
			(at 224.79 113.03 180)
			(effects
				(font
					(size 1.27 1.27)
				)
				(justify left)
			)
			(uuid "014a3a4e-387e-4cb9-83db-0c73a9492007")
		)
		(pin "FEB09" output
			(at 224.79 115.57 180)
			(effects
				(font
					(size 1.27 1.27)
				)
				(justify left)
			)
			(uuid "581205ad-5afc-439a-b305-56ddc8e51a72")
		)
		(pin "CLKO" output
			(at 264.16 101.6 0)
			(effects
				(font
					(size 1.27 1.27)
				)
				(justify right)
			)
			(uuid "e645edf1-66ee-4430-b697-9ccdcdae71f7")
		)
		(pin "EN" input
			(at 224.79 106.68 180)
			(effects
				(font
					(size 1.27 1.27)
				)
				(justify left)
			)
			(uuid "2c34ef9f-cf99-49f9-aa38-9659265ef66c")
		)
		(pin "FAULT" output
			(at 224.79 109.22 180)
			(effects
				(font
					(size 1.27 1.27)
				)
				(justify left)
			)
			(uuid "8e7c3218-2036-4cf5-9472-856349a4223f")
		)
		(instances
			(project "sidloc"
				(path "/e63e39d7-6ac0-4ffd-8aa3-1841a4541b55"
					(page "7")
				)
			)
		)
	)
	(sheet
		(at 224.79 138.43)
		(size 16.51 21.59)
		(fields_autoplaced yes)
		(stroke
			(width 0.1524)
			(type solid)
		)
		(fill
			(color 0 0 0 0.0000)
		)
		(uuid "8a9ae88f-d67d-434b-a765-c0ccc46c4a28")
		(property "Sheetname" "CAN"
			(at 224.79 137.7184 0)
			(effects
				(font
					(size 1.27 1.27)
				)
				(justify left bottom)
			)
		)
		(property "Sheetfile" "can.kicad_sch"
			(at 224.79 160.6046 0)
			(effects
				(font
					(size 1.27 1.27)
				)
				(justify left top)
			)
		)
		(pin "CAN1_TX" input
			(at 224.79 149.86 180)
			(effects
				(font
					(size 1.27 1.27)
				)
				(justify left)
			)
			(uuid "fa143bbf-0401-461b-93a0-98cdf9e3389d")
		)
		(pin "CAN1_RX" output
			(at 224.79 152.4 180)
			(effects
				(font
					(size 1.27 1.27)
				)
				(justify left)
			)
			(uuid "84f501fa-d2cf-4118-91cd-123e875c4e15")
		)
		(pin "CAN1_H" output
			(at 241.3 143.51 0)
			(effects
				(font
					(size 1.27 1.27)
				)
				(justify right)
			)
			(uuid "13794d04-6678-45ec-8f24-88827ae49fd7")
		)
		(pin "CAN1_L" output
			(at 241.3 140.97 0)
			(effects
				(font
					(size 1.27 1.27)
				)
				(justify right)
			)
			(uuid "d3774a3f-aecc-42c8-96a4-811db8512ead")
		)
		(pin "CAN1_STB" input
			(at 224.79 154.94 180)
			(effects
				(font
					(size 1.27 1.27)
				)
				(justify left)
			)
			(uuid "b839ba68-a171-40cb-a3af-fbb3322d2994")
		)
		(pin "CAN1_SHDN" input
			(at 224.79 157.48 180)
			(effects
				(font
					(size 1.27 1.27)
				)
				(justify left)
			)
			(uuid "cd0c40b4-967a-433f-a568-91be4fd0ba51")
		)
		(pin "VIN" input
			(at 224.79 140.97 180)
			(effects
				(font
					(size 1.27 1.27)
				)
				(justify left)
			)
			(uuid "7f52c489-6407-4fd5-938d-068e62153d03")
		)
		(instances
			(project "sidloc"
				(path "/e63e39d7-6ac0-4ffd-8aa3-1841a4541b55"
					(page "3")
				)
			)
		)
	)
	(sheet
		(at 170.18 114.3)
		(size 25.4 17.78)
		(stroke
			(width 0.1524)
			(type solid)
		)
		(fill
			(color 0 0 0 0.0000)
		)
		(uuid "8c0ec0f6-056a-4768-95d3-47657599318d")
		(property "Sheetname" "RFFE"
			(at 170.18 137.16 0)
			(effects
				(font
					(size 1.27 1.27)
				)
				(justify left bottom)
			)
		)
		(property "Sheetfile" "rffe.kicad_sch"
			(at 170.18 132.6646 0)
			(effects
				(font
					(size 1.27 1.27)
				)
				(justify left top)
			)
		)
		(pin "EN" input
			(at 173.99 114.3 90)
			(effects
				(font
					(size 1.27 1.27)
				)
				(justify right)
			)
			(uuid "ce6d3341-eec7-4439-ad1d-2367572a6841")
		)
		(pin "TX_EN" input
			(at 176.53 114.3 90)
			(effects
				(font
					(size 1.27 1.27)
				)
				(justify right)
			)
			(uuid "a43f783f-3b1d-460c-a13c-747762929c08")
		)
		(pin "RFIO" bidirectional
			(at 195.58 119.38 0)
			(effects
				(font
					(size 1.27 1.27)
				)
				(justify right)
			)
			(uuid "7c3c6e90-327a-4411-9984-4d15b03d1523")
		)
		(pin "ANT" bidirectional
			(at 195.58 127 0)
			(effects
				(font
					(size 1.27 1.27)
				)
				(justify right)
			)
			(uuid "519d137a-9e85-4094-8a2b-12bac921f7cb")
		)
		(pin "PSENSE" output
			(at 179.07 114.3 90)
			(effects
				(font
					(size 1.27 1.27)
				)
				(justify right)
			)
			(uuid "97f276c8-f64e-473d-a6a2-c85736f12ff6")
		)
		(pin "FSENSE" output
			(at 181.61 114.3 90)
			(effects
				(font
					(size 1.27 1.27)
				)
				(justify right)
			)
			(uuid "eb690ab2-08d2-47bf-8793-3cad15a212cd")
		)
		(instances
			(project "sidloc"
				(path "/e63e39d7-6ac0-4ffd-8aa3-1841a4541b55"
					(page "8")
				)
			)
		)
	)
	(sheet
		(at 118.11 48.26)
		(size 33.02 40.64)
		(stroke
			(width 0.1524)
			(type solid)
		)
		(fill
			(color 0 0 0 0.0000)
		)
		(uuid "95661826-cedc-4d00-8ee8-8834174483ba")
		(property "Sheetname" "Power"
			(at 118.11 46.99 0)
			(effects
				(font
					(size 1.27 1.27)
				)
				(justify left bottom)
			)
		)
		(property "Sheetfile" "power.kicad_sch"
			(at 118.11 43.18 0)
			(effects
				(font
					(size 1.27 1.27)
				)
				(justify left top)
			)
		)
		(pin "TBat" input
			(at 118.11 64.77 180)
			(effects
				(font
					(size 1.27 1.27)
				)
				(justify left)
			)
			(uuid "55c7b6b2-fbbe-405a-83ad-82b17380808f")
		)
		(pin "SCL" input
			(at 151.13 62.23 0)
			(effects
				(font
					(size 1.27 1.27)
				)
				(justify right)
			)
			(uuid "0515e25b-e074-4b91-ae0d-39419f8a6f2e")
		)
		(pin "BAT+" input
			(at 118.11 59.69 180)
			(effects
				(font
					(size 1.27 1.27)
				)
				(justify left)
			)
			(uuid "fb1e842e-d406-4598-83e2-ef8c3ca37ff2")
		)
		(pin "BAT-" input
			(at 118.11 62.23 180)
			(effects
				(font
					(size 1.27 1.27)
				)
				(justify left)
			)
			(uuid "544380e1-d202-4a85-9aad-6942a328937b")
		)
		(pin "3V3_PG" output
			(at 151.13 54.61 0)
			(effects
				(font
					(size 1.27 1.27)
				)
				(justify right)
			)
			(uuid "19b85d7f-f210-4758-8797-68370f710784")
		)
		(pin "SDA" bidirectional
			(at 151.13 64.77 0)
			(effects
				(font
					(size 1.27 1.27)
				)
				(justify right)
			)
			(uuid "84154033-daf9-4945-bfb4-ada71a05988c")
		)
		(pin "BAT_ALERT" output
			(at 151.13 69.85 0)
			(effects
				(font
					(size 1.27 1.27)
				)
				(justify right)
			)
			(uuid "04424701-0b0b-4dbe-aa91-656bb41acc4b")
		)
		(pin "CHG_CPLT" output
			(at 118.11 50.8 180)
			(effects
				(font
					(size 1.27 1.27)
				)
				(justify left)
			)
			(uuid "131b445a-0ed6-46f4-8886-6be6feae07eb")
		)
		(pin "CHG" output
			(at 118.11 53.34 180)
			(effects
				(font
					(size 1.27 1.27)
				)
				(justify left)
			)
			(uuid "ed2a983b-3d2b-49ab-8ea5-f6240df89836")
		)
		(pin "VIN" input
			(at 118.11 67.31 180)
			(effects
				(font
					(size 1.27 1.27)
				)
				(justify left)
			)
			(uuid "89e8860b-8c6d-4ca3-b75d-d074f3b52a1b")
		)
		(pin "~{CHG_TTE}" input
			(at 151.13 57.15 0)
			(effects
				(font
					(size 1.27 1.27)
				)
				(justify right)
			)
			(uuid "fe12c7f5-0a45-44d3-89d5-d2abf71eacf4")
		)
		(pin "3V3_EN" input
			(at 118.11 78.74 180)
			(effects
				(font
					(size 1.27 1.27)
				)
				(justify left)
			)
			(uuid "b352bb8f-0f75-4b15-917f-0f762ca55569")
		)
		(pin "DCDC_IN" input
			(at 118.11 83.82 180)
			(effects
				(font
					(size 1.27 1.27)
				)
				(justify left)
			)
			(uuid "b37f0f84-c0c8-4dd7-b478-4a47133c4a5c")
		)
		(instances
			(project "sidloc"
				(path "/e63e39d7-6ac0-4ffd-8aa3-1841a4541b55"
					(page "4")
				)
			)
		)
	)
	(sheet
		(at 224.79 48.26)
		(size 39.37 35.56)
		(stroke
			(width 0.1524)
			(type solid)
		)
		(fill
			(color 0 0 0 0.0000)
		)
		(uuid "9ea3f9c6-0cc2-4494-8b77-3464b0c635c8")
		(property "Sheetname" "FPGA"
			(at 224.79 47.5484 0)
			(effects
				(font
					(size 1.27 1.27)
				)
				(justify left bottom)
			)
		)
		(property "Sheetfile" "fpga.kicad_sch"
			(at 224.79 43.18 0)
			(effects
				(font
					(size 1.27 1.27)
				)
				(justify left top)
			)
		)
		(pin "JTDO" input
			(at 224.79 62.23 180)
			(effects
				(font
					(size 1.27 1.27)
				)
				(justify left)
			)
			(uuid "5c5a8605-c323-4369-94e2-3129dac1e728")
		)
		(pin "JTMS" input
			(at 224.79 57.15 180)
			(effects
				(font
					(size 1.27 1.27)
				)
				(justify left)
			)
			(uuid "30fbc43f-28af-414a-84cb-42bcb84350ea")
		)
		(pin "JTCK" input
			(at 224.79 59.69 180)
			(effects
				(font
					(size 1.27 1.27)
				)
				(justify left)
			)
			(uuid "e83c4269-9407-48bf-89f4-158ad7d591fc")
		)
		(pin "JTDI" input
			(at 224.79 54.61 180)
			(effects
				(font
					(size 1.27 1.27)
				)
				(justify left)
			)
			(uuid "a3a0d289-1102-4c86-99f2-cae700ea40af")
		)
		(pin "DONE" bidirectional
			(at 224.79 68.58 180)
			(effects
				(font
					(size 1.27 1.27)
				)
				(justify left)
			)
			(uuid "665ffd13-563a-4dd8-8c05-3897792c4d69")
		)
		(pin "SPI_MOSI" input
			(at 224.79 81.28 180)
			(effects
				(font
					(size 1.27 1.27)
				)
				(justify left)
			)
			(uuid "e27fac0a-adcb-4c37-a982-1d97fb6bc0ea")
		)
		(pin "SPI_CLK" input
			(at 224.79 76.2 180)
			(effects
				(font
					(size 1.27 1.27)
				)
				(justify left)
			)
			(uuid "34fdec85-9eda-4dc3-9fdb-7e4ef516be11")
		)
		(pin "SPI_CS" input
			(at 224.79 73.66 180)
			(effects
				(font
					(size 1.27 1.27)
				)
				(justify left)
			)
			(uuid "af422df2-dcc8-4158-b113-6030b37d1aac")
		)
		(pin "RXCLOCKN" input
			(at 252.73 83.82 270)
			(effects
				(font
					(size 1.27 1.27)
				)
				(justify left)
			)
			(uuid "add82dd0-e621-4680-abd9-6c213252e034")
		)
		(pin "RXCLOCKP" input
			(at 255.27 83.82 270)
			(effects
				(font
					(size 1.27 1.27)
				)
				(justify left)
			)
			(uuid "7901b654-59d2-47b6-8b80-ff7725c9dc68")
		)
		(pin "RXDATAP" input
			(at 257.81 83.82 270)
			(effects
				(font
					(size 1.27 1.27)
				)
				(justify left)
			)
			(uuid "17119f17-f646-4aec-8650-1c44f1a376c7")
		)
		(pin "EN" input
			(at 224.79 71.12 180)
			(effects
				(font
					(size 1.27 1.27)
				)
				(justify left)
			)
			(uuid "ab02e9ba-30e6-4fb8-99f4-1e88ddb9649c")
		)
		(pin "FPGA_3V3" output
			(at 224.79 50.8 180)
			(effects
				(font
					(size 1.27 1.27)
				)
				(justify left)
			)
			(uuid "d46bba56-20eb-472a-859a-6f1cbbf3a02d")
		)
		(pin "RX_IRQ" output
			(at 224.79 66.04 180)
			(effects
				(font
					(size 1.27 1.27)
				)
				(justify left)
			)
			(uuid "f6cfd9b8-669a-498a-b072-7c342676c441")
		)
		(pin "RXDATAN" input
			(at 260.35 83.82 270)
			(effects
				(font
					(size 1.27 1.27)
				)
				(justify left)
			)
			(uuid "b9ea389d-2f42-4e3a-aa2a-48c98abd1712")
		)
		(pin "TXDATAN" output
			(at 247.65 83.82 270)
			(effects
				(font
					(size 1.27 1.27)
				)
				(justify left)
			)
			(uuid "a1b62277-cbdd-4ac2-b04d-0bd59a1e6126")
		)
		(pin "TXDATAP" output
			(at 245.11 83.82 270)
			(effects
				(font
					(size 1.27 1.27)
				)
				(justify left)
			)
			(uuid "65b4be26-4180-44b5-b542-bf9533fefbb2")
		)
		(pin "TXCLOCKN" output
			(at 240.03 83.82 270)
			(effects
				(font
					(size 1.27 1.27)
				)
				(justify left)
			)
			(uuid "9e260083-0b14-49c4-a8f2-66afb29cc78f")
		)
		(pin "TXCLOCKP" output
			(at 242.57 83.82 270)
			(effects
				(font
					(size 1.27 1.27)
				)
				(justify left)
			)
			(uuid "bbb0494f-bb2d-4e04-8dcb-48fd8da5ea0b")
		)
		(pin "SPI_MISO" output
			(at 224.79 78.74 180)
			(effects
				(font
					(size 1.27 1.27)
				)
				(justify left)
			)
			(uuid "f03b1896-f0c2-4963-930e-9c4be9b92daa")
		)
		(pin "IO_A10" bidirectional
			(at 264.16 50.8 0)
			(effects
				(font
					(size 1.27 1.27)
				)
				(justify right)
			)
			(uuid "76fd5a24-1141-4409-a62d-fc0f41ab2483")
		)
		(pin "IO_A11" bidirectional
			(at 264.16 53.34 0)
			(effects
				(font
					(size 1.27 1.27)
				)
				(justify right)
			)
			(uuid "4031cbc6-f5a6-4462-9355-d594e6592ef8")
		)
		(pin "IO_A6" bidirectional
			(at 264.16 55.88 0)
			(effects
				(font
					(size 1.27 1.27)
				)
				(justify right)
			)
			(uuid "9fe5620f-595f-4a2e-b6a9-2d67d8c2f638")
		)
		(pin "IO_A7" bidirectional
			(at 264.16 58.42 0)
			(effects
				(font
					(size 1.27 1.27)
				)
				(justify right)
			)
			(uuid "348a8418-6f46-4b7a-94f2-2ee12acfa124")
		)
		(pin "IO_T19" bidirectional
			(at 264.16 63.5 0)
			(effects
				(font
					(size 1.27 1.27)
				)
				(justify right)
			)
			(uuid "b26bd6a8-6ceb-42b1-9702-7f06fda42811")
		)
		(pin "IO_T20" bidirectional
			(at 264.16 66.04 0)
			(effects
				(font
					(size 1.27 1.27)
				)
				(justify right)
			)
			(uuid "8f2e5293-0b89-4253-972d-6592274d85b2")
		)
		(pin "IO_U19" bidirectional
			(at 264.16 68.58 0)
			(effects
				(font
					(size 1.27 1.27)
				)
				(justify right)
			)
			(uuid "e7debc62-34bb-4315-b80b-fd0da6ef22ac")
		)
		(pin "IO_R20" bidirectional
			(at 264.16 71.12 0)
			(effects
				(font
					(size 1.27 1.27)
				)
				(justify right)
			)
			(uuid "169e57ea-2719-417b-bd0b-6199356a2051")
		)
		(pin "IO_M20" bidirectional
			(at 264.16 60.96 0)
			(effects
				(font
					(size 1.27 1.27)
				)
				(justify right)
			)
			(uuid "208d1af1-e181-45fb-af11-c151469d5f15")
		)
		(instances
			(project "sidloc"
				(path "/e63e39d7-6ac0-4ffd-8aa3-1841a4541b55"
					(page "6")
				)
			)
		)
	)
	(sheet
		(at 156.21 48.26)
		(size 39.37 59.69)
		(stroke
			(width 0.1524)
			(type solid)
		)
		(fill
			(color 0 0 0 0.0000)
		)
		(uuid "b854a395-bfc6-4140-9640-75d4f9296771")
		(property "Sheetname" "MCU"
			(at 156.21 46.99 0)
			(effects
				(font
					(size 1.27 1.27)
				)
				(justify left bottom)
			)
		)
		(property "Sheetfile" "mcu.kicad_sch"
			(at 156.21 43.18 0)
			(effects
				(font
					(size 1.27 1.27)
				)
				(justify left top)
			)
		)
		(pin "USART1_TX" input
			(at 156.21 78.74 180)
			(effects
				(font
					(size 1.27 1.27)
				)
				(justify left)
			)
			(uuid "1a2cbb7d-a12b-4ce2-8cb5-723dbf106184")
		)
		(pin "SYS_JTDO-SWO" input
			(at 195.58 54.61 0)
			(effects
				(font
					(size 1.27 1.27)
				)
				(justify right)
			)
			(uuid "9907464b-5215-4823-8445-eacd75e14a05")
		)
		(pin "USART1_RX" input
			(at 156.21 81.28 180)
			(effects
				(font
					(size 1.27 1.27)
				)
				(justify left)
			)
			(uuid "678a9f62-4714-47dc-8bde-7fa5616d214e")
		)
		(pin "SYS_JTRST" input
			(at 195.58 52.07 0)
			(effects
				(font
					(size 1.27 1.27)
				)
				(justify right)
			)
			(uuid "2a6288c2-7e68-4b6a-9c28-ef206f17ab74")
		)
		(pin "SYS_JTMS-SWDIO" input
			(at 195.58 57.15 0)
			(effects
				(font
					(size 1.27 1.27)
				)
				(justify right)
			)
			(uuid "e087e4b6-4fa4-4da0-a192-035c5bb1b897")
		)
		(pin "SYS_JTCK-SWCLK" input
			(at 195.58 59.69 0)
			(effects
				(font
					(size 1.27 1.27)
				)
				(justify right)
			)
			(uuid "45b3bfdd-f079-4daf-b0a0-44fc508278b0")
		)
		(pin "SYS_JTDI" input
			(at 195.58 62.23 0)
			(effects
				(font
					(size 1.27 1.27)
				)
				(justify right)
			)
			(uuid "e77ad7d2-5bb7-4094-ae31-9a87bfcc1d08")
		)
		(pin "I2C1_SCL" input
			(at 156.21 62.23 180)
			(effects
				(font
					(size 1.27 1.27)
				)
				(justify left)
			)
			(uuid "7339917c-75f7-4f67-85ec-e2d58d5a2ac3")
		)
		(pin "RCC_MCO" input
			(at 156.21 85.09 180)
			(effects
				(font
					(size 1.27 1.27)
				)
				(justify left)
			)
			(uuid "61b2fc64-9f20-4d1a-a956-f4cd431249c7")
		)
		(pin "I2C1_SDA" input
			(at 156.21 64.77 180)
			(effects
				(font
					(size 1.27 1.27)
				)
				(justify left)
			)
			(uuid "6979ffd1-2215-4d6f-8fe1-8ac2cb730830")
		)
		(pin "NRST" input
			(at 156.21 54.61 180)
			(effects
				(font
					(size 1.27 1.27)
				)
				(justify left)
			)
			(uuid "1b700e94-4df3-4939-b435-05b8b4e247c6")
		)
		(pin "RFFE_EN" output
			(at 173.99 107.95 270)
			(effects
				(font
					(size 1.27 1.27)
				)
				(justify left)
			)
			(uuid "e64146a6-6ad2-403d-bf83-34dd78a47eb3")
		)
		(pin "TRX_IRQ" input
			(at 195.58 101.6 0)
			(effects
				(font
					(size 1.27 1.27)
				)
				(justify right)
			)
			(uuid "e08662d0-df5c-4859-bd6e-11e8d4cb9e19")
		)
		(pin "ANT_SEN" input
			(at 156.21 100.33 180)
			(effects
				(font
					(size 1.27 1.27)
				)
				(justify left)
			)
			(uuid "4b8bbaa4-5c0a-4b8a-8624-89060bdb1e6a")
		)
		(pin "FPGA_DONE" input
			(at 195.58 68.58 0)
			(effects
				(font
					(size 1.27 1.27)
				)
				(justify right)
			)
			(uuid "b6960b84-82d7-4614-bc56-d7abaab78658")
		)
		(pin "RFFE_TX_EN" output
			(at 176.53 107.95 270)
			(effects
				(font
					(size 1.27 1.27)
				)
				(justify left)
			)
			(uuid "e7640c2f-9c50-4c84-927f-32cb21048f3d")
		)
		(pin "TRX_EN" input
			(at 195.58 106.68 0)
			(effects
				(font
					(size 1.27 1.27)
				)
				(justify right)
			)
			(uuid "90156f31-c4c4-4660-a2fa-7e6b5584c7d0")
		)
		(pin "FPGA_EN" input
			(at 195.58 71.12 0)
			(effects
				(font
					(size 1.27 1.27)
				)
				(justify right)
			)
			(uuid "aa21dc7d-c4e1-4034-8138-5e7d3365dd3d")
		)
		(pin "PSU_BAT_ALERT" input
			(at 156.21 69.85 180)
			(effects
				(font
					(size 1.27 1.27)
				)
				(justify left)
			)
			(uuid "df64a68c-1a69-4151-ae50-9c963e9376ce")
		)
		(pin "RFFE_PSENSE" input
			(at 179.07 107.95 270)
			(effects
				(font
					(size 1.27 1.27)
				)
				(justify left)
			)
			(uuid "545eb7b9-192a-481a-a35e-e278e9000523")
		)
		(pin "TRX_RST" input
			(at 195.58 104.14 0)
			(effects
				(font
					(size 1.27 1.27)
				)
				(justify right)
			)
			(uuid "1042b2e6-888d-4a7d-976b-34928332fb0f")
		)
		(pin "ANT_DEP" input
			(at 156.21 104.14 180)
			(effects
				(font
					(size 1.27 1.27)
				)
				(justify left)
			)
			(uuid "b74c2162-716d-492b-8021-46751ce700ea")
		)
		(pin "SPI_MISO" input
			(at 195.58 78.74 0)
			(effects
				(font
					(size 1.27 1.27)
				)
				(justify right)
			)
			(uuid "b930eb09-d6a9-4680-8e02-660744021d12")
		)
		(pin "SPI_SCK" input
			(at 195.58 76.2 0)
			(effects
				(font
					(size 1.27 1.27)
				)
				(justify right)
			)
			(uuid "01c0b2cb-a094-431e-af2b-ece42181c9bb")
		)
		(pin "SPI_MOSI" input
			(at 195.58 81.28 0)
			(effects
				(font
					(size 1.27 1.27)
				)
				(justify right)
			)
			(uuid "72b09d3f-51b1-4f29-aa20-f42bcf341b36")
		)
		(pin "RX_IRQ" input
			(at 195.58 66.04 0)
			(effects
				(font
					(size 1.27 1.27)
				)
				(justify right)
			)
			(uuid "23d2c32e-47ff-4ae6-a498-f01be81385d8")
		)
		(pin "TRX_CS" output
			(at 195.58 97.79 0)
			(effects
				(font
					(size 1.27 1.27)
				)
				(justify right)
			)
			(uuid "4be6a2ea-f9e2-4517-ba14-035185056b7a")
		)
		(pin "FPGA_CS" output
			(at 195.58 73.66 0)
			(effects
				(font
					(size 1.27 1.27)
				)
				(justify right)
			)
			(uuid "ff3dea60-77c2-456e-9598-49bd59bb0128")
		)
		(pin "RFFE_FSENSE" input
			(at 181.61 107.95 270)
			(effects
				(font
					(size 1.27 1.27)
				)
				(justify left)
			)
			(uuid "2b6cc136-7b0f-4184-87b2-70de5eaba438")
		)
		(pin "TM" output
			(at 156.21 88.9 180)
			(effects
				(font
					(size 1.27 1.27)
				)
				(justify left)
			)
			(uuid "65ce173c-61dc-48e6-8384-d86ae0d8569f")
		)
		(pin "CAN1_SHDN" output
			(at 195.58 85.09 0)
			(effects
				(font
					(size 1.27 1.27)
				)
				(justify right)
			)
			(uuid "8db47f00-19be-49a9-a83d-9355112e2f11")
		)
		(pin "CAN1_STB" output
			(at 195.58 87.63 0)
			(effects
				(font
					(size 1.27 1.27)
				)
				(justify right)
			)
			(uuid "2fe01461-798f-4951-838c-feb7a6197dee")
		)
		(pin "CAN1_RX" input
			(at 195.58 90.17 0)
			(effects
				(font
					(size 1.27 1.27)
				)
				(justify right)
			)
			(uuid "a284918d-e465-4bb4-ae5b-024b4fb035c2")
		)
		(pin "CAN1_TX" output
			(at 195.58 92.71 0)
			(effects
				(font
					(size 1.27 1.27)
				)
				(justify right)
			)
			(uuid "2ae3f520-e7d8-4b6b-a472-e845c528a0bf")
		)
		(pin "3V3_F" output
			(at 195.58 95.25 0)
			(effects
				(font
					(size 1.27 1.27)
				)
				(justify right)
			)
			(uuid "aa5e173d-edf2-471d-8801-2d3590971a3a")
		)
		(pin "AUX1" bidirectional
			(at 156.21 92.71 180)
			(effects
				(font
					(size 1.27 1.27)
				)
				(justify left)
			)
			(uuid "7b75ab0d-d8e2-47e8-8fbf-75d91e8ae2f7")
		)
		(instances
			(project "sidloc"
				(path "/e63e39d7-6ac0-4ffd-8aa3-1841a4541b55"
					(page "2")
				)
			)
		)
	)
	(sheet
		(at 118.11 96.52)
		(size 33.02 12.7)
		(stroke
			(width 0.1524)
			(type solid)
		)
		(fill
			(color 0 0 0 0.0000)
		)
		(uuid "f5c159c6-76d5-4ef9-a42b-1b678af64652")
		(property "Sheetname" "Antenna Deployment"
			(at 118.11 95.9354 0)
			(effects
				(font
					(size 1.27 1.27)
				)
				(justify left bottom)
			)
		)
		(property "Sheetfile" "antenna_deployment.kicad_sch"
			(at 118.11 91.44 0)
			(effects
				(font
					(size 1.27 1.27)
				)
				(justify left top)
			)
		)
		(pin "ANT_DEP" input
			(at 151.13 104.14 0)
			(effects
				(font
					(size 1.27 1.27)
				)
				(justify right)
			)
			(uuid "0d5a3631-a0b7-4540-af95-02b43fe504d2")
		)
		(pin "BAT+" input
			(at 118.11 104.14 180)
			(effects
				(font
					(size 1.27 1.27)
				)
				(justify left)
			)
			(uuid "62c49c39-a266-4eab-9ddb-98bb01e46edd")
		)
		(instances
			(project "sidloc"
				(path "/e63e39d7-6ac0-4ffd-8aa3-1841a4541b55"
					(page "9")
				)
			)
		)
	)
	(sheet_instances
		(path "/"
			(page "1")
		)
	)
)
