(kicad_sch
	(version 20231120)
	(generator "eeschema")
	(generator_version "8.0")
	(uuid "909b030b-fa1a-4fe8-b1ee-422b4d9e23cf")
	(paper "A4")
	(title_block
		(title "SIDLOC RFFE")
		(company "Libre Space Foundation")
		(comment 1 "CERN OHL version 2 - Strongly Reciprocal")
	)
	(lib_symbols
		(symbol "Connector:Conn_Coaxial"
			(pin_names
				(offset 1.016) hide)
			(exclude_from_sim no)
			(in_bom yes)
			(on_board yes)
			(property "Reference" "J"
				(at 0.254 3.048 0)
				(effects
					(font
						(size 1.27 1.27)
					)
				)
			)
			(property "Value" "Conn_Coaxial"
				(at 2.921 0 90)
				(effects
					(font
						(size 1.27 1.27)
					)
				)
			)
			(property "Footprint" ""
				(at 0 0 0)
				(effects
					(font
						(size 1.27 1.27)
					)
					(hide yes)
				)
			)
			(property "Datasheet" "~"
				(at 0 0 0)
				(effects
					(font
						(size 1.27 1.27)
					)
					(hide yes)
				)
			)
			(property "Description" "coaxial connector (BNC, SMA, SMB, SMC, Cinch/RCA, LEMO, ...)"
				(at 0 0 0)
				(effects
					(font
						(size 1.27 1.27)
					)
					(hide yes)
				)
			)
			(property "ki_keywords" "BNC SMA SMB SMC LEMO coaxial connector CINCH RCA MCX MMCX U.FL UMRF"
				(at 0 0 0)
				(effects
					(font
						(size 1.27 1.27)
					)
					(hide yes)
				)
			)
			(property "ki_fp_filters" "*BNC* *SMA* *SMB* *SMC* *Cinch* *LEMO* *UMRF* *MCX* *U.FL*"
				(at 0 0 0)
				(effects
					(font
						(size 1.27 1.27)
					)
					(hide yes)
				)
			)
			(symbol "Conn_Coaxial_0_1"
				(arc
					(start -1.778 -0.508)
					(mid 0.2311 -1.8066)
					(end 1.778 0)
					(stroke
						(width 0.254)
						(type default)
					)
					(fill
						(type none)
					)
				)
				(polyline
					(pts
						(xy -2.54 0) (xy -0.508 0)
					)
					(stroke
						(width 0)
						(type default)
					)
					(fill
						(type none)
					)
				)
				(polyline
					(pts
						(xy 0 -2.54) (xy 0 -1.778)
					)
					(stroke
						(width 0)
						(type default)
					)
					(fill
						(type none)
					)
				)
				(circle
					(center 0 0)
					(radius 0.508)
					(stroke
						(width 0.2032)
						(type default)
					)
					(fill
						(type none)
					)
				)
				(arc
					(start 1.778 0)
					(mid 0.2099 1.8101)
					(end -1.778 0.508)
					(stroke
						(width 0.254)
						(type default)
					)
					(fill
						(type none)
					)
				)
			)
			(symbol "Conn_Coaxial_1_1"
				(pin passive line
					(at -5.08 0 0)
					(length 2.54)
					(name "In"
						(effects
							(font
								(size 1.27 1.27)
							)
						)
					)
					(number "1"
						(effects
							(font
								(size 1.27 1.27)
							)
						)
					)
				)
				(pin passive line
					(at 0 -5.08 90)
					(length 2.54)
					(name "Ext"
						(effects
							(font
								(size 1.27 1.27)
							)
						)
					)
					(number "2"
						(effects
							(font
								(size 1.27 1.27)
							)
						)
					)
				)
			)
		)
		(symbol "Connector_Generic:Conn_01x05"
			(pin_names
				(offset 1.016) hide)
			(exclude_from_sim no)
			(in_bom yes)
			(on_board yes)
			(property "Reference" "J"
				(at 0 7.62 0)
				(effects
					(font
						(size 1.27 1.27)
					)
				)
			)
			(property "Value" "Conn_01x05"
				(at 0 -7.62 0)
				(effects
					(font
						(size 1.27 1.27)
					)
				)
			)
			(property "Footprint" ""
				(at 0 0 0)
				(effects
					(font
						(size 1.27 1.27)
					)
					(hide yes)
				)
			)
			(property "Datasheet" "~"
				(at 0 0 0)
				(effects
					(font
						(size 1.27 1.27)
					)
					(hide yes)
				)
			)
			(property "Description" "Generic connector, single row, 01x05, script generated (kicad-library-utils/schlib/autogen/connector/)"
				(at 0 0 0)
				(effects
					(font
						(size 1.27 1.27)
					)
					(hide yes)
				)
			)
			(property "ki_keywords" "connector"
				(at 0 0 0)
				(effects
					(font
						(size 1.27 1.27)
					)
					(hide yes)
				)
			)
			(property "ki_fp_filters" "Connector*:*_1x??_*"
				(at 0 0 0)
				(effects
					(font
						(size 1.27 1.27)
					)
					(hide yes)
				)
			)
			(symbol "Conn_01x05_1_1"
				(rectangle
					(start -1.27 -4.953)
					(end 0 -5.207)
					(stroke
						(width 0.1524)
						(type default)
					)
					(fill
						(type none)
					)
				)
				(rectangle
					(start -1.27 -2.413)
					(end 0 -2.667)
					(stroke
						(width 0.1524)
						(type default)
					)
					(fill
						(type none)
					)
				)
				(rectangle
					(start -1.27 0.127)
					(end 0 -0.127)
					(stroke
						(width 0.1524)
						(type default)
					)
					(fill
						(type none)
					)
				)
				(rectangle
					(start -1.27 2.667)
					(end 0 2.413)
					(stroke
						(width 0.1524)
						(type default)
					)
					(fill
						(type none)
					)
				)
				(rectangle
					(start -1.27 5.207)
					(end 0 4.953)
					(stroke
						(width 0.1524)
						(type default)
					)
					(fill
						(type none)
					)
				)
				(rectangle
					(start -1.27 6.35)
					(end 1.27 -6.35)
					(stroke
						(width 0.254)
						(type default)
					)
					(fill
						(type background)
					)
				)
				(pin passive line
					(at -5.08 5.08 0)
					(length 3.81)
					(name "Pin_1"
						(effects
							(font
								(size 1.27 1.27)
							)
						)
					)
					(number "1"
						(effects
							(font
								(size 1.27 1.27)
							)
						)
					)
				)
				(pin passive line
					(at -5.08 2.54 0)
					(length 3.81)
					(name "Pin_2"
						(effects
							(font
								(size 1.27 1.27)
							)
						)
					)
					(number "2"
						(effects
							(font
								(size 1.27 1.27)
							)
						)
					)
				)
				(pin passive line
					(at -5.08 0 0)
					(length 3.81)
					(name "Pin_3"
						(effects
							(font
								(size 1.27 1.27)
							)
						)
					)
					(number "3"
						(effects
							(font
								(size 1.27 1.27)
							)
						)
					)
				)
				(pin passive line
					(at -5.08 -2.54 0)
					(length 3.81)
					(name "Pin_4"
						(effects
							(font
								(size 1.27 1.27)
							)
						)
					)
					(number "4"
						(effects
							(font
								(size 1.27 1.27)
							)
						)
					)
				)
				(pin passive line
					(at -5.08 -5.08 0)
					(length 3.81)
					(name "Pin_5"
						(effects
							(font
								(size 1.27 1.27)
							)
						)
					)
					(number "5"
						(effects
							(font
								(size 1.27 1.27)
							)
						)
					)
				)
			)
		)
		(symbol "Graphic:Logo_Open_Hardware_Small"
			(exclude_from_sim no)
			(in_bom no)
			(on_board no)
			(property "Reference" "#SYM"
				(at 0 6.985 0)
				(effects
					(font
						(size 1.27 1.27)
					)
					(hide yes)
				)
			)
			(property "Value" "Logo_Open_Hardware_Small"
				(at 0 -5.715 0)
				(effects
					(font
						(size 1.27 1.27)
					)
					(hide yes)
				)
			)
			(property "Footprint" ""
				(at 0 0 0)
				(effects
					(font
						(size 1.27 1.27)
					)
					(hide yes)
				)
			)
			(property "Datasheet" "~"
				(at 0 0 0)
				(effects
					(font
						(size 1.27 1.27)
					)
					(hide yes)
				)
			)
			(property "Description" "Open Hardware logo, small"
				(at 0 0 0)
				(effects
					(font
						(size 1.27 1.27)
					)
					(hide yes)
				)
			)
			(property "Sim.Enable" "0"
				(at 0 0 0)
				(effects
					(font
						(size 1.27 1.27)
					)
					(hide yes)
				)
			)
			(property "ki_keywords" "Logo"
				(at 0 0 0)
				(effects
					(font
						(size 1.27 1.27)
					)
					(hide yes)
				)
			)
			(symbol "Logo_Open_Hardware_Small_0_1"
				(polyline
					(pts
						(xy 3.3528 -4.3434) (xy 3.302 -4.318) (xy 3.175 -4.2418) (xy 2.9972 -4.1148) (xy 2.7686 -3.9624)
						(xy 2.54 -3.81) (xy 2.3622 -3.7084) (xy 2.2352 -3.6068) (xy 2.1844 -3.5814) (xy 2.159 -3.6068)
						(xy 2.0574 -3.6576) (xy 1.905 -3.7338) (xy 1.8034 -3.7846) (xy 1.6764 -3.8354) (xy 1.6002 -3.8354)
						(xy 1.6002 -3.8354) (xy 1.5494 -3.7338) (xy 1.4732 -3.5306) (xy 1.3462 -3.302) (xy 1.2446 -3.0226)
						(xy 1.1176 -2.7178) (xy 0.9652 -2.413) (xy 0.8636 -2.1082) (xy 0.7366 -1.8288) (xy 0.6604 -1.6256)
						(xy 0.6096 -1.4732) (xy 0.5842 -1.397) (xy 0.5842 -1.397) (xy 0.6604 -1.3208) (xy 0.7874 -1.2446)
						(xy 1.0414 -1.016) (xy 1.2954 -0.6858) (xy 1.4478 -0.3302) (xy 1.524 0.0762) (xy 1.4732 0.4572)
						(xy 1.3208 0.8128) (xy 1.0668 1.143) (xy 0.762 1.3716) (xy 0.4064 1.524) (xy 0 1.5748) (xy -0.381 1.5494)
						(xy -0.7366 1.397) (xy -1.0668 1.143) (xy -1.2192 0.9906) (xy -1.397 0.6604) (xy -1.524 0.3048)
						(xy -1.524 0.2286) (xy -1.4986 -0.1778) (xy -1.397 -0.5334) (xy -1.1938 -0.8636) (xy -0.9144 -1.143)
						(xy -0.8636 -1.1684) (xy -0.7366 -1.27) (xy -0.635 -1.3462) (xy -0.5842 -1.397) (xy -1.0668 -2.5908)
						(xy -1.143 -2.794) (xy -1.2954 -3.1242) (xy -1.397 -3.4036) (xy -1.4986 -3.6322) (xy -1.5748 -3.7846)
						(xy -1.6002 -3.8354) (xy -1.6002 -3.8354) (xy -1.651 -3.8354) (xy -1.7272 -3.81) (xy -1.905 -3.7338)
						(xy -2.0066 -3.683) (xy -2.1336 -3.6068) (xy -2.2098 -3.5814) (xy -2.2606 -3.6068) (xy -2.3622 -3.683)
						(xy -2.54 -3.81) (xy -2.7686 -3.9624) (xy -2.9718 -4.0894) (xy -3.1496 -4.2164) (xy -3.302 -4.318)
						(xy -3.3528 -4.3434) (xy -3.3782 -4.3434) (xy -3.429 -4.318) (xy -3.5306 -4.2164) (xy -3.7084 -4.064)
						(xy -3.937 -3.8354) (xy -3.9624 -3.81) (xy -4.1656 -3.6068) (xy -4.318 -3.4544) (xy -4.4196 -3.3274)
						(xy -4.445 -3.2766) (xy -4.445 -3.2766) (xy -4.4196 -3.2258) (xy -4.318 -3.0734) (xy -4.2164 -2.8956)
						(xy -4.064 -2.667) (xy -3.6576 -2.0828) (xy -3.8862 -1.5494) (xy -3.937 -1.3716) (xy -4.0386 -1.1684)
						(xy -4.0894 -1.0414) (xy -4.1148 -0.9652) (xy -4.191 -0.9398) (xy -4.318 -0.9144) (xy -4.5466 -0.8636)
						(xy -4.8006 -0.8128) (xy -5.0546 -0.7874) (xy -5.2578 -0.7366) (xy -5.4356 -0.7112) (xy -5.5118 -0.6858)
						(xy -5.5118 -0.6858) (xy -5.5372 -0.635) (xy -5.5372 -0.5588) (xy -5.5372 -0.4318) (xy -5.5626 -0.2286)
						(xy -5.5626 0.0762) (xy -5.5626 0.127) (xy -5.5372 0.4064) (xy -5.5372 0.635) (xy -5.5372 0.762)
						(xy -5.5372 0.8382) (xy -5.5372 0.8382) (xy -5.461 0.8382) (xy -5.3086 0.889) (xy -5.08 0.9144)
						(xy -4.826 0.9652) (xy -4.8006 0.9906) (xy -4.5466 1.0414) (xy -4.318 1.0668) (xy -4.1656 1.1176)
						(xy -4.0894 1.143) (xy -4.0894 1.143) (xy -4.0386 1.2446) (xy -3.9624 1.4224) (xy -3.8608 1.6256)
						(xy -3.7846 1.8288) (xy -3.7084 2.0066) (xy -3.6576 2.159) (xy -3.6322 2.2098) (xy -3.6322 2.2098)
						(xy -3.683 2.286) (xy -3.7592 2.413) (xy -3.8862 2.5908) (xy -4.064 2.8194) (xy -4.064 2.8448)
						(xy -4.2164 3.0734) (xy -4.3434 3.2512) (xy -4.4196 3.3782) (xy -4.445 3.4544) (xy -4.445 3.4544)
						(xy -4.3942 3.5052) (xy -4.2926 3.6322) (xy -4.1148 3.81) (xy -3.937 4.0132) (xy -3.8608 4.064)
						(xy -3.6576 4.2926) (xy -3.5052 4.4196) (xy -3.4036 4.4958) (xy -3.3528 4.5212) (xy -3.3528 4.5212)
						(xy -3.302 4.4704) (xy -3.1496 4.3688) (xy -2.9718 4.2418) (xy -2.7432 4.0894) (xy -2.7178 4.0894)
						(xy -2.4892 3.937) (xy -2.3114 3.81) (xy -2.1844 3.7084) (xy -2.1336 3.683) (xy -2.1082 3.683)
						(xy -2.032 3.7084) (xy -1.8542 3.7592) (xy -1.6764 3.8354) (xy -1.4732 3.937) (xy -1.27 4.0132)
						(xy -1.143 4.064) (xy -1.0668 4.1148) (xy -1.0668 4.1148) (xy -1.0414 4.191) (xy -1.016 4.3434)
						(xy -0.9652 4.572) (xy -0.9144 4.8514) (xy -0.889 4.9022) (xy -0.8382 5.1562) (xy -0.8128 5.3848)
						(xy -0.7874 5.5372) (xy -0.762 5.588) (xy -0.7112 5.6134) (xy -0.5842 5.6134) (xy -0.4064 5.6134)
						(xy -0.1524 5.6134) (xy 0.0762 5.6134) (xy 0.3302 5.6134) (xy 0.5334 5.6134) (xy 0.6858 5.588)
						(xy 0.7366 5.588) (xy 0.7366 5.588) (xy 0.762 5.5118) (xy 0.8128 5.334) (xy 0.8382 5.1054) (xy 0.9144 4.826)
						(xy 0.9144 4.7752) (xy 0.9652 4.5212) (xy 1.016 4.2926) (xy 1.0414 4.1402) (xy 1.0668 4.0894)
						(xy 1.0668 4.0894) (xy 1.1938 4.0386) (xy 1.3716 3.9624) (xy 1.5748 3.8608) (xy 2.0828 3.6576)
						(xy 2.7178 4.0894) (xy 2.7686 4.1402) (xy 2.9972 4.2926) (xy 3.175 4.4196) (xy 3.302 4.4958) (xy 3.3782 4.5212)
						(xy 3.3782 4.5212) (xy 3.429 4.4704) (xy 3.556 4.3434) (xy 3.7338 4.191) (xy 3.9116 3.9878) (xy 4.064 3.8354)
						(xy 4.2418 3.6576) (xy 4.3434 3.556) (xy 4.4196 3.4798) (xy 4.4196 3.429) (xy 4.4196 3.4036) (xy 4.3942 3.3274)
						(xy 4.2926 3.2004) (xy 4.1656 2.9972) (xy 4.0132 2.794) (xy 3.8862 2.5908) (xy 3.7592 2.3876)
						(xy 3.6576 2.2352) (xy 3.6322 2.159) (xy 3.6322 2.1336) (xy 3.683 2.0066) (xy 3.7592 1.8288) (xy 3.8608 1.6002)
						(xy 4.064 1.1176) (xy 4.3942 1.0414) (xy 4.5974 1.016) (xy 4.8768 0.9652) (xy 5.1308 0.9144) (xy 5.5372 0.8382)
						(xy 5.5626 -0.6604) (xy 5.4864 -0.6858) (xy 5.4356 -0.6858) (xy 5.2832 -0.7366) (xy 5.0546 -0.762)
						(xy 4.8006 -0.8128) (xy 4.5974 -0.8636) (xy 4.3688 -0.9144) (xy 4.2164 -0.9398) (xy 4.1402 -0.9398)
						(xy 4.1148 -0.9652) (xy 4.064 -1.0668) (xy 3.9878 -1.2446) (xy 3.9116 -1.4478) (xy 3.81 -1.651)
						(xy 3.7338 -1.8542) (xy 3.683 -2.0066) (xy 3.6576 -2.0828) (xy 3.683 -2.1336) (xy 3.7846 -2.2606)
						(xy 3.8862 -2.4638) (xy 4.0386 -2.667) (xy 4.191 -2.8956) (xy 4.318 -3.0734) (xy 4.3942 -3.2004)
						(xy 4.445 -3.2766) (xy 4.4196 -3.3274) (xy 4.3434 -3.429) (xy 4.1656 -3.5814) (xy 3.937 -3.8354)
						(xy 3.8862 -3.8608) (xy 3.683 -4.064) (xy 3.5306 -4.2164) (xy 3.4036 -4.318) (xy 3.3528 -4.3434)
					)
					(stroke
						(width 0)
						(type default)
					)
					(fill
						(type outline)
					)
				)
			)
		)
		(symbol "Mechanical:MountingHole_Pad"
			(pin_numbers hide)
			(pin_names
				(offset 1.016) hide)
			(exclude_from_sim no)
			(in_bom yes)
			(on_board yes)
			(property "Reference" "H"
				(at 0 6.35 0)
				(effects
					(font
						(size 1.27 1.27)
					)
				)
			)
			(property "Value" "MountingHole_Pad"
				(at 0 4.445 0)
				(effects
					(font
						(size 1.27 1.27)
					)
				)
			)
			(property "Footprint" ""
				(at 0 0 0)
				(effects
					(font
						(size 1.27 1.27)
					)
					(hide yes)
				)
			)
			(property "Datasheet" "~"
				(at 0 0 0)
				(effects
					(font
						(size 1.27 1.27)
					)
					(hide yes)
				)
			)
			(property "Description" "Mounting Hole with connection"
				(at 0 0 0)
				(effects
					(font
						(size 1.27 1.27)
					)
					(hide yes)
				)
			)
			(property "ki_keywords" "mounting hole"
				(at 0 0 0)
				(effects
					(font
						(size 1.27 1.27)
					)
					(hide yes)
				)
			)
			(property "ki_fp_filters" "MountingHole*Pad*"
				(at 0 0 0)
				(effects
					(font
						(size 1.27 1.27)
					)
					(hide yes)
				)
			)
			(symbol "MountingHole_Pad_0_1"
				(circle
					(center 0 1.27)
					(radius 1.27)
					(stroke
						(width 1.27)
						(type default)
					)
					(fill
						(type none)
					)
				)
			)
			(symbol "MountingHole_Pad_1_1"
				(pin input line
					(at 0 -2.54 90)
					(length 2.54)
					(name "1"
						(effects
							(font
								(size 1.27 1.27)
							)
						)
					)
					(number "1"
						(effects
							(font
								(size 1.27 1.27)
							)
						)
					)
				)
			)
		)
		(symbol "lsf-kicad:PQ9ISH-Connector"
			(exclude_from_sim no)
			(in_bom yes)
			(on_board yes)
			(property "Reference" "J"
				(at -10.16 11.43 0)
				(effects
					(font
						(size 1.27 1.27)
					)
				)
			)
			(property "Value" "PQ9ISH-Connector"
				(at 3.81 11.43 0)
				(effects
					(font
						(size 1.27 1.27)
					)
				)
			)
			(property "Footprint" "Connector_PinSocket_2.00mm:PinSocket_1x09_P2.00mm_Vertical"
				(at -2.54 -11.43 0)
				(effects
					(font
						(size 1.27 1.27)
					)
					(hide yes)
				)
			)
			(property "Datasheet" "https://libre.space/pq9ish"
				(at 15.24 -15.24 0)
				(effects
					(font
						(size 1.27 1.27)
					)
					(hide yes)
				)
			)
			(property "Description" "Pocket Cube template for PQ9ISH format"
				(at 0 0 0)
				(effects
					(font
						(size 1.27 1.27)
					)
					(hide yes)
				)
			)
			(property "ki_keywords" "PQ9 pocketcube"
				(at 0 0 0)
				(effects
					(font
						(size 1.27 1.27)
					)
					(hide yes)
				)
			)
			(property "ki_fp_filters" "PQ9*"
				(at 0 0 0)
				(effects
					(font
						(size 1.27 1.27)
					)
					(hide yes)
				)
			)
			(symbol "PQ9ISH-Connector_0_1"
				(rectangle
					(start -11.43 10.16)
					(end 12.7 -10.16)
					(stroke
						(width 0.254)
						(type default)
					)
					(fill
						(type background)
					)
				)
			)
			(symbol "PQ9ISH-Connector_1_1"
				(pin bidirectional line
					(at -15.24 8.89 0)
					(length 3.81)
					(name "1-Wire/TRX/SCL/TX/IO"
						(effects
							(font
								(size 1.27 1.27)
							)
						)
					)
					(number "1"
						(effects
							(font
								(size 1.27 1.27)
							)
						)
					)
				)
				(pin bidirectional line
					(at -15.24 6.35 0)
					(length 3.81)
					(name "D+/SDA/RX/IO"
						(effects
							(font
								(size 1.27 1.27)
							)
						)
					)
					(number "2"
						(effects
							(font
								(size 1.27 1.27)
							)
						)
					)
				)
				(pin bidirectional line
					(at -15.24 3.81 0)
					(length 3.81)
					(name "D-/SWCAN"
						(effects
							(font
								(size 1.27 1.27)
							)
						)
					)
					(number "3"
						(effects
							(font
								(size 1.27 1.27)
							)
						)
					)
				)
				(pin passive line
					(at 0 -13.97 90)
					(length 3.81) hide
					(name "GND"
						(effects
							(font
								(size 1.27 1.27)
							)
						)
					)
					(number "4"
						(effects
							(font
								(size 1.27 1.27)
							)
						)
					)
				)
				(pin power_out line
					(at -15.24 1.27 0)
					(length 3.81)
					(name "V1"
						(effects
							(font
								(size 1.27 1.27)
							)
						)
					)
					(number "5"
						(effects
							(font
								(size 1.27 1.27)
							)
						)
					)
				)
				(pin power_out line
					(at -15.24 -1.27 0)
					(length 3.81)
					(name "V2"
						(effects
							(font
								(size 1.27 1.27)
							)
						)
					)
					(number "6"
						(effects
							(font
								(size 1.27 1.27)
							)
						)
					)
				)
				(pin power_out line
					(at -15.24 -3.81 0)
					(length 3.81)
					(name "V3"
						(effects
							(font
								(size 1.27 1.27)
							)
						)
					)
					(number "7"
						(effects
							(font
								(size 1.27 1.27)
							)
						)
					)
				)
				(pin power_out line
					(at -15.24 -6.35 0)
					(length 3.81)
					(name "V4"
						(effects
							(font
								(size 1.27 1.27)
							)
						)
					)
					(number "8"
						(effects
							(font
								(size 1.27 1.27)
							)
						)
					)
				)
				(pin power_in line
					(at 0 -13.97 90)
					(length 3.81)
					(name "GND"
						(effects
							(font
								(size 1.27 1.27)
							)
						)
					)
					(number "9"
						(effects
							(font
								(size 1.27 1.27)
							)
						)
					)
				)
			)
		)
		(symbol "power:GND"
			(power)
			(pin_numbers hide)
			(pin_names
				(offset 0) hide)
			(exclude_from_sim no)
			(in_bom yes)
			(on_board yes)
			(property "Reference" "#PWR"
				(at 0 -6.35 0)
				(effects
					(font
						(size 1.27 1.27)
					)
					(hide yes)
				)
			)
			(property "Value" "GND"
				(at 0 -3.81 0)
				(effects
					(font
						(size 1.27 1.27)
					)
				)
			)
			(property "Footprint" ""
				(at 0 0 0)
				(effects
					(font
						(size 1.27 1.27)
					)
					(hide yes)
				)
			)
			(property "Datasheet" ""
				(at 0 0 0)
				(effects
					(font
						(size 1.27 1.27)
					)
					(hide yes)
				)
			)
			(property "Description" "Power symbol creates a global label with name \"GND\" , ground"
				(at 0 0 0)
				(effects
					(font
						(size 1.27 1.27)
					)
					(hide yes)
				)
			)
			(property "ki_keywords" "global power"
				(at 0 0 0)
				(effects
					(font
						(size 1.27 1.27)
					)
					(hide yes)
				)
			)
			(symbol "GND_0_1"
				(polyline
					(pts
						(xy 0 0) (xy 0 -1.27) (xy 1.27 -1.27) (xy 0 -2.54) (xy -1.27 -1.27) (xy 0 -1.27)
					)
					(stroke
						(width 0)
						(type default)
					)
					(fill
						(type none)
					)
				)
			)
			(symbol "GND_1_1"
				(pin power_in line
					(at 0 0 270)
					(length 0)
					(name "~"
						(effects
							(font
								(size 1.27 1.27)
							)
						)
					)
					(number "1"
						(effects
							(font
								(size 1.27 1.27)
							)
						)
					)
				)
			)
		)
		(symbol "power:GNDA"
			(power)
			(pin_numbers hide)
			(pin_names
				(offset 0) hide)
			(exclude_from_sim no)
			(in_bom yes)
			(on_board yes)
			(property "Reference" "#PWR"
				(at 0 -6.35 0)
				(effects
					(font
						(size 1.27 1.27)
					)
					(hide yes)
				)
			)
			(property "Value" "GNDA"
				(at 0 -3.81 0)
				(effects
					(font
						(size 1.27 1.27)
					)
				)
			)
			(property "Footprint" ""
				(at 0 0 0)
				(effects
					(font
						(size 1.27 1.27)
					)
					(hide yes)
				)
			)
			(property "Datasheet" ""
				(at 0 0 0)
				(effects
					(font
						(size 1.27 1.27)
					)
					(hide yes)
				)
			)
			(property "Description" "Power symbol creates a global label with name \"GNDA\" , analog ground"
				(at 0 0 0)
				(effects
					(font
						(size 1.27 1.27)
					)
					(hide yes)
				)
			)
			(property "ki_keywords" "global power"
				(at 0 0 0)
				(effects
					(font
						(size 1.27 1.27)
					)
					(hide yes)
				)
			)
			(symbol "GNDA_0_1"
				(polyline
					(pts
						(xy 0 0) (xy 0 -1.27) (xy 1.27 -1.27) (xy 0 -2.54) (xy -1.27 -1.27) (xy 0 -1.27)
					)
					(stroke
						(width 0)
						(type default)
					)
					(fill
						(type none)
					)
				)
			)
			(symbol "GNDA_1_1"
				(pin power_in line
					(at 0 0 270)
					(length 0)
					(name "~"
						(effects
							(font
								(size 1.27 1.27)
							)
						)
					)
					(number "1"
						(effects
							(font
								(size 1.27 1.27)
							)
						)
					)
				)
			)
		)
		(symbol "power:PWR_FLAG"
			(power)
			(pin_numbers hide)
			(pin_names
				(offset 0) hide)
			(exclude_from_sim no)
			(in_bom yes)
			(on_board yes)
			(property "Reference" "#FLG"
				(at 0 1.905 0)
				(effects
					(font
						(size 1.27 1.27)
					)
					(hide yes)
				)
			)
			(property "Value" "PWR_FLAG"
				(at 0 3.81 0)
				(effects
					(font
						(size 1.27 1.27)
					)
				)
			)
			(property "Footprint" ""
				(at 0 0 0)
				(effects
					(font
						(size 1.27 1.27)
					)
					(hide yes)
				)
			)
			(property "Datasheet" "~"
				(at 0 0 0)
				(effects
					(font
						(size 1.27 1.27)
					)
					(hide yes)
				)
			)
			(property "Description" "Special symbol for telling ERC where power comes from"
				(at 0 0 0)
				(effects
					(font
						(size 1.27 1.27)
					)
					(hide yes)
				)
			)
			(property "ki_keywords" "flag power"
				(at 0 0 0)
				(effects
					(font
						(size 1.27 1.27)
					)
					(hide yes)
				)
			)
			(symbol "PWR_FLAG_0_0"
				(pin power_out line
					(at 0 0 90)
					(length 0)
					(name "~"
						(effects
							(font
								(size 1.27 1.27)
							)
						)
					)
					(number "1"
						(effects
							(font
								(size 1.27 1.27)
							)
						)
					)
				)
			)
			(symbol "PWR_FLAG_0_1"
				(polyline
					(pts
						(xy 0 0) (xy 0 1.27) (xy -1.016 1.905) (xy 0 2.54) (xy 1.016 1.905) (xy 0 1.27)
					)
					(stroke
						(width 0)
						(type default)
					)
					(fill
						(type none)
					)
				)
			)
		)
	)
	(junction
		(at 154.94 114.3)
		(diameter 0)
		(color 0 0 0 0)
		(uuid "86189afa-858f-4465-880c-ec70aefe3218")
	)
	(no_connect
		(at 19.05 191.77)
		(uuid "24d8d946-aea6-47c0-8974-421869385ff8")
	)
	(no_connect
		(at 246.38 86.36)
		(uuid "388dcd1a-9fe8-4e16-b617-0fa6a25ce90e")
	)
	(no_connect
		(at 246.38 99.06)
		(uuid "72cee92a-21bf-4549-8d06-f750cedc6001")
	)
	(no_connect
		(at 246.38 91.44)
		(uuid "7c3f96c0-27af-4d68-807a-3d7924ac4bd3")
	)
	(no_connect
		(at 53.34 177.8)
		(uuid "8416a918-54e1-4b19-ada5-24f7b453194e")
	)
	(no_connect
		(at 53.34 191.77)
		(uuid "8af11747-720f-47cb-aa23-854e4a4fde15")
	)
	(no_connect
		(at 246.38 96.52)
		(uuid "a8bbadc0-1d60-4318-90ec-f56ce450deb8")
	)
	(no_connect
		(at 19.05 177.8)
		(uuid "bfc9d4d8-1119-4ed6-81c2-ac17f56c6746")
	)
	(no_connect
		(at 246.38 88.9)
		(uuid "cb8a0aa3-3bb0-45e4-b390-3b774f0d1c83")
	)
	(no_connect
		(at 246.38 101.6)
		(uuid "ffe539ce-95b4-4a33-a397-4094258946fc")
	)
	(wire
		(pts
			(xy 172.72 93.98) (xy 186.69 93.98)
		)
		(stroke
			(width 0)
			(type default)
		)
		(uuid "0652e93b-af5b-425a-be54-53fbb780f73f")
	)
	(wire
		(pts
			(xy 246.38 91.44) (xy 247.65 91.44)
		)
		(stroke
			(width 0)
			(type default)
		)
		(uuid "0cc85dfe-7da0-4373-a640-24f612d1cbc1")
	)
	(wire
		(pts
			(xy 138.43 72.39) (xy 138.43 74.93)
		)
		(stroke
			(width 0)
			(type default)
		)
		(uuid "0f4ffdc1-1eec-4847-a7db-3b26beb39987")
	)
	(wire
		(pts
			(xy 246.38 101.6) (xy 247.65 101.6)
		)
		(stroke
			(width 0)
			(type default)
		)
		(uuid "10558cde-2032-460b-a66d-a0ee86734a13")
	)
	(wire
		(pts
			(xy 53.34 176.53) (xy 53.34 177.8)
		)
		(stroke
			(width 0)
			(type default)
		)
		(uuid "171c778c-6102-4d6c-bb88-c9694067e294")
	)
	(wire
		(pts
			(xy 154.94 114.3) (xy 160.02 114.3)
		)
		(stroke
			(width 0)
			(type default)
		)
		(uuid "1c64db06-8f86-4925-8d4b-545682ee867f")
	)
	(wire
		(pts
			(xy 134.62 67.31) (xy 138.43 67.31)
		)
		(stroke
			(width 0)
			(type default)
		)
		(uuid "1e746e34-3d2b-46c0-b6b3-e6a82a895a97")
	)
	(wire
		(pts
			(xy 246.38 86.36) (xy 247.65 86.36)
		)
		(stroke
			(width 0)
			(type default)
		)
		(uuid "1ff0f3cc-f3c2-4807-ba0c-19b85e8966d3")
	)
	(wire
		(pts
			(xy 19.05 176.53) (xy 19.05 177.8)
		)
		(stroke
			(width 0)
			(type default)
		)
		(uuid "212046b3-e79c-4226-b86b-5be7f4f580cb")
	)
	(wire
		(pts
			(xy 154.94 113.03) (xy 154.94 114.3)
		)
		(stroke
			(width 0)
			(type default)
		)
		(uuid "2667815c-89ed-4b18-8eb1-86a8206e93d5")
	)
	(wire
		(pts
			(xy 19.05 190.5) (xy 19.05 191.77)
		)
		(stroke
			(width 0)
			(type default)
		)
		(uuid "2c1e4973-8583-4f90-9034-a781ac8ec2c1")
	)
	(wire
		(pts
			(xy 243.84 93.98) (xy 247.65 93.98)
		)
		(stroke
			(width 0)
			(type default)
		)
		(uuid "52d73506-6a5e-4cf7-a1f9-d8de9c408a66")
	)
	(wire
		(pts
			(xy 262.89 109.22) (xy 262.89 111.76)
		)
		(stroke
			(width 0)
			(type default)
		)
		(uuid "600852fd-bd7b-4317-902e-b01500196427")
	)
	(wire
		(pts
			(xy 160.02 82.55) (xy 160.02 85.09)
		)
		(stroke
			(width 0)
			(type default)
		)
		(uuid "63e71284-6afa-4b5d-81fe-f05cc30a53c5")
	)
	(wire
		(pts
			(xy 246.38 96.52) (xy 247.65 96.52)
		)
		(stroke
			(width 0)
			(type default)
		)
		(uuid "6ab46b05-d26f-468b-ab27-2e80c400fe1d")
	)
	(wire
		(pts
			(xy 160.02 114.3) (xy 160.02 116.84)
		)
		(stroke
			(width 0)
			(type default)
		)
		(uuid "70fbdc66-c619-4688-bcd1-f08b675ba00f")
	)
	(wire
		(pts
			(xy 138.43 64.77) (xy 134.62 64.77)
		)
		(stroke
			(width 0)
			(type default)
		)
		(uuid "8d3d8e07-0985-43c0-b245-343ddf9fe508")
	)
	(wire
		(pts
			(xy 149.86 114.3) (xy 154.94 114.3)
		)
		(stroke
			(width 0)
			(type default)
		)
		(uuid "8d83a2b1-09cd-412f-a8ae-53afcd2f52bc")
	)
	(wire
		(pts
			(xy 152.4 74.93) (xy 152.4 85.09)
		)
		(stroke
			(width 0)
			(type default)
		)
		(uuid "9c9eda74-2fff-45a4-a66a-44824f065186")
	)
	(wire
		(pts
			(xy 134.62 62.23) (xy 138.43 62.23)
		)
		(stroke
			(width 0)
			(type default)
		)
		(uuid "abb9bbb4-ba94-417b-a183-7b92dfc1e122")
	)
	(wire
		(pts
			(xy 53.34 190.5) (xy 53.34 191.77)
		)
		(stroke
			(width 0)
			(type default)
		)
		(uuid "bad7b600-da62-4ae5-b7ce-a0eeaae5ba17")
	)
	(wire
		(pts
			(xy 149.86 116.84) (xy 149.86 114.3)
		)
		(stroke
			(width 0)
			(type default)
		)
		(uuid "bbc3e2e3-1771-4603-95ec-5fea3346acf3")
	)
	(wire
		(pts
			(xy 114.3 102.87) (xy 114.3 99.06)
		)
		(stroke
			(width 0)
			(type default)
		)
		(uuid "c5697fc4-1857-4b6e-acd6-d1e0bba798d3")
	)
	(wire
		(pts
			(xy 246.38 88.9) (xy 247.65 88.9)
		)
		(stroke
			(width 0)
			(type default)
		)
		(uuid "c6e46be9-134d-4031-b803-8570ea93f9bc")
	)
	(wire
		(pts
			(xy 138.43 72.39) (xy 134.62 72.39)
		)
		(stroke
			(width 0)
			(type default)
		)
		(uuid "c8b1f918-6547-4e3a-8dfb-a5eae1669166")
	)
	(wire
		(pts
			(xy 191.77 102.87) (xy 191.77 99.06)
		)
		(stroke
			(width 0)
			(type default)
		)
		(uuid "d13a6662-a93c-411e-82c9-f5681cf9c5d6")
	)
	(wire
		(pts
			(xy 119.38 93.98) (xy 134.62 93.98)
		)
		(stroke
			(width 0)
			(type default)
		)
		(uuid "d507f2ba-e9c5-4b56-8a15-4cda6a1a322c")
	)
	(wire
		(pts
			(xy 246.38 99.06) (xy 247.65 99.06)
		)
		(stroke
			(width 0)
			(type default)
		)
		(uuid "da2028c8-3995-4017-9c9c-53774e8258a7")
	)
	(wire
		(pts
			(xy 154.94 77.47) (xy 154.94 85.09)
		)
		(stroke
			(width 0)
			(type default)
		)
		(uuid "f610b67a-9a07-4d9b-8ed9-10c4b66ae6e7")
	)
	(wire
		(pts
			(xy 134.62 69.85) (xy 138.43 69.85)
		)
		(stroke
			(width 0)
			(type default)
		)
		(uuid "fb84b88c-70da-4ac9-a053-48af4dc5107b")
	)
	(wire
		(pts
			(xy 157.48 80.01) (xy 157.48 85.09)
		)
		(stroke
			(width 0)
			(type default)
		)
		(uuid "fd9d80ca-bb68-47a9-894b-9e2937371fb8")
	)
	(label "EN"
		(at 152.4 74.93 0)
		(fields_autoplaced yes)
		(effects
			(font
				(size 1.27 1.27)
			)
			(justify left bottom)
		)
		(uuid "373620a5-282b-4205-95d4-d243a0f8805d")
	)
	(label "TX_EN"
		(at 138.43 69.85 0)
		(fields_autoplaced yes)
		(effects
			(font
				(size 1.27 1.27)
			)
			(justify left bottom)
		)
		(uuid "4afc8037-2544-4333-b046-dcc8421016c8")
	)
	(label "TX_EN"
		(at 154.94 77.47 0)
		(fields_autoplaced yes)
		(effects
			(font
				(size 1.27 1.27)
			)
			(justify left bottom)
		)
		(uuid "769e8659-5ac9-4f35-9b88-fd27530cbb5c")
	)
	(label "EN"
		(at 138.43 67.31 0)
		(fields_autoplaced yes)
		(effects
			(font
				(size 1.27 1.27)
			)
			(justify left bottom)
		)
		(uuid "7e0c6880-3403-4c2f-b0a7-33cc289a2c65")
	)
	(label "FSENSE"
		(at 138.43 62.23 0)
		(fields_autoplaced yes)
		(effects
			(font
				(size 1.27 1.27)
			)
			(justify left bottom)
		)
		(uuid "9c04fcb7-ed29-4ee6-911a-62bbeb160cec")
	)
	(label "PSENSE"
		(at 138.43 64.77 0)
		(fields_autoplaced yes)
		(effects
			(font
				(size 1.27 1.27)
			)
			(justify left bottom)
		)
		(uuid "b0b08b89-91c3-4cbb-90b4-2105371f1f16")
	)
	(label "PSENSE"
		(at 157.48 80.01 0)
		(fields_autoplaced yes)
		(effects
			(font
				(size 1.27 1.27)
			)
			(justify left bottom)
		)
		(uuid "d2ff97cd-6e4b-4706-9900-fc759024c6d5")
	)
	(label "FSENSE"
		(at 160.02 82.55 0)
		(fields_autoplaced yes)
		(effects
			(font
				(size 1.27 1.27)
			)
			(justify left bottom)
		)
		(uuid "fd5b91b5-7967-4298-bc62-2e9e8bc2f13c")
	)
	(global_label "3V3"
		(shape input)
		(at 243.84 93.98 180)
		(fields_autoplaced yes)
		(effects
			(font
				(size 1.27 1.27)
			)
			(justify right)
		)
		(uuid "d64f6958-987b-4f46-bd4b-59144cc10af4")
		(property "Intersheetrefs" "${INTERSHEET_REFS}"
			(at 237.9193 93.9006 0)
			(effects
				(font
					(size 1.27 1.27)
				)
				(justify right)
				(hide yes)
			)
		)
	)
	(symbol
		(lib_id "lsf-kicad:PQ9ISH-Connector")
		(at 262.89 95.25 0)
		(unit 1)
		(exclude_from_sim no)
		(in_bom yes)
		(on_board yes)
		(dnp no)
		(uuid "009f1044-8b4b-41b9-ae7b-f5190dc8ccb8")
		(property "Reference" "PQ101"
			(at 251.46 83.82 0)
			(effects
				(font
					(size 1.27 1.27)
				)
				(justify left)
			)
		)
		(property "Value" "PQ9-Connector"
			(at 251.46 81.28 0)
			(effects
				(font
					(size 1.27 1.27)
				)
				(justify left)
			)
		)
		(property "Footprint" "Connector_PinSocket_2.00mm:PinSocket_1x09_P2.00mm_Vertical"
			(at 260.35 106.68 0)
			(effects
				(font
					(size 1.27 1.27)
				)
				(hide yes)
			)
		)
		(property "Datasheet" "https://libre.space/pq9ish"
			(at 278.13 110.49 0)
			(effects
				(font
					(size 1.27 1.27)
				)
				(hide yes)
			)
		)
		(property "Description" ""
			(at 262.89 95.25 0)
			(effects
				(font
					(size 1.27 1.27)
				)
				(hide yes)
			)
		)
		(property "Manufacturer Name" ""
			(at 262.89 95.25 0)
			(effects
				(font
					(size 1.27 1.27)
				)
				(hide yes)
			)
		)
		(property "Mfr Part Number" ""
			(at 262.89 95.25 0)
			(effects
				(font
					(size 1.27 1.27)
				)
				(hide yes)
			)
		)
		(property "Mnf." "Samtec"
			(at 262.89 95.25 0)
			(effects
				(font
					(size 1.27 1.27)
				)
				(hide yes)
			)
		)
		(property "Part Number" "SQT-109-03-L-S"
			(at 262.89 95.25 0)
			(effects
				(font
					(size 1.27 1.27)
				)
				(hide yes)
			)
		)
		(pin "1"
			(uuid "62af997f-b9a8-4acd-9d8f-0b62941c4c74")
		)
		(pin "2"
			(uuid "70a6ca8b-315e-44c3-9a77-9555e18d3f28")
		)
		(pin "3"
			(uuid "c5f0dd65-e21b-43fa-a858-cac8b1b95e57")
		)
		(pin "4"
			(uuid "d1552f04-ca3f-4e58-9bdc-a90f3ab57397")
		)
		(pin "5"
			(uuid "16163a51-28ab-4529-a27b-dc8758f4397a")
		)
		(pin "6"
			(uuid "5df30c7e-edfe-4351-9cc3-9090d533eba5")
		)
		(pin "7"
			(uuid "ade170ae-b9b3-4417-b404-f1056c1e6933")
		)
		(pin "8"
			(uuid "e1b572a1-35ef-43f8-8054-30b5192c1368")
		)
		(pin "9"
			(uuid "af843e42-7c13-4a4e-82ac-7e007d7992d5")
		)
		(instances
			(project "sidloc-rffe"
				(path "/909b030b-fa1a-4fe8-b1ee-422b4d9e23cf"
					(reference "PQ101")
					(unit 1)
				)
			)
		)
	)
	(symbol
		(lib_id "Mechanical:MountingHole_Pad")
		(at 53.34 173.99 0)
		(unit 1)
		(exclude_from_sim no)
		(in_bom no)
		(on_board yes)
		(dnp no)
		(fields_autoplaced yes)
		(uuid "17b359d0-865f-40fe-b8ba-22d60f36ccd0")
		(property "Reference" "H103"
			(at 55.88 171.4499 0)
			(effects
				(font
					(size 1.27 1.27)
				)
				(justify left)
			)
		)
		(property "Value" "MountingHole_2.5mm_Pad"
			(at 55.88 173.9899 0)
			(effects
				(font
					(size 1.27 1.27)
				)
				(justify left)
			)
		)
		(property "Footprint" "MountingHole:MountingHole_2.5mm_Pad"
			(at 53.34 173.99 0)
			(effects
				(font
					(size 1.27 1.27)
				)
				(hide yes)
			)
		)
		(property "Datasheet" "~"
			(at 53.34 173.99 0)
			(effects
				(font
					(size 1.27 1.27)
				)
				(hide yes)
			)
		)
		(property "Description" ""
			(at 53.34 173.99 0)
			(effects
				(font
					(size 1.27 1.27)
				)
				(hide yes)
			)
		)
		(pin "1"
			(uuid "e3537849-fa2a-4577-8897-d14232723e97")
		)
		(instances
			(project "sidloc-rffe"
				(path "/909b030b-fa1a-4fe8-b1ee-422b4d9e23cf"
					(reference "H103")
					(unit 1)
				)
			)
		)
	)
	(symbol
		(lib_id "power:GNDA")
		(at 191.77 102.87 0)
		(unit 1)
		(exclude_from_sim no)
		(in_bom yes)
		(on_board yes)
		(dnp no)
		(uuid "2b41b87e-9122-4a13-8295-7adda3629752")
		(property "Reference" "#PWR0105"
			(at 191.77 109.22 0)
			(effects
				(font
					(size 1.27 1.27)
				)
				(hide yes)
			)
		)
		(property "Value" "GNDA"
			(at 191.77 106.68 0)
			(effects
				(font
					(size 1.27 1.27)
				)
			)
		)
		(property "Footprint" ""
			(at 191.77 102.87 0)
			(effects
				(font
					(size 1.27 1.27)
				)
				(hide yes)
			)
		)
		(property "Datasheet" ""
			(at 191.77 102.87 0)
			(effects
				(font
					(size 1.27 1.27)
				)
				(hide yes)
			)
		)
		(property "Description" ""
			(at 191.77 102.87 0)
			(effects
				(font
					(size 1.27 1.27)
				)
				(hide yes)
			)
		)
		(pin "1"
			(uuid "bb8fa915-00c2-4506-9dd7-0918ba4e13b3")
		)
		(instances
			(project "sidloc-rffe"
				(path "/909b030b-fa1a-4fe8-b1ee-422b4d9e23cf"
					(reference "#PWR0105")
					(unit 1)
				)
			)
		)
	)
	(symbol
		(lib_id "Connector_Generic:Conn_01x05")
		(at 129.54 67.31 0)
		(mirror y)
		(unit 1)
		(exclude_from_sim no)
		(in_bom yes)
		(on_board yes)
		(dnp no)
		(uuid "34a9efcc-7c24-4047-9189-ae2103c69ed5")
		(property "Reference" "J101"
			(at 116.84 68.58 0)
			(effects
				(font
					(size 1.27 1.27)
				)
			)
		)
		(property "Value" "PicoBlade_1x5_Vertical"
			(at 116.84 66.04 0)
			(effects
				(font
					(size 1.27 1.27)
				)
			)
		)
		(property "Footprint" "Connector_Molex:Molex_PicoBlade_53261-0571_1x05-1MP_P1.25mm_Horizontal"
			(at 129.54 67.31 0)
			(effects
				(font
					(size 1.27 1.27)
				)
				(hide yes)
			)
		)
		(property "Datasheet" "~"
			(at 129.54 67.31 0)
			(effects
				(font
					(size 1.27 1.27)
				)
				(hide yes)
			)
		)
		(property "Description" ""
			(at 129.54 67.31 0)
			(effects
				(font
					(size 1.27 1.27)
				)
				(hide yes)
			)
		)
		(property "Manufacturer Name" ""
			(at 129.54 67.31 0)
			(effects
				(font
					(size 1.27 1.27)
				)
				(hide yes)
			)
		)
		(property "Mfr Part Number" ""
			(at 129.54 67.31 0)
			(effects
				(font
					(size 1.27 1.27)
				)
				(hide yes)
			)
		)
		(property "Mnf." "Molex"
			(at 129.54 67.31 0)
			(effects
				(font
					(size 1.27 1.27)
				)
				(hide yes)
			)
		)
		(property "Part Number" "53261-0571"
			(at 129.54 67.31 0)
			(effects
				(font
					(size 1.27 1.27)
				)
				(hide yes)
			)
		)
		(pin "1"
			(uuid "6b45e38e-c1ce-4bcb-bde5-ed0afb62c3bd")
		)
		(pin "2"
			(uuid "0d770045-2a3e-49da-a956-0aac8a251755")
		)
		(pin "3"
			(uuid "e512eb47-d607-4035-bc5a-386d7a9637db")
		)
		(pin "4"
			(uuid "98d239c3-95ff-42fc-bfb9-921d3b7e49be")
		)
		(pin "5"
			(uuid "25a4d478-010f-47d2-91dc-cbce12795e95")
		)
		(instances
			(project "sidloc-rffe"
				(path "/909b030b-fa1a-4fe8-b1ee-422b4d9e23cf"
					(reference "J101")
					(unit 1)
				)
			)
		)
	)
	(symbol
		(lib_id "power:PWR_FLAG")
		(at 154.94 113.03 0)
		(unit 1)
		(exclude_from_sim no)
		(in_bom yes)
		(on_board yes)
		(dnp no)
		(uuid "45e55271-af18-4a3d-b8c0-3ee1827d72d4")
		(property "Reference" "#FLG0102"
			(at 154.94 111.125 0)
			(effects
				(font
					(size 1.27 1.27)
				)
				(hide yes)
			)
		)
		(property "Value" "PWR_FLAG"
			(at 161.29 111.76 0)
			(effects
				(font
					(size 1.27 1.27)
				)
			)
		)
		(property "Footprint" ""
			(at 154.94 113.03 0)
			(effects
				(font
					(size 1.27 1.27)
				)
				(hide yes)
			)
		)
		(property "Datasheet" "~"
			(at 154.94 113.03 0)
			(effects
				(font
					(size 1.27 1.27)
				)
				(hide yes)
			)
		)
		(property "Description" ""
			(at 154.94 113.03 0)
			(effects
				(font
					(size 1.27 1.27)
				)
				(hide yes)
			)
		)
		(pin "1"
			(uuid "eea219f6-21ff-421b-899a-f574227faa7d")
		)
		(instances
			(project "sidloc-rffe"
				(path "/909b030b-fa1a-4fe8-b1ee-422b4d9e23cf"
					(reference "#FLG0102")
					(unit 1)
				)
			)
		)
	)
	(symbol
		(lib_id "power:GND")
		(at 138.43 74.93 0)
		(unit 1)
		(exclude_from_sim no)
		(in_bom yes)
		(on_board yes)
		(dnp no)
		(uuid "46a041f6-82c6-4f80-8980-f0065422cb4a")
		(property "Reference" "#PWR0101"
			(at 138.43 81.28 0)
			(effects
				(font
					(size 1.27 1.27)
				)
				(hide yes)
			)
		)
		(property "Value" "GND"
			(at 138.43 78.74 0)
			(effects
				(font
					(size 1.27 1.27)
				)
			)
		)
		(property "Footprint" ""
			(at 138.43 74.93 0)
			(effects
				(font
					(size 1.27 1.27)
				)
				(hide yes)
			)
		)
		(property "Datasheet" ""
			(at 138.43 74.93 0)
			(effects
				(font
					(size 1.27 1.27)
				)
				(hide yes)
			)
		)
		(property "Description" ""
			(at 138.43 74.93 0)
			(effects
				(font
					(size 1.27 1.27)
				)
				(hide yes)
			)
		)
		(pin "1"
			(uuid "41da443c-deaf-4a6b-ad10-a204d1304a27")
		)
		(instances
			(project "sidloc-rffe"
				(path "/909b030b-fa1a-4fe8-b1ee-422b4d9e23cf"
					(reference "#PWR0101")
					(unit 1)
				)
			)
		)
	)
	(symbol
		(lib_id "Connector:Conn_Coaxial")
		(at 114.3 93.98 0)
		(mirror y)
		(unit 1)
		(exclude_from_sim no)
		(in_bom yes)
		(on_board yes)
		(dnp no)
		(uuid "47210e29-8739-440e-9f94-0aaf938228e5")
		(property "Reference" "J102"
			(at 109.22 91.44 0)
			(effects
				(font
					(size 1.27 1.27)
				)
			)
		)
		(property "Value" "Conn_Coaxial"
			(at 105.41 93.98 0)
			(effects
				(font
					(size 1.27 1.27)
				)
			)
		)
		(property "Footprint" "Connector_Coaxial:U.FL_Hirose_U.FL-R-SMT-1_Vertical"
			(at 114.3 93.98 0)
			(effects
				(font
					(size 1.27 1.27)
				)
				(hide yes)
			)
		)
		(property "Datasheet" "~"
			(at 114.3 93.98 0)
			(effects
				(font
					(size 1.27 1.27)
				)
				(hide yes)
			)
		)
		(property "Description" ""
			(at 114.3 93.98 0)
			(effects
				(font
					(size 1.27 1.27)
				)
				(hide yes)
			)
		)
		(property "Manufacturer Name" ""
			(at 114.3 93.98 0)
			(effects
				(font
					(size 1.27 1.27)
				)
				(hide yes)
			)
		)
		(property "Mfr Part Number" ""
			(at 114.3 93.98 0)
			(effects
				(font
					(size 1.27 1.27)
				)
				(hide yes)
			)
		)
		(property "Mnf." "Hirose"
			(at 114.3 93.98 0)
			(effects
				(font
					(size 1.27 1.27)
				)
				(hide yes)
			)
		)
		(property "Part Number" "U.FL-R-SMT(01)"
			(at 114.3 93.98 0)
			(effects
				(font
					(size 1.27 1.27)
				)
				(hide yes)
			)
		)
		(pin "1"
			(uuid "86cfacbf-1a67-4991-bc27-4f89798c8fd4")
		)
		(pin "2"
			(uuid "ecd5a632-f976-418b-8e4b-d4d4ec6b411a")
		)
		(instances
			(project "sidloc-rffe"
				(path "/909b030b-fa1a-4fe8-b1ee-422b4d9e23cf"
					(reference "J102")
					(unit 1)
				)
			)
		)
	)
	(symbol
		(lib_id "power:GNDA")
		(at 149.86 116.84 0)
		(unit 1)
		(exclude_from_sim no)
		(in_bom yes)
		(on_board yes)
		(dnp no)
		(uuid "48d1ef22-1e6a-42c7-8038-9001a1fed7a7")
		(property "Reference" "#PWR0102"
			(at 149.86 123.19 0)
			(effects
				(font
					(size 1.27 1.27)
				)
				(hide yes)
			)
		)
		(property "Value" "GNDA"
			(at 149.86 120.65 0)
			(effects
				(font
					(size 1.27 1.27)
				)
			)
		)
		(property "Footprint" ""
			(at 149.86 116.84 0)
			(effects
				(font
					(size 1.27 1.27)
				)
				(hide yes)
			)
		)
		(property "Datasheet" ""
			(at 149.86 116.84 0)
			(effects
				(font
					(size 1.27 1.27)
				)
				(hide yes)
			)
		)
		(property "Description" ""
			(at 149.86 116.84 0)
			(effects
				(font
					(size 1.27 1.27)
				)
				(hide yes)
			)
		)
		(pin "1"
			(uuid "d67cfd7b-523b-4600-b9a1-eff21f814c4d")
		)
		(instances
			(project "sidloc-rffe"
				(path "/909b030b-fa1a-4fe8-b1ee-422b4d9e23cf"
					(reference "#PWR0102")
					(unit 1)
				)
			)
		)
	)
	(symbol
		(lib_id "Mechanical:MountingHole_Pad")
		(at 53.34 187.96 0)
		(unit 1)
		(exclude_from_sim no)
		(in_bom no)
		(on_board yes)
		(dnp no)
		(fields_autoplaced yes)
		(uuid "608dca22-d63c-499a-b230-c15f0d76158e")
		(property "Reference" "H104"
			(at 55.88 185.4199 0)
			(effects
				(font
					(size 1.27 1.27)
				)
				(justify left)
			)
		)
		(property "Value" "MountingHole_2.5mm_Pad"
			(at 55.88 187.9599 0)
			(effects
				(font
					(size 1.27 1.27)
				)
				(justify left)
			)
		)
		(property "Footprint" "MountingHole:MountingHole_2.5mm_Pad"
			(at 53.34 187.96 0)
			(effects
				(font
					(size 1.27 1.27)
				)
				(hide yes)
			)
		)
		(property "Datasheet" "~"
			(at 53.34 187.96 0)
			(effects
				(font
					(size 1.27 1.27)
				)
				(hide yes)
			)
		)
		(property "Description" ""
			(at 53.34 187.96 0)
			(effects
				(font
					(size 1.27 1.27)
				)
				(hide yes)
			)
		)
		(pin "1"
			(uuid "9cea4979-db03-4d1a-92bd-a7c3d03a459c")
		)
		(instances
			(project "sidloc-rffe"
				(path "/909b030b-fa1a-4fe8-b1ee-422b4d9e23cf"
					(reference "H104")
					(unit 1)
				)
			)
		)
	)
	(symbol
		(lib_id "power:GND")
		(at 160.02 116.84 0)
		(unit 1)
		(exclude_from_sim no)
		(in_bom yes)
		(on_board yes)
		(dnp no)
		(uuid "70309ae0-353d-4036-a00d-c4ba943201be")
		(property "Reference" "#PWR0103"
			(at 160.02 123.19 0)
			(effects
				(font
					(size 1.27 1.27)
				)
				(hide yes)
			)
		)
		(property "Value" "GND"
			(at 160.02 120.65 0)
			(effects
				(font
					(size 1.27 1.27)
				)
			)
		)
		(property "Footprint" ""
			(at 160.02 116.84 0)
			(effects
				(font
					(size 1.27 1.27)
				)
				(hide yes)
			)
		)
		(property "Datasheet" ""
			(at 160.02 116.84 0)
			(effects
				(font
					(size 1.27 1.27)
				)
				(hide yes)
			)
		)
		(property "Description" ""
			(at 160.02 116.84 0)
			(effects
				(font
					(size 1.27 1.27)
				)
				(hide yes)
			)
		)
		(pin "1"
			(uuid "5f98b124-8aa6-4eaa-a5dd-18b03b6c0719")
		)
		(instances
			(project "sidloc-rffe"
				(path "/909b030b-fa1a-4fe8-b1ee-422b4d9e23cf"
					(reference "#PWR0103")
					(unit 1)
				)
			)
		)
	)
	(symbol
		(lib_id "Mechanical:MountingHole_Pad")
		(at 19.05 173.99 0)
		(unit 1)
		(exclude_from_sim no)
		(in_bom no)
		(on_board yes)
		(dnp no)
		(fields_autoplaced yes)
		(uuid "8c35cd2e-8b87-47f0-9f55-e06c80c6d0df")
		(property "Reference" "H101"
			(at 21.59 171.4499 0)
			(effects
				(font
					(size 1.27 1.27)
				)
				(justify left)
			)
		)
		(property "Value" "MountingHole_2.5mm_Pad"
			(at 21.59 173.9899 0)
			(effects
				(font
					(size 1.27 1.27)
				)
				(justify left)
			)
		)
		(property "Footprint" "MountingHole:MountingHole_2.5mm_Pad"
			(at 19.05 173.99 0)
			(effects
				(font
					(size 1.27 1.27)
				)
				(hide yes)
			)
		)
		(property "Datasheet" "~"
			(at 19.05 173.99 0)
			(effects
				(font
					(size 1.27 1.27)
				)
				(hide yes)
			)
		)
		(property "Description" ""
			(at 19.05 173.99 0)
			(effects
				(font
					(size 1.27 1.27)
				)
				(hide yes)
			)
		)
		(pin "1"
			(uuid "618c107a-b421-479e-8fe8-387899a28b32")
		)
		(instances
			(project "sidloc-rffe"
				(path "/909b030b-fa1a-4fe8-b1ee-422b4d9e23cf"
					(reference "H101")
					(unit 1)
				)
			)
		)
	)
	(symbol
		(lib_id "Connector:Conn_Coaxial")
		(at 191.77 93.98 0)
		(unit 1)
		(exclude_from_sim no)
		(in_bom yes)
		(on_board yes)
		(dnp no)
		(fields_autoplaced yes)
		(uuid "ba75e3ba-bf6e-44d7-aee0-611690624c52")
		(property "Reference" "J103"
			(at 194.31 93.0031 0)
			(effects
				(font
					(size 1.27 1.27)
				)
				(justify left)
			)
		)
		(property "Value" "Antenna"
			(at 194.31 95.5431 0)
			(effects
				(font
					(size 1.27 1.27)
				)
				(justify left)
			)
		)
		(property "Footprint" "Connector_Coaxial:U.FL_Hirose_U.FL-R-SMT-1_Vertical"
			(at 191.77 93.98 0)
			(effects
				(font
					(size 1.27 1.27)
				)
				(hide yes)
			)
		)
		(property "Datasheet" "~"
			(at 191.77 93.98 0)
			(effects
				(font
					(size 1.27 1.27)
				)
				(hide yes)
			)
		)
		(property "Description" ""
			(at 191.77 93.98 0)
			(effects
				(font
					(size 1.27 1.27)
				)
				(hide yes)
			)
		)
		(property "Manufacturer Name" ""
			(at 191.77 93.98 0)
			(effects
				(font
					(size 1.27 1.27)
				)
				(hide yes)
			)
		)
		(property "Mfr Part Number" ""
			(at 191.77 93.98 0)
			(effects
				(font
					(size 1.27 1.27)
				)
				(hide yes)
			)
		)
		(property "Mnf." "Hirose"
			(at 191.77 93.98 0)
			(effects
				(font
					(size 1.27 1.27)
				)
				(hide yes)
			)
		)
		(property "Part Number" "U.FL-R-SMT(01)"
			(at 191.77 93.98 0)
			(effects
				(font
					(size 1.27 1.27)
				)
				(hide yes)
			)
		)
		(pin "1"
			(uuid "1996987c-3130-44d9-a324-e7b4cd433487")
		)
		(pin "2"
			(uuid "5e06ba3b-89d2-4649-954e-0a31ecb55cd8")
		)
		(instances
			(project "sidloc-rffe"
				(path "/909b030b-fa1a-4fe8-b1ee-422b4d9e23cf"
					(reference "J103")
					(unit 1)
				)
			)
		)
	)
	(symbol
		(lib_id "power:GND")
		(at 262.89 111.76 0)
		(unit 1)
		(exclude_from_sim no)
		(in_bom yes)
		(on_board yes)
		(dnp no)
		(uuid "bb9444a4-8611-4037-a530-df1e523483a0")
		(property "Reference" "#PWR0106"
			(at 262.89 118.11 0)
			(effects
				(font
					(size 1.27 1.27)
				)
				(hide yes)
			)
		)
		(property "Value" "GND"
			(at 262.89 115.57 0)
			(effects
				(font
					(size 1.27 1.27)
				)
			)
		)
		(property "Footprint" ""
			(at 262.89 111.76 0)
			(effects
				(font
					(size 1.27 1.27)
				)
				(hide yes)
			)
		)
		(property "Datasheet" ""
			(at 262.89 111.76 0)
			(effects
				(font
					(size 1.27 1.27)
				)
				(hide yes)
			)
		)
		(property "Description" ""
			(at 262.89 111.76 0)
			(effects
				(font
					(size 1.27 1.27)
				)
				(hide yes)
			)
		)
		(pin "1"
			(uuid "f0134c36-baed-44de-b4ed-fb0df90e1aaa")
		)
		(instances
			(project "sidloc-rffe"
				(path "/909b030b-fa1a-4fe8-b1ee-422b4d9e23cf"
					(reference "#PWR0106")
					(unit 1)
				)
			)
		)
	)
	(symbol
		(lib_id "Graphic:Logo_Open_Hardware_Small")
		(at 276.86 173.99 0)
		(unit 1)
		(exclude_from_sim yes)
		(in_bom no)
		(on_board no)
		(dnp no)
		(fields_autoplaced yes)
		(uuid "d12aaf61-fa1f-475f-8d17-dc47bd203293")
		(property "Reference" "#LOGO1"
			(at 276.86 167.005 0)
			(effects
				(font
					(size 1.27 1.27)
				)
				(hide yes)
			)
		)
		(property "Value" "Logo_Open_Hardware_Small"
			(at 276.86 179.705 0)
			(effects
				(font
					(size 1.27 1.27)
				)
				(hide yes)
			)
		)
		(property "Footprint" ""
			(at 276.86 173.99 0)
			(effects
				(font
					(size 1.27 1.27)
				)
				(hide yes)
			)
		)
		(property "Datasheet" "~"
			(at 276.86 173.99 0)
			(effects
				(font
					(size 1.27 1.27)
				)
				(hide yes)
			)
		)
		(property "Description" ""
			(at 276.86 173.99 0)
			(effects
				(font
					(size 1.27 1.27)
				)
				(hide yes)
			)
		)
		(instances
			(project "sidloc-rffe"
				(path "/909b030b-fa1a-4fe8-b1ee-422b4d9e23cf"
					(reference "#LOGO1")
					(unit 1)
				)
			)
			(project ""
				(path "/eebe9ed8-9203-41d8-aa26-d27c93b271cd"
					(reference "#LOGO1")
					(unit 1)
				)
			)
		)
	)
	(symbol
		(lib_id "power:GNDA")
		(at 114.3 102.87 0)
		(unit 1)
		(exclude_from_sim no)
		(in_bom yes)
		(on_board yes)
		(dnp no)
		(uuid "db42ca77-c70a-4eac-9be2-8acd786f2cae")
		(property "Reference" "#PWR0104"
			(at 114.3 109.22 0)
			(effects
				(font
					(size 1.27 1.27)
				)
				(hide yes)
			)
		)
		(property "Value" "GNDA"
			(at 114.3 106.68 0)
			(effects
				(font
					(size 1.27 1.27)
				)
			)
		)
		(property "Footprint" ""
			(at 114.3 102.87 0)
			(effects
				(font
					(size 1.27 1.27)
				)
				(hide yes)
			)
		)
		(property "Datasheet" ""
			(at 114.3 102.87 0)
			(effects
				(font
					(size 1.27 1.27)
				)
				(hide yes)
			)
		)
		(property "Description" ""
			(at 114.3 102.87 0)
			(effects
				(font
					(size 1.27 1.27)
				)
				(hide yes)
			)
		)
		(pin "1"
			(uuid "a5b01c5d-cb3a-40aa-8437-2a5d87e552f7")
		)
		(instances
			(project "sidloc-rffe"
				(path "/909b030b-fa1a-4fe8-b1ee-422b4d9e23cf"
					(reference "#PWR0104")
					(unit 1)
				)
			)
		)
	)
	(symbol
		(lib_id "Mechanical:MountingHole_Pad")
		(at 19.05 187.96 0)
		(unit 1)
		(exclude_from_sim no)
		(in_bom no)
		(on_board yes)
		(dnp no)
		(fields_autoplaced yes)
		(uuid "e79a799b-c004-459d-8602-291e7b772009")
		(property "Reference" "H102"
			(at 21.59 185.4199 0)
			(effects
				(font
					(size 1.27 1.27)
				)
				(justify left)
			)
		)
		(property "Value" "MountingHole_2.5mm_Pad"
			(at 21.59 187.9599 0)
			(effects
				(font
					(size 1.27 1.27)
				)
				(justify left)
			)
		)
		(property "Footprint" "MountingHole:MountingHole_2.5mm_Pad"
			(at 19.05 187.96 0)
			(effects
				(font
					(size 1.27 1.27)
				)
				(hide yes)
			)
		)
		(property "Datasheet" "~"
			(at 19.05 187.96 0)
			(effects
				(font
					(size 1.27 1.27)
				)
				(hide yes)
			)
		)
		(property "Description" ""
			(at 19.05 187.96 0)
			(effects
				(font
					(size 1.27 1.27)
				)
				(hide yes)
			)
		)
		(pin "1"
			(uuid "206b2ae0-d42a-4955-8635-1e850f64180f")
		)
		(instances
			(project "sidloc-rffe"
				(path "/909b030b-fa1a-4fe8-b1ee-422b4d9e23cf"
					(reference "H102")
					(unit 1)
				)
			)
		)
	)
	(sheet
		(at 134.62 85.09)
		(size 38.1 17.78)
		(stroke
			(width 0.1524)
			(type solid)
		)
		(fill
			(color 0 0 0 0.0000)
		)
		(uuid "a598f017-8ef1-48d5-b930-25db3058e07c")
		(property "Sheetname" "RFFE"
			(at 134.62 107.95 0)
			(effects
				(font
					(size 1.27 1.27)
				)
				(justify left bottom)
			)
		)
		(property "Sheetfile" "sidloc-schematic/rffe.kicad_sch"
			(at 134.62 103.4546 0)
			(effects
				(font
					(size 1.27 1.27)
				)
				(justify left top)
			)
		)
		(pin "EN" input
			(at 152.4 85.09 90)
			(effects
				(font
					(size 1.27 1.27)
				)
				(justify right)
			)
			(uuid "12bed8b3-91be-4eff-b1b1-13e5464e74fa")
		)
		(pin "TX_EN" input
			(at 154.94 85.09 90)
			(effects
				(font
					(size 1.27 1.27)
				)
				(justify right)
			)
			(uuid "caaca090-8b60-4689-b481-bc3bae4c655c")
		)
		(pin "RFIO" bidirectional
			(at 134.62 93.98 180)
			(effects
				(font
					(size 1.27 1.27)
				)
				(justify left)
			)
			(uuid "5f87a202-e6e7-4e87-b425-02300f6d81c0")
		)
		(pin "ANT" bidirectional
			(at 172.72 93.98 0)
			(effects
				(font
					(size 1.27 1.27)
				)
				(justify right)
			)
			(uuid "6af157a8-e28e-4e63-9f50-30706efb6e80")
		)
		(pin "PSENSE" output
			(at 157.48 85.09 90)
			(effects
				(font
					(size 1.27 1.27)
				)
				(justify right)
			)
			(uuid "8c7415b5-7976-4c7c-ab80-b85ce19547d4")
		)
		(pin "FSENSE" output
			(at 160.02 85.09 90)
			(effects
				(font
					(size 1.27 1.27)
				)
				(justify right)
			)
			(uuid "4a51292c-603f-4986-ba7a-1ebffcbfb823")
		)
		(instances
			(project "sidloc-rffe"
				(path "/909b030b-fa1a-4fe8-b1ee-422b4d9e23cf"
					(page "2")
				)
			)
		)
	)
	(sheet_instances
		(path "/"
			(page "1")
		)
	)
)
