(export (version D)
  (design
    (source /home/azisi/Documents/satnogs/satnogs-fm-notch/satnogs-fm-notch.sch)
    (date "Sat 25 Apr 2020 21:48:54 EEST")
    (tool "Eeschema 5.1.5-52549c5~86~ubuntu19.10.1")
    (sheet (number 1) (name /) (tstamps /)
      (title_block
        (title "SatNOGS FM Notch Filter")
        (company "Libre Space Foundation")
        (rev v1)
        (date 2017-02-20)
        (source satnogs-fm-notch.sch)
        (comment (number 1) (value ""))
        (comment (number 2) (value ""))
        (comment (number 3) (value ""))
        (comment (number 4) (value "")))))
  (components
    (comp (ref P2)
      (value Conn_RF)
      (footprint Connector_Coaxial:SMA_Amphenol_132289_EdgeMount)
      (fields
        (field (name Mnf.) 73251-1150))
      (libsource (lib Connector) (part Conn_Coaxial) (description "coaxial connector (BNC, SMA, SMB, SMC, Cinch/RCA, ...)"))
      (sheetpath (names /) (tstamps /))
      (tstamp 58AAC85E))
    (comp (ref P1)
      (value Conn_RF)
      (footprint Connector_Coaxial:SMA_Amphenol_132289_EdgeMount)
      (fields
        (field (name Mnf.) 73251-1150))
      (libsource (lib Connector) (part Conn_Coaxial) (description "coaxial connector (BNC, SMA, SMB, SMC, Cinch/RCA, ...)"))
      (sheetpath (names /) (tstamps /))
      (tstamp 58AAC8EE))
    (comp (ref C1)
      (value 6.8p)
      (footprint Capacitor_SMD:C_0603_1608Metric)
      (fields
        (field (name Mnf.) GRM1885C1H6R8DA01D))
      (libsource (lib Device) (part C) (description "Unpolarized capacitor"))
      (sheetpath (names /) (tstamps /))
      (tstamp 58AAC968))
    (comp (ref C3)
      (value 15pF)
      (footprint Capacitor_SMD:C_0603_1608Metric)
      (fields
        (field (name Mnf.) GRM1885C1H150JA01D))
      (libsource (lib Device) (part C) (description "Unpolarized capacitor"))
      (sheetpath (names /) (tstamps /))
      (tstamp 58AACA68))
    (comp (ref C5)
      (value 15pF)
      (footprint Capacitor_SMD:C_0603_1608Metric)
      (fields
        (field (name Mnf.) GRM1885C1H150JA01D))
      (libsource (lib Device) (part C) (description "Unpolarized capacitor"))
      (sheetpath (names /) (tstamps /))
      (tstamp 58AACAB0))
    (comp (ref C7)
      (value 6.8pF)
      (footprint Capacitor_SMD:C_0603_1608Metric)
      (fields
        (field (name Mnf.) GRM1885C1H6R8DA01D))
      (libsource (lib Device) (part C) (description "Unpolarized capacitor"))
      (sheetpath (names /) (tstamps /))
      (tstamp 58AACAF5))
    (comp (ref L1)
      (value 330nF)
      (footprint Inductor_SMD:L_0603_1608Metric)
      (fields
        (field (name Mnf.) LQW18CNR33J00))
      (libsource (lib Device) (part L) (description Inductor))
      (sheetpath (names /) (tstamps /))
      (tstamp 58AACB35))
    (comp (ref L3)
      (value 180nH)
      (footprint Inductor_SMD:L_0603_1608Metric)
      (fields
        (field (name Mnf.) 0603AS-R18J-YY))
      (libsource (lib Device) (part L) (description Inductor))
      (sheetpath (names /) (tstamps /))
      (tstamp 58AACC49))
    (comp (ref L7)
      (value 330nF)
      (footprint Inductor_SMD:L_0603_1608Metric)
      (fields
        (field (name Mnf.) LQW18CNR33J00))
      (libsource (lib Device) (part L) (description Inductor))
      (sheetpath (names /) (tstamps /))
      (tstamp 58AACCEE))
    (comp (ref L2)
      (value 22nH)
      (footprint Inductor_SMD:L_0603_1608Metric)
      (fields
        (field (name Mnf.) 0603AS-022J-YY))
      (libsource (lib Device) (part L) (description Inductor))
      (sheetpath (names /) (tstamps /))
      (tstamp 58AACD3C))
    (comp (ref L4)
      (value 27nF)
      (footprint Inductor_SMD:L_0603_1608Metric)
      (fields
        (field (name Mnf.) 0603AS-027J-YY))
      (libsource (lib Device) (part L) (description Inductor))
      (sheetpath (names /) (tstamps /))
      (tstamp 58AACE15))
    (comp (ref L6)
      (value 22nH)
      (footprint Inductor_SMD:L_0603_1608Metric)
      (fields
        (field (name Mnf.) 0603AS-022J-YY))
      (libsource (lib Device) (part L) (description Inductor))
      (sheetpath (names /) (tstamps /))
      (tstamp 58AACE73))
    (comp (ref C2)
      (value 100pF)
      (footprint Capacitor_SMD:C_0603_1608Metric)
      (fields
        (field (name Mnf.) GRM1885C1H101JA01D))
      (libsource (lib Device) (part C) (description "Unpolarized capacitor"))
      (sheetpath (names /) (tstamps /))
      (tstamp 58AACED4))
    (comp (ref C4)
      (value 100pF)
      (footprint Capacitor_SMD:C_0603_1608Metric)
      (fields
        (field (name Mnf.) GRM1885C1H101JA01D))
      (libsource (lib Device) (part C) (description "Unpolarized capacitor"))
      (sheetpath (names /) (tstamps /))
      (tstamp 58AACF4A))
    (comp (ref C6)
      (value 100pF)
      (footprint Capacitor_SMD:C_0603_1608Metric)
      (fields
        (field (name Mnf.) GRM1885C1H101JA01D))
      (libsource (lib Device) (part C) (description "Unpolarized capacitor"))
      (sheetpath (names /) (tstamps /))
      (tstamp 58AACFB3))
    (comp (ref L5)
      (value 180nF)
      (footprint Inductor_SMD:L_0603_1608Metric)
      (fields
        (field (name Mnf.) 0603AS-R18J-YY))
      (libsource (lib Device) (part L) (description Inductor))
      (sheetpath (names /) (tstamps /))
      (tstamp 58AACCA1)))
  (libparts
    (libpart (lib Connector) (part Conn_Coaxial)
      (description "coaxial connector (BNC, SMA, SMB, SMC, Cinch/RCA, ...)")
      (docs " ~")
      (footprints
        (fp *BNC*)
        (fp *SMA*)
        (fp *SMB*)
        (fp *SMC*)
        (fp *Cinch*))
      (fields
        (field (name Reference) J)
        (field (name Value) Conn_Coaxial))
      (pins
        (pin (num 1) (name In) (type passive))
        (pin (num 2) (name Ext) (type passive))))
    (libpart (lib Device) (part C)
      (description "Unpolarized capacitor")
      (docs ~)
      (footprints
        (fp C_*))
      (fields
        (field (name Reference) C)
        (field (name Value) C))
      (pins
        (pin (num 1) (name ~) (type passive))
        (pin (num 2) (name ~) (type passive))))
    (libpart (lib Device) (part L)
      (description Inductor)
      (docs ~)
      (footprints
        (fp Choke_*)
        (fp *Coil*)
        (fp Inductor_*)
        (fp L_*))
      (fields
        (field (name Reference) L)
        (field (name Value) L))
      (pins
        (pin (num 1) (name 1) (type passive))
        (pin (num 2) (name 2) (type passive)))))
  (libraries
    (library (logical Connector)
      (uri /usr/share/kicad/library/Connector.lib))
    (library (logical Device)
      (uri /usr/share/kicad/library/Device.lib)))
  (nets
    (net (code 1) (name "Net-(C6-Pad1)")
      (node (ref L6) (pin 2))
      (node (ref C7) (pin 1))
      (node (ref C6) (pin 1))
      (node (ref P2) (pin 1)))
    (net (code 2) (name GND)
      (node (ref L1) (pin 2))
      (node (ref L7) (pin 2))
      (node (ref L3) (pin 2))
      (node (ref P1) (pin 2))
      (node (ref P2) (pin 2))
      (node (ref L5) (pin 2)))
    (net (code 3) (name "Net-(C2-Pad1)")
      (node (ref C3) (pin 1))
      (node (ref C4) (pin 2))
      (node (ref L2) (pin 2))
      (node (ref L4) (pin 1))
      (node (ref C2) (pin 1)))
    (net (code 4) (name "Net-(C4-Pad1)")
      (node (ref C6) (pin 2))
      (node (ref C4) (pin 1))
      (node (ref L4) (pin 2))
      (node (ref L6) (pin 1))
      (node (ref C5) (pin 1)))
    (net (code 5) (name "Net-(C7-Pad2)")
      (node (ref C7) (pin 2))
      (node (ref L7) (pin 1)))
    (net (code 6) (name "Net-(C5-Pad2)")
      (node (ref C5) (pin 2))
      (node (ref L5) (pin 1)))
    (net (code 7) (name "Net-(C3-Pad2)")
      (node (ref L3) (pin 1))
      (node (ref C3) (pin 2)))
    (net (code 8) (name "Net-(C1-Pad2)")
      (node (ref C1) (pin 2))
      (node (ref L1) (pin 1)))
    (net (code 9) (name "Net-(C1-Pad1)")
      (node (ref P1) (pin 1))
      (node (ref C1) (pin 1))
      (node (ref L2) (pin 1))
      (node (ref C2) (pin 2)))))