EESchema Schematic File Version 4
EELAYER 30 0
EELAYER END
$Descr A3 16535 11693
encoding utf-8
Sheet 1 1
Title "SatNOGS COMMS Morhpo144 Shield"
Date "2020-03-12"
Rev ""
Comp "Libre Space Foundation"
Comment1 ""
Comment2 ""
Comment3 ""
Comment4 ""
$EndDescr
$Comp
L power:GND #PWR0101
U 1 1 5E6BD3F0
P 8450 9900
F 0 "#PWR0101" H 8450 9650 50  0001 C CNN
F 1 "GND" H 8455 9727 50  0000 C CNN
F 2 "" H 8450 9900 50  0001 C CNN
F 3 "" H 8450 9900 50  0001 C CNN
	1    8450 9900
	1    0    0    -1  
$EndComp
Wire Wire Line
	8450 9900 8450 9700
$Comp
L Connector_Generic:Conn_01x20 J1
U 1 1 5E6BA40F
P 5450 8900
F 0 "J1" H 5368 7675 50  0000 C CNN
F 1 "XPRO CONN" H 5368 7766 50  0000 C CNN
F 2 "Connector_PinHeader_2.54mm:PinHeader_2x10_P2.54mm_Horizontal" H 5450 8900 50  0001 C CNN
F 3 "~" H 5450 8900 50  0001 C CNN
	1    5450 8900
	-1   0    0    1   
$EndComp
Text Label 5650 9800 0    50   ~ 0
XPRO_ID_DATA
Text Label 5650 9400 0    50   ~ 0
LED_D2_Y
Text Label 5650 9300 0    50   ~ 0
LED_D1_G
Text Label 5650 9200 0    50   ~ 0
XPRO_RESET
Text Label 5650 9000 0    50   ~ 0
XPRO_IRQ
Text Label 5650 8800 0    50   ~ 0
XPRO_SDA
Text Label 5650 8700 0    50   ~ 0
XPRO_SCL
Text Label 5650 8400 0    50   ~ 0
XPRO_SS
Text Label 5650 8300 0    50   ~ 0
XPRO_MOSI
Text Label 5650 8200 0    50   ~ 0
XPRO_MISO
Text Label 5650 8100 0    50   ~ 0
XPRO_SPI_SCK
NoConn ~ 5650 9600
NoConn ~ 5650 9500
NoConn ~ 5650 9100
NoConn ~ 5650 8900
NoConn ~ 5650 8600
NoConn ~ 5650 8500
$Comp
L power:GND #PWR0102
U 1 1 5E6CDF8A
P 6100 9900
F 0 "#PWR0102" H 6100 9650 50  0001 C CNN
F 1 "GND" H 6105 9727 50  0000 C CNN
F 2 "" H 6100 9900 50  0001 C CNN
F 3 "" H 6100 9900 50  0001 C CNN
	1    6100 9900
	1    0    0    -1  
$EndComp
$Comp
L power:GND #PWR0103
U 1 1 5E6CE5F9
P 6200 8000
F 0 "#PWR0103" H 6200 7750 50  0001 C CNN
F 1 "GND" H 6205 7827 50  0000 C CNN
F 2 "" H 6200 8000 50  0001 C CNN
F 3 "" H 6200 8000 50  0001 C CNN
	1    6200 8000
	0    -1   -1   0   
$EndComp
Wire Wire Line
	6200 8000 5650 8000
Wire Wire Line
	6100 9900 6100 9700
Wire Wire Line
	6100 9700 5650 9700
$Comp
L MCU_Module:NUCLEO144-H743ZI U1
U 1 1 5E6B9582
P 8450 5900
F 0 "U1" H 8450 9881 50  0000 C CNN
F 1 "NUCLEO144-F429ZI" H 8450 9790 50  0000 C CNN
F 2 "Module:ST_Morpho_Connector_144_STLink" H 9300 2250 50  0001 L CNN
F 3 "http://www.st.com/content/ccc/resource/technical/document/data_brief/group0/7b/df/1d/e9/64/55/43/8d/DM00247910/files/DM00247910.pdf/jcr:content/translations/en.DM00247910.pdf" H 7550 6200 50  0001 C CNN
	1    8450 5900
	1    0    0    -1  
$EndComp
$Comp
L power:+3V3 #PWR0104
U 1 1 5E6EC1F9
P 5900 7750
F 0 "#PWR0104" H 5900 7600 50  0001 C CNN
F 1 "+3V3" H 5915 7923 50  0000 C CNN
F 2 "" H 5900 7750 50  0001 C CNN
F 3 "" H 5900 7750 50  0001 C CNN
	1    5900 7750
	1    0    0    -1  
$EndComp
Wire Wire Line
	5650 7900 5900 7900
Wire Wire Line
	5900 7900 5900 7750
$Comp
L power:+3V3 #PWR0106
U 1 1 5E6EC897
P 7950 1400
F 0 "#PWR0106" H 7950 1250 50  0001 C CNN
F 1 "+3V3" H 7965 1573 50  0000 C CNN
F 2 "" H 7950 1400 50  0001 C CNN
F 3 "" H 7950 1400 50  0001 C CNN
	1    7950 1400
	1    0    0    -1  
$EndComp
Wire Wire Line
	7950 1400 7950 1600
Text Label 4750 5650 2    50   ~ 0
Mixer-ENX
Text Label 5250 5650 0    50   ~ 0
Mixer-SCLK
Text Label 4750 5550 2    50   ~ 0
Mixer-SDA
Text Label 5250 5750 0    50   ~ 0
Mixer-MODE
Text Label 5250 5550 0    50   ~ 0
Mixer-EN
$Comp
L power:GND #PWR?
U 1 1 5E6EAA34
P 5350 5950
AR Path="/5E670BE7/5E6EAA34" Ref="#PWR?"  Part="1" 
AR Path="/5E6EAA34" Ref="#PWR0105"  Part="1" 
F 0 "#PWR0105" H 5350 5700 50  0001 C CNN
F 1 "GND" H 5355 5777 50  0000 C CNN
F 2 "" H 5350 5950 50  0001 C CNN
F 3 "" H 5350 5950 50  0001 C CNN
	1    5350 5950
	1    0    0    -1  
$EndComp
$Comp
L Connector_Generic:Conn_02x05_Odd_Even J?
U 1 1 5E6EAA3B
P 4950 5650
AR Path="/5E670BE7/5E6EAA3B" Ref="J?"  Part="1" 
AR Path="/5E6EAA3B" Ref="J5"  Part="1" 
F 0 "J5" H 5000 6067 50  0000 C CNN
F 1 "Mixer" H 5000 5976 50  0000 C CNN
F 2 "lsf-kicad-lib:Hirose_DF11-10DP-2DS_2x5_P2.00mm_Horizontal" H 4950 5650 50  0001 C CNN
F 3 "~" H 4950 5650 50  0001 C CNN
F 4 "DF11-10DP-2DS" H 4950 5650 50  0001 C CNN "Mnf."
F 5 "DF11-10DP-2DS" H 4950 5650 50  0001 C CNN "Part Number"
	1    4950 5650
	1    0    0    -1  
$EndComp
Text Label 5250 5450 0    50   ~ 0
LOCK-DO
Text Label 4750 5450 2    50   ~ 0
FM
Text Label 4750 5750 2    50   ~ 0
Mixer-RST
$Comp
L power:+3V3 #PWR0108
U 1 1 5E730C80
P 4150 5850
F 0 "#PWR0108" H 4150 5700 50  0001 C CNN
F 1 "+3V3" H 4165 6023 50  0000 C CNN
F 2 "" H 4150 5850 50  0001 C CNN
F 3 "" H 4150 5850 50  0001 C CNN
	1    4150 5850
	1    0    0    -1  
$EndComp
Wire Wire Line
	4150 5850 4750 5850
Wire Wire Line
	5250 5850 5350 5850
Wire Wire Line
	5350 5850 5350 5950
Text Label 7150 7500 2    50   ~ 0
Mixer-SDA
Text Label 7150 7400 2    50   ~ 0
Mixer-SCLK
NoConn ~ 7150 8700
NoConn ~ 7150 8600
NoConn ~ 7150 8500
NoConn ~ 7150 8400
NoConn ~ 7150 8000
NoConn ~ 7150 7800
$Comp
L Connector_Generic:Conn_02x05_Odd_Even J2
U 1 1 5E706327
P 4950 4350
F 0 "J2" H 5000 4767 50  0000 C CNN
F 1 "RF Switch" H 5000 4676 50  0000 C CNN
F 2 "Connector_PinHeader_2.54mm:PinHeader_2x05_P2.54mm_Horizontal" H 4950 4350 50  0001 C CNN
F 3 "~" H 4950 4350 50  0001 C CNN
	1    4950 4350
	1    0    0    -1  
$EndComp
$Comp
L power:GND #PWR0107
U 1 1 5E706E02
P 4250 4650
F 0 "#PWR0107" H 4250 4400 50  0001 C CNN
F 1 "GND" H 4255 4477 50  0000 C CNN
F 2 "" H 4250 4650 50  0001 C CNN
F 3 "" H 4250 4650 50  0001 C CNN
	1    4250 4650
	1    0    0    -1  
$EndComp
Wire Wire Line
	4250 4650 4250 4550
Wire Wire Line
	4250 4150 4750 4150
Wire Wire Line
	4750 4550 4250 4550
Connection ~ 4250 4550
Wire Wire Line
	4250 4550 4250 4150
Text Label 4750 4350 2    50   ~ 0
RFSW_EN
Text Label 4750 4450 2    50   ~ 0
RFSW_VCTL
$Comp
L power:+3V3 #PWR0109
U 1 1 5E70ADEE
P 4650 4000
F 0 "#PWR0109" H 4650 3850 50  0001 C CNN
F 1 "+3V3" H 4665 4173 50  0000 C CNN
F 2 "" H 4650 4000 50  0001 C CNN
F 3 "" H 4650 4000 50  0001 C CNN
	1    4650 4000
	1    0    0    -1  
$EndComp
Wire Wire Line
	4650 4000 4650 4250
Wire Wire Line
	4650 4250 4750 4250
$Comp
L power:GND #PWR0110
U 1 1 5E70C5A4
P 5250 4650
F 0 "#PWR0110" H 5250 4400 50  0001 C CNN
F 1 "GND" H 5255 4477 50  0000 C CNN
F 2 "" H 5250 4650 50  0001 C CNN
F 3 "" H 5250 4650 50  0001 C CNN
	1    5250 4650
	1    0    0    -1  
$EndComp
Wire Wire Line
	5250 4650 5250 4550
Connection ~ 5250 4250
Wire Wire Line
	5250 4250 5250 4150
Connection ~ 5250 4350
Wire Wire Line
	5250 4350 5250 4250
Connection ~ 5250 4450
Wire Wire Line
	5250 4450 5250 4350
Connection ~ 5250 4550
Wire Wire Line
	5250 4550 5250 4450
$Comp
L Connector_Generic:Conn_02x06_Odd_Even J3
U 1 1 5E70EDFC
P 4950 3100
F 0 "J3" H 5000 3517 50  0000 C CNN
F 1 "PMOD1" H 5000 3426 50  0000 C CNN
F 2 "Connector_PinHeader_2.54mm:PinHeader_2x06_P2.54mm_Horizontal" H 4950 3100 50  0001 C CNN
F 3 "~" H 4950 3100 50  0001 C CNN
	1    4950 3100
	1    0    0    -1  
$EndComp
$Comp
L power:GND #PWR0111
U 1 1 5E71044B
P 4350 3000
F 0 "#PWR0111" H 4350 2750 50  0001 C CNN
F 1 "GND" V 4355 2872 50  0000 R CNN
F 2 "" H 4350 3000 50  0001 C CNN
F 3 "" H 4350 3000 50  0001 C CNN
	1    4350 3000
	0    1    1    0   
$EndComp
$Comp
L power:GND #PWR0112
U 1 1 5E71073F
P 5700 3000
F 0 "#PWR0112" H 5700 2750 50  0001 C CNN
F 1 "GND" V 5705 2872 50  0000 R CNN
F 2 "" H 5700 3000 50  0001 C CNN
F 3 "" H 5700 3000 50  0001 C CNN
	1    5700 3000
	0    -1   -1   0   
$EndComp
Wire Wire Line
	4350 3000 4750 3000
Wire Wire Line
	5250 3000 5700 3000
Text Label 7150 5700 2    50   ~ 0
Mixer-MODE
Text Label 7150 7700 2    50   ~ 0
Mixer-EN
Text Label 7150 7200 2    50   ~ 0
Mixer-ENX
Text Label 7150 7300 2    50   ~ 0
FM
Text Label 7150 7100 2    50   ~ 0
Mixer-RST
Text Label 9750 8700 0    50   ~ 0
LOCK-DO
Text Label 7150 4800 2    50   ~ 0
RFSW_EN
Text Label 7150 4700 2    50   ~ 0
RFSW_VCTL
Wire Wire Line
	7650 9700 7750 9700
Connection ~ 7750 9700
Wire Wire Line
	7750 9700 7850 9700
Connection ~ 7850 9700
Wire Wire Line
	7850 9700 7950 9700
Connection ~ 7950 9700
Wire Wire Line
	7950 9700 8050 9700
Connection ~ 8050 9700
Wire Wire Line
	8050 9700 8150 9700
Connection ~ 8150 9700
Wire Wire Line
	8150 9700 8250 9700
Connection ~ 8250 9700
Wire Wire Line
	8250 9700 8350 9700
Connection ~ 8350 9700
Wire Wire Line
	8350 9700 8450 9700
Connection ~ 8450 9700
Wire Wire Line
	8450 9700 8550 9700
Connection ~ 8550 9700
Wire Wire Line
	8550 9700 8650 9700
Connection ~ 8650 9700
Wire Wire Line
	8650 9700 8750 9700
Connection ~ 8750 9700
Wire Wire Line
	8750 9700 8850 9700
Connection ~ 8850 9700
Wire Wire Line
	8850 9700 8950 9700
Connection ~ 8950 9700
Wire Wire Line
	8950 9700 9050 9700
Connection ~ 9050 9700
Wire Wire Line
	9050 9700 9250 9700
Wire Wire Line
	5650 8200 7150 8200
Wire Wire Line
	7150 8300 5650 8300
Wire Wire Line
	5650 8100 6900 8100
Wire Wire Line
	6900 8100 6900 7900
Wire Wire Line
	6900 7900 7150 7900
Wire Wire Line
	5650 8800 6450 8800
Wire Wire Line
	6450 8800 6450 6000
Wire Wire Line
	6450 6000 7150 6000
Wire Wire Line
	7150 6100 6550 6100
Wire Wire Line
	6550 6100 6550 8700
Wire Wire Line
	6550 8700 5650 8700
Wire Wire Line
	5650 8400 7000 8400
Wire Wire Line
	7000 8400 7000 8100
Wire Wire Line
	7000 8100 7150 8100
Text Label 9750 7200 0    50   ~ 0
FPGA_MOSI
Text Label 9750 7100 0    50   ~ 0
FPGA_MISO
Text Label 9750 7000 0    50   ~ 0
FPGA_SCK
Text Label 4750 3300 2    50   ~ 0
FPGA_MOSI
Text Label 4750 3200 2    50   ~ 0
FPGA_MISO
Text Label 4750 3100 2    50   ~ 0
FPGA_SCK
Text Label 4750 3400 2    50   ~ 0
FPGA_SEL
Text Label 9750 7900 0    50   ~ 0
FPGA_SEL
Wire Wire Line
	5650 9000 6700 9000
Wire Wire Line
	6700 9000 6700 8900
Wire Wire Line
	6700 8900 7150 8900
Wire Wire Line
	5650 9200 6700 9200
Wire Wire Line
	6700 9200 6700 9100
Wire Wire Line
	6700 9100 7150 9100
Wire Wire Line
	5650 9400 7050 9400
Wire Wire Line
	7050 9400 7050 9200
Wire Wire Line
	7050 9200 7150 9200
Wire Wire Line
	5650 9300 6800 9300
Wire Wire Line
	6800 9300 6800 9000
Wire Wire Line
	6800 9000 7150 9000
$Comp
L Connector_Generic:Conn_01x04 J4
U 1 1 5E90E66D
P 7150 1600
F 0 "J4" H 7068 1175 50  0000 C CNN
F 1 "3V3-Shield" H 7068 1266 50  0000 C CNN
F 2 "Connector_PinHeader_2.54mm:PinHeader_1x04_P2.54mm_Horizontal" H 7150 1600 50  0001 C CNN
F 3 "~" H 7150 1600 50  0001 C CNN
	1    7150 1600
	-1   0    0    1   
$EndComp
Wire Wire Line
	7950 1700 7950 2100
Text Label 5250 2900 0    50   ~ 0
FPGA_3V3
Text Label 4750 2900 2    50   ~ 0
FPGA_3V3
Text Label 7350 1400 0    50   ~ 0
FPGA_3V3
Wire Wire Line
	7950 1600 7350 1600
Wire Wire Line
	7350 1700 7950 1700
Wire Wire Line
	7350 1500 7350 1600
Connection ~ 7350 1600
$EndSCHEMATC
