(kicad_sch
	(version 20231120)
	(generator "eeschema")
	(generator_version "8.0")
	(uuid "9ce38d15-e3fd-449a-85d0-08ce415b8b43")
	(paper "A4")
	(title_block
		(title "MCU Breakout Board")
	)
	(lib_symbols
		(symbol "Connector_Generic:Conn_01x10"
			(pin_names
				(offset 1.016) hide)
			(exclude_from_sim no)
			(in_bom yes)
			(on_board yes)
			(property "Reference" "J"
				(at 0 12.7 0)
				(effects
					(font
						(size 1.27 1.27)
					)
				)
			)
			(property "Value" "Conn_01x10"
				(at 0 -15.24 0)
				(effects
					(font
						(size 1.27 1.27)
					)
				)
			)
			(property "Footprint" ""
				(at 0 0 0)
				(effects
					(font
						(size 1.27 1.27)
					)
					(hide yes)
				)
			)
			(property "Datasheet" "~"
				(at 0 0 0)
				(effects
					(font
						(size 1.27 1.27)
					)
					(hide yes)
				)
			)
			(property "Description" "Generic connector, single row, 01x10, script generated (kicad-library-utils/schlib/autogen/connector/)"
				(at 0 0 0)
				(effects
					(font
						(size 1.27 1.27)
					)
					(hide yes)
				)
			)
			(property "ki_keywords" "connector"
				(at 0 0 0)
				(effects
					(font
						(size 1.27 1.27)
					)
					(hide yes)
				)
			)
			(property "ki_fp_filters" "Connector*:*_1x??_*"
				(at 0 0 0)
				(effects
					(font
						(size 1.27 1.27)
					)
					(hide yes)
				)
			)
			(symbol "Conn_01x10_1_1"
				(rectangle
					(start -1.27 -12.573)
					(end 0 -12.827)
					(stroke
						(width 0.1524)
						(type default)
					)
					(fill
						(type none)
					)
				)
				(rectangle
					(start -1.27 -10.033)
					(end 0 -10.287)
					(stroke
						(width 0.1524)
						(type default)
					)
					(fill
						(type none)
					)
				)
				(rectangle
					(start -1.27 -7.493)
					(end 0 -7.747)
					(stroke
						(width 0.1524)
						(type default)
					)
					(fill
						(type none)
					)
				)
				(rectangle
					(start -1.27 -4.953)
					(end 0 -5.207)
					(stroke
						(width 0.1524)
						(type default)
					)
					(fill
						(type none)
					)
				)
				(rectangle
					(start -1.27 -2.413)
					(end 0 -2.667)
					(stroke
						(width 0.1524)
						(type default)
					)
					(fill
						(type none)
					)
				)
				(rectangle
					(start -1.27 0.127)
					(end 0 -0.127)
					(stroke
						(width 0.1524)
						(type default)
					)
					(fill
						(type none)
					)
				)
				(rectangle
					(start -1.27 2.667)
					(end 0 2.413)
					(stroke
						(width 0.1524)
						(type default)
					)
					(fill
						(type none)
					)
				)
				(rectangle
					(start -1.27 5.207)
					(end 0 4.953)
					(stroke
						(width 0.1524)
						(type default)
					)
					(fill
						(type none)
					)
				)
				(rectangle
					(start -1.27 7.747)
					(end 0 7.493)
					(stroke
						(width 0.1524)
						(type default)
					)
					(fill
						(type none)
					)
				)
				(rectangle
					(start -1.27 10.287)
					(end 0 10.033)
					(stroke
						(width 0.1524)
						(type default)
					)
					(fill
						(type none)
					)
				)
				(rectangle
					(start -1.27 11.43)
					(end 1.27 -13.97)
					(stroke
						(width 0.254)
						(type default)
					)
					(fill
						(type background)
					)
				)
				(pin passive line
					(at -5.08 10.16 0)
					(length 3.81)
					(name "Pin_1"
						(effects
							(font
								(size 1.27 1.27)
							)
						)
					)
					(number "1"
						(effects
							(font
								(size 1.27 1.27)
							)
						)
					)
				)
				(pin passive line
					(at -5.08 -12.7 0)
					(length 3.81)
					(name "Pin_10"
						(effects
							(font
								(size 1.27 1.27)
							)
						)
					)
					(number "10"
						(effects
							(font
								(size 1.27 1.27)
							)
						)
					)
				)
				(pin passive line
					(at -5.08 7.62 0)
					(length 3.81)
					(name "Pin_2"
						(effects
							(font
								(size 1.27 1.27)
							)
						)
					)
					(number "2"
						(effects
							(font
								(size 1.27 1.27)
							)
						)
					)
				)
				(pin passive line
					(at -5.08 5.08 0)
					(length 3.81)
					(name "Pin_3"
						(effects
							(font
								(size 1.27 1.27)
							)
						)
					)
					(number "3"
						(effects
							(font
								(size 1.27 1.27)
							)
						)
					)
				)
				(pin passive line
					(at -5.08 2.54 0)
					(length 3.81)
					(name "Pin_4"
						(effects
							(font
								(size 1.27 1.27)
							)
						)
					)
					(number "4"
						(effects
							(font
								(size 1.27 1.27)
							)
						)
					)
				)
				(pin passive line
					(at -5.08 0 0)
					(length 3.81)
					(name "Pin_5"
						(effects
							(font
								(size 1.27 1.27)
							)
						)
					)
					(number "5"
						(effects
							(font
								(size 1.27 1.27)
							)
						)
					)
				)
				(pin passive line
					(at -5.08 -2.54 0)
					(length 3.81)
					(name "Pin_6"
						(effects
							(font
								(size 1.27 1.27)
							)
						)
					)
					(number "6"
						(effects
							(font
								(size 1.27 1.27)
							)
						)
					)
				)
				(pin passive line
					(at -5.08 -5.08 0)
					(length 3.81)
					(name "Pin_7"
						(effects
							(font
								(size 1.27 1.27)
							)
						)
					)
					(number "7"
						(effects
							(font
								(size 1.27 1.27)
							)
						)
					)
				)
				(pin passive line
					(at -5.08 -7.62 0)
					(length 3.81)
					(name "Pin_8"
						(effects
							(font
								(size 1.27 1.27)
							)
						)
					)
					(number "8"
						(effects
							(font
								(size 1.27 1.27)
							)
						)
					)
				)
				(pin passive line
					(at -5.08 -10.16 0)
					(length 3.81)
					(name "Pin_9"
						(effects
							(font
								(size 1.27 1.27)
							)
						)
					)
					(number "9"
						(effects
							(font
								(size 1.27 1.27)
							)
						)
					)
				)
			)
		)
		(symbol "Connector_Generic:Conn_02x10_Odd_Even"
			(pin_names
				(offset 1.016) hide)
			(exclude_from_sim no)
			(in_bom yes)
			(on_board yes)
			(property "Reference" "J"
				(at 1.27 12.7 0)
				(effects
					(font
						(size 1.27 1.27)
					)
				)
			)
			(property "Value" "Conn_02x10_Odd_Even"
				(at 1.27 -15.24 0)
				(effects
					(font
						(size 1.27 1.27)
					)
				)
			)
			(property "Footprint" ""
				(at 0 0 0)
				(effects
					(font
						(size 1.27 1.27)
					)
					(hide yes)
				)
			)
			(property "Datasheet" "~"
				(at 0 0 0)
				(effects
					(font
						(size 1.27 1.27)
					)
					(hide yes)
				)
			)
			(property "Description" "Generic connector, double row, 02x10, odd/even pin numbering scheme (row 1 odd numbers, row 2 even numbers), script generated (kicad-library-utils/schlib/autogen/connector/)"
				(at 0 0 0)
				(effects
					(font
						(size 1.27 1.27)
					)
					(hide yes)
				)
			)
			(property "ki_keywords" "connector"
				(at 0 0 0)
				(effects
					(font
						(size 1.27 1.27)
					)
					(hide yes)
				)
			)
			(property "ki_fp_filters" "Connector*:*_2x??_*"
				(at 0 0 0)
				(effects
					(font
						(size 1.27 1.27)
					)
					(hide yes)
				)
			)
			(symbol "Conn_02x10_Odd_Even_1_1"
				(rectangle
					(start -1.27 -12.573)
					(end 0 -12.827)
					(stroke
						(width 0.1524)
						(type default)
					)
					(fill
						(type none)
					)
				)
				(rectangle
					(start -1.27 -10.033)
					(end 0 -10.287)
					(stroke
						(width 0.1524)
						(type default)
					)
					(fill
						(type none)
					)
				)
				(rectangle
					(start -1.27 -7.493)
					(end 0 -7.747)
					(stroke
						(width 0.1524)
						(type default)
					)
					(fill
						(type none)
					)
				)
				(rectangle
					(start -1.27 -4.953)
					(end 0 -5.207)
					(stroke
						(width 0.1524)
						(type default)
					)
					(fill
						(type none)
					)
				)
				(rectangle
					(start -1.27 -2.413)
					(end 0 -2.667)
					(stroke
						(width 0.1524)
						(type default)
					)
					(fill
						(type none)
					)
				)
				(rectangle
					(start -1.27 0.127)
					(end 0 -0.127)
					(stroke
						(width 0.1524)
						(type default)
					)
					(fill
						(type none)
					)
				)
				(rectangle
					(start -1.27 2.667)
					(end 0 2.413)
					(stroke
						(width 0.1524)
						(type default)
					)
					(fill
						(type none)
					)
				)
				(rectangle
					(start -1.27 5.207)
					(end 0 4.953)
					(stroke
						(width 0.1524)
						(type default)
					)
					(fill
						(type none)
					)
				)
				(rectangle
					(start -1.27 7.747)
					(end 0 7.493)
					(stroke
						(width 0.1524)
						(type default)
					)
					(fill
						(type none)
					)
				)
				(rectangle
					(start -1.27 10.287)
					(end 0 10.033)
					(stroke
						(width 0.1524)
						(type default)
					)
					(fill
						(type none)
					)
				)
				(rectangle
					(start -1.27 11.43)
					(end 3.81 -13.97)
					(stroke
						(width 0.254)
						(type default)
					)
					(fill
						(type background)
					)
				)
				(rectangle
					(start 3.81 -12.573)
					(end 2.54 -12.827)
					(stroke
						(width 0.1524)
						(type default)
					)
					(fill
						(type none)
					)
				)
				(rectangle
					(start 3.81 -10.033)
					(end 2.54 -10.287)
					(stroke
						(width 0.1524)
						(type default)
					)
					(fill
						(type none)
					)
				)
				(rectangle
					(start 3.81 -7.493)
					(end 2.54 -7.747)
					(stroke
						(width 0.1524)
						(type default)
					)
					(fill
						(type none)
					)
				)
				(rectangle
					(start 3.81 -4.953)
					(end 2.54 -5.207)
					(stroke
						(width 0.1524)
						(type default)
					)
					(fill
						(type none)
					)
				)
				(rectangle
					(start 3.81 -2.413)
					(end 2.54 -2.667)
					(stroke
						(width 0.1524)
						(type default)
					)
					(fill
						(type none)
					)
				)
				(rectangle
					(start 3.81 0.127)
					(end 2.54 -0.127)
					(stroke
						(width 0.1524)
						(type default)
					)
					(fill
						(type none)
					)
				)
				(rectangle
					(start 3.81 2.667)
					(end 2.54 2.413)
					(stroke
						(width 0.1524)
						(type default)
					)
					(fill
						(type none)
					)
				)
				(rectangle
					(start 3.81 5.207)
					(end 2.54 4.953)
					(stroke
						(width 0.1524)
						(type default)
					)
					(fill
						(type none)
					)
				)
				(rectangle
					(start 3.81 7.747)
					(end 2.54 7.493)
					(stroke
						(width 0.1524)
						(type default)
					)
					(fill
						(type none)
					)
				)
				(rectangle
					(start 3.81 10.287)
					(end 2.54 10.033)
					(stroke
						(width 0.1524)
						(type default)
					)
					(fill
						(type none)
					)
				)
				(pin passive line
					(at -5.08 10.16 0)
					(length 3.81)
					(name "Pin_1"
						(effects
							(font
								(size 1.27 1.27)
							)
						)
					)
					(number "1"
						(effects
							(font
								(size 1.27 1.27)
							)
						)
					)
				)
				(pin passive line
					(at 7.62 0 180)
					(length 3.81)
					(name "Pin_10"
						(effects
							(font
								(size 1.27 1.27)
							)
						)
					)
					(number "10"
						(effects
							(font
								(size 1.27 1.27)
							)
						)
					)
				)
				(pin passive line
					(at -5.08 -2.54 0)
					(length 3.81)
					(name "Pin_11"
						(effects
							(font
								(size 1.27 1.27)
							)
						)
					)
					(number "11"
						(effects
							(font
								(size 1.27 1.27)
							)
						)
					)
				)
				(pin passive line
					(at 7.62 -2.54 180)
					(length 3.81)
					(name "Pin_12"
						(effects
							(font
								(size 1.27 1.27)
							)
						)
					)
					(number "12"
						(effects
							(font
								(size 1.27 1.27)
							)
						)
					)
				)
				(pin passive line
					(at -5.08 -5.08 0)
					(length 3.81)
					(name "Pin_13"
						(effects
							(font
								(size 1.27 1.27)
							)
						)
					)
					(number "13"
						(effects
							(font
								(size 1.27 1.27)
							)
						)
					)
				)
				(pin passive line
					(at 7.62 -5.08 180)
					(length 3.81)
					(name "Pin_14"
						(effects
							(font
								(size 1.27 1.27)
							)
						)
					)
					(number "14"
						(effects
							(font
								(size 1.27 1.27)
							)
						)
					)
				)
				(pin passive line
					(at -5.08 -7.62 0)
					(length 3.81)
					(name "Pin_15"
						(effects
							(font
								(size 1.27 1.27)
							)
						)
					)
					(number "15"
						(effects
							(font
								(size 1.27 1.27)
							)
						)
					)
				)
				(pin passive line
					(at 7.62 -7.62 180)
					(length 3.81)
					(name "Pin_16"
						(effects
							(font
								(size 1.27 1.27)
							)
						)
					)
					(number "16"
						(effects
							(font
								(size 1.27 1.27)
							)
						)
					)
				)
				(pin passive line
					(at -5.08 -10.16 0)
					(length 3.81)
					(name "Pin_17"
						(effects
							(font
								(size 1.27 1.27)
							)
						)
					)
					(number "17"
						(effects
							(font
								(size 1.27 1.27)
							)
						)
					)
				)
				(pin passive line
					(at 7.62 -10.16 180)
					(length 3.81)
					(name "Pin_18"
						(effects
							(font
								(size 1.27 1.27)
							)
						)
					)
					(number "18"
						(effects
							(font
								(size 1.27 1.27)
							)
						)
					)
				)
				(pin passive line
					(at -5.08 -12.7 0)
					(length 3.81)
					(name "Pin_19"
						(effects
							(font
								(size 1.27 1.27)
							)
						)
					)
					(number "19"
						(effects
							(font
								(size 1.27 1.27)
							)
						)
					)
				)
				(pin passive line
					(at 7.62 10.16 180)
					(length 3.81)
					(name "Pin_2"
						(effects
							(font
								(size 1.27 1.27)
							)
						)
					)
					(number "2"
						(effects
							(font
								(size 1.27 1.27)
							)
						)
					)
				)
				(pin passive line
					(at 7.62 -12.7 180)
					(length 3.81)
					(name "Pin_20"
						(effects
							(font
								(size 1.27 1.27)
							)
						)
					)
					(number "20"
						(effects
							(font
								(size 1.27 1.27)
							)
						)
					)
				)
				(pin passive line
					(at -5.08 7.62 0)
					(length 3.81)
					(name "Pin_3"
						(effects
							(font
								(size 1.27 1.27)
							)
						)
					)
					(number "3"
						(effects
							(font
								(size 1.27 1.27)
							)
						)
					)
				)
				(pin passive line
					(at 7.62 7.62 180)
					(length 3.81)
					(name "Pin_4"
						(effects
							(font
								(size 1.27 1.27)
							)
						)
					)
					(number "4"
						(effects
							(font
								(size 1.27 1.27)
							)
						)
					)
				)
				(pin passive line
					(at -5.08 5.08 0)
					(length 3.81)
					(name "Pin_5"
						(effects
							(font
								(size 1.27 1.27)
							)
						)
					)
					(number "5"
						(effects
							(font
								(size 1.27 1.27)
							)
						)
					)
				)
				(pin passive line
					(at 7.62 5.08 180)
					(length 3.81)
					(name "Pin_6"
						(effects
							(font
								(size 1.27 1.27)
							)
						)
					)
					(number "6"
						(effects
							(font
								(size 1.27 1.27)
							)
						)
					)
				)
				(pin passive line
					(at -5.08 2.54 0)
					(length 3.81)
					(name "Pin_7"
						(effects
							(font
								(size 1.27 1.27)
							)
						)
					)
					(number "7"
						(effects
							(font
								(size 1.27 1.27)
							)
						)
					)
				)
				(pin passive line
					(at 7.62 2.54 180)
					(length 3.81)
					(name "Pin_8"
						(effects
							(font
								(size 1.27 1.27)
							)
						)
					)
					(number "8"
						(effects
							(font
								(size 1.27 1.27)
							)
						)
					)
				)
				(pin passive line
					(at -5.08 0 0)
					(length 3.81)
					(name "Pin_9"
						(effects
							(font
								(size 1.27 1.27)
							)
						)
					)
					(number "9"
						(effects
							(font
								(size 1.27 1.27)
							)
						)
					)
				)
			)
		)
		(symbol "power:GND"
			(power)
			(pin_names
				(offset 0)
			)
			(exclude_from_sim no)
			(in_bom yes)
			(on_board yes)
			(property "Reference" "#PWR"
				(at 0 -6.35 0)
				(effects
					(font
						(size 1.27 1.27)
					)
					(hide yes)
				)
			)
			(property "Value" "GND"
				(at 0 -3.81 0)
				(effects
					(font
						(size 1.27 1.27)
					)
				)
			)
			(property "Footprint" ""
				(at 0 0 0)
				(effects
					(font
						(size 1.27 1.27)
					)
					(hide yes)
				)
			)
			(property "Datasheet" ""
				(at 0 0 0)
				(effects
					(font
						(size 1.27 1.27)
					)
					(hide yes)
				)
			)
			(property "Description" "Power symbol creates a global label with name \"GND\" , ground"
				(at 0 0 0)
				(effects
					(font
						(size 1.27 1.27)
					)
					(hide yes)
				)
			)
			(property "ki_keywords" "global power"
				(at 0 0 0)
				(effects
					(font
						(size 1.27 1.27)
					)
					(hide yes)
				)
			)
			(symbol "GND_0_1"
				(polyline
					(pts
						(xy 0 0) (xy 0 -1.27) (xy 1.27 -1.27) (xy 0 -2.54) (xy -1.27 -1.27) (xy 0 -1.27)
					)
					(stroke
						(width 0)
						(type default)
					)
					(fill
						(type none)
					)
				)
			)
			(symbol "GND_1_1"
				(pin power_in line
					(at 0 0 270)
					(length 0) hide
					(name "GND"
						(effects
							(font
								(size 1.27 1.27)
							)
						)
					)
					(number "1"
						(effects
							(font
								(size 1.27 1.27)
							)
						)
					)
				)
			)
		)
		(symbol "power:PWR_FLAG"
			(power)
			(pin_numbers hide)
			(pin_names
				(offset 0) hide)
			(exclude_from_sim no)
			(in_bom yes)
			(on_board yes)
			(property "Reference" "#FLG"
				(at 0 1.905 0)
				(effects
					(font
						(size 1.27 1.27)
					)
					(hide yes)
				)
			)
			(property "Value" "PWR_FLAG"
				(at 0 3.81 0)
				(effects
					(font
						(size 1.27 1.27)
					)
				)
			)
			(property "Footprint" ""
				(at 0 0 0)
				(effects
					(font
						(size 1.27 1.27)
					)
					(hide yes)
				)
			)
			(property "Datasheet" "~"
				(at 0 0 0)
				(effects
					(font
						(size 1.27 1.27)
					)
					(hide yes)
				)
			)
			(property "Description" "Special symbol for telling ERC where power comes from"
				(at 0 0 0)
				(effects
					(font
						(size 1.27 1.27)
					)
					(hide yes)
				)
			)
			(property "ki_keywords" "flag power"
				(at 0 0 0)
				(effects
					(font
						(size 1.27 1.27)
					)
					(hide yes)
				)
			)
			(symbol "PWR_FLAG_0_0"
				(pin power_out line
					(at 0 0 90)
					(length 0)
					(name "pwr"
						(effects
							(font
								(size 1.27 1.27)
							)
						)
					)
					(number "1"
						(effects
							(font
								(size 1.27 1.27)
							)
						)
					)
				)
			)
			(symbol "PWR_FLAG_0_1"
				(polyline
					(pts
						(xy 0 0) (xy 0 1.27) (xy -1.016 1.905) (xy 0 2.54) (xy 1.016 1.905) (xy 0 1.27)
					)
					(stroke
						(width 0)
						(type default)
					)
					(fill
						(type none)
					)
				)
			)
		)
	)
	(junction
		(at 167.64 90.17)
		(diameter 0)
		(color 0 0 0 0)
		(uuid "2fbbe020-5b41-4222-a365-389834bf66f9")
	)
	(junction
		(at 137.16 81.28)
		(diameter 0)
		(color 0 0 0 0)
		(uuid "370a2abb-dba0-4d62-984c-7f3b3a67916b")
	)
	(junction
		(at 137.16 86.36)
		(diameter 0)
		(color 0 0 0 0)
		(uuid "4055f90c-6cbd-4ec1-97cc-1d9124d8fb22")
	)
	(junction
		(at 167.64 95.25)
		(diameter 0)
		(color 0 0 0 0)
		(uuid "47a08dd5-8893-4c43-b460-8407c3bca103")
	)
	(junction
		(at 137.16 99.06)
		(diameter 0)
		(color 0 0 0 0)
		(uuid "49456b12-2e4e-47f2-87a1-be7b7dc421c1")
	)
	(junction
		(at 167.64 100.33)
		(diameter 0)
		(color 0 0 0 0)
		(uuid "5472f0c7-4737-464c-8df4-19cd04dab514")
	)
	(junction
		(at 137.16 83.82)
		(diameter 0)
		(color 0 0 0 0)
		(uuid "61c1cba0-84fd-46bd-8ee5-c56e02364bfe")
	)
	(junction
		(at 137.16 91.44)
		(diameter 0)
		(color 0 0 0 0)
		(uuid "c7ced727-998f-4e14-8db9-351de5e167f4")
	)
	(junction
		(at 137.16 93.98)
		(diameter 0)
		(color 0 0 0 0)
		(uuid "df8bf00c-9848-419e-8108-04e772ccb3c7")
	)
	(junction
		(at 137.16 96.52)
		(diameter 0)
		(color 0 0 0 0)
		(uuid "e58630c7-fe2b-45e9-8df4-0a40cdc1f345")
	)
	(junction
		(at 137.16 88.9)
		(diameter 0)
		(color 0 0 0 0)
		(uuid "edb70add-907c-48b4-a07a-7a39e79b74e8")
	)
	(no_connect
		(at 119.38 81.28)
		(uuid "09be8f8d-2866-431a-a49f-12fd74ea7857")
	)
	(no_connect
		(at 132.08 101.6)
		(uuid "85917d11-0635-4928-9f7c-30b3a0b84a84")
	)
	(no_connect
		(at 119.38 88.9)
		(uuid "c73ee4f5-1cf9-4f4b-8243-88b5da7720d2")
	)
	(no_connect
		(at 119.38 78.74)
		(uuid "e3d403e8-222e-45b7-83a8-84188fdb31c4")
	)
	(polyline
		(pts
			(xy 197.358 140.716) (xy 196.088 141.224)
		)
		(stroke
			(width 0)
			(type default)
		)
		(uuid "00352b2e-f6d5-467f-9b91-4029fd071b01")
	)
	(polyline
		(pts
			(xy 117.475 117.856) (xy 136.525 117.856)
		)
		(stroke
			(width 0)
			(type default)
		)
		(uuid "00cc726b-391f-4725-83cf-ca69df708641")
	)
	(polyline
		(pts
			(xy 189.484 141.732) (xy 188.976 141.986)
		)
		(stroke
			(width 0)
			(type default)
		)
		(uuid "025cdbcd-4c6b-4a5d-a627-32c60d02f6be")
	)
	(polyline
		(pts
			(xy 197.358 131.826) (xy 196.088 132.334)
		)
		(stroke
			(width 0)
			(type default)
		)
		(uuid "038a0711-e97e-4dab-ae8b-e967a15e6621")
	)
	(polyline
		(pts
			(xy 135.255 108.966) (xy 135.255 117.221)
		)
		(stroke
			(width 0)
			(type dash)
		)
		(uuid "046bb27b-d1fa-4cf7-8476-6509e3c92755")
	)
	(polyline
		(pts
			(xy 197.358 136.906) (xy 196.088 137.414)
		)
		(stroke
			(width 0)
			(type default)
		)
		(uuid "05a4560a-a7a2-4d0e-9639-ae1caf2d7d00")
	)
	(polyline
		(pts
			(xy 216.408 132.08) (xy 215.138 132.588)
		)
		(stroke
			(width 0)
			(type default)
		)
		(uuid "08fb9531-35f7-47f0-8f54-6015d091ecd0")
	)
	(polyline
		(pts
			(xy 216.408 141.732) (xy 215.138 142.24)
		)
		(stroke
			(width 0)
			(type default)
		)
		(uuid "0e9f24fe-aa3b-429e-95fe-b94200460a4c")
	)
	(polyline
		(pts
			(xy 216.408 130.81) (xy 215.138 131.318)
		)
		(stroke
			(width 0)
			(type default)
		)
		(uuid "11d85913-7453-4346-b4af-91876ee44ec2")
	)
	(polyline
		(pts
			(xy 58.42 112.776) (xy 69.85 112.776)
		)
		(stroke
			(width 0)
			(type default)
		)
		(uuid "166bd1e7-101f-4019-b8d0-85371c2b9dc9")
	)
	(polyline
		(pts
			(xy 120.65 115.189) (xy 120.65 118.745)
		)
		(stroke
			(width 0.508)
			(type default)
		)
		(uuid "17863a57-97e6-4900-89d8-0dc437ccfdba")
	)
	(wire
		(pts
			(xy 185.42 80.01) (xy 191.77 80.01)
		)
		(stroke
			(width 0)
			(type default)
		)
		(uuid "1aa8bef1-f675-4ffe-a955-a92a48d2d41a")
	)
	(polyline
		(pts
			(xy 197.358 139.446) (xy 196.088 139.954)
		)
		(stroke
			(width 0)
			(type default)
		)
		(uuid "1de3cb6f-0fa1-4bd7-a446-3ffe8c211d42")
	)
	(wire
		(pts
			(xy 167.64 100.33) (xy 167.64 95.25)
		)
		(stroke
			(width 0)
			(type default)
		)
		(uuid "1e677e77-f220-4abe-a0bd-785d01663a06")
	)
	(wire
		(pts
			(xy 167.64 101.6) (xy 167.64 100.33)
		)
		(stroke
			(width 0)
			(type default)
		)
		(uuid "1f1fbfca-5479-4529-8148-94b2d0080dff")
	)
	(polyline
		(pts
			(xy 226.06 141.478) (xy 226.568 141.732)
		)
		(stroke
			(width 0)
			(type default)
		)
		(uuid "26140db7-b8e8-44b2-89b5-783adce895c3")
	)
	(polyline
		(pts
			(xy 128.905 109.601) (xy 136.525 109.601)
		)
		(stroke
			(width 0)
			(type default)
		)
		(uuid "26847d4f-4624-41e5-b751-8cb8ad45009f")
	)
	(polyline
		(pts
			(xy 217.17 143.256) (xy 218.44 143.002)
		)
		(stroke
			(width 0)
			(type default)
		)
		(uuid "2711980c-b5b4-4a98-9772-136f4649e6b4")
	)
	(polyline
		(pts
			(xy 135.255 117.221) (xy 116.205 117.221)
		)
		(stroke
			(width 0)
			(type dash)
		)
		(uuid "27b23a1a-6c4d-45cc-a4b0-1d507404b79c")
	)
	(polyline
		(pts
			(xy 197.358 130.556) (xy 196.088 131.064)
		)
		(stroke
			(width 0)
			(type default)
		)
		(uuid "2901328f-f9f9-4afc-9b5f-99a2255b5361")
	)
	(wire
		(pts
			(xy 167.64 100.33) (xy 191.77 100.33)
		)
		(stroke
			(width 0)
			(type default)
		)
		(uuid "29f8098d-9805-4229-894a-259600f5e3b3")
	)
	(polyline
		(pts
			(xy 196.088 130.048) (xy 196.088 143.51)
		)
		(stroke
			(width 0)
			(type default)
		)
		(uuid "2a7cd7fd-68ff-4853-bc29-85c9cc7f0780")
	)
	(polyline
		(pts
			(xy 117.475 109.601) (xy 123.825 109.601)
		)
		(stroke
			(width 0)
			(type default)
		)
		(uuid "2e4f39b3-afe9-44df-84f5-65955fbf8537")
	)
	(polyline
		(pts
			(xy 116.205 108.966) (xy 116.205 117.221)
		)
		(stroke
			(width 0)
			(type default)
		)
		(uuid "30622b20-ba9b-426f-8e8b-20418a71bccd")
	)
	(wire
		(pts
			(xy 137.16 101.6) (xy 137.16 99.06)
		)
		(stroke
			(width 0)
			(type default)
		)
		(uuid "31e694fd-bef7-4203-9a77-b89c8c3dc240")
	)
	(polyline
		(pts
			(xy 197.358 141.986) (xy 196.088 142.494)
		)
		(stroke
			(width 0)
			(type default)
		)
		(uuid "330e7e7a-75bf-4a8c-813a-9096e51133d4")
	)
	(polyline
		(pts
			(xy 119.634 112.141) (xy 121.666 113.665)
		)
		(stroke
			(width 0.508)
			(type default)
		)
		(uuid "336bc89d-4639-4cfa-8098-11298b8596ac")
	)
	(polyline
		(pts
			(xy 123.825 108.331) (xy 123.825 109.601)
		)
		(stroke
			(width 0)
			(type default)
		)
		(uuid "337671c5-d056-466e-b379-4bdfd7060572")
	)
	(polyline
		(pts
			(xy 116.205 117.221) (xy 117.475 117.856)
		)
		(stroke
			(width 0)
			(type default)
		)
		(uuid "350f508c-f1ff-41de-a9c9-c6c349d0ac5a")
	)
	(polyline
		(pts
			(xy 197.358 136.144) (xy 196.088 136.652)
		)
		(stroke
			(width 0)
			(type default)
		)
		(uuid "359d3d17-d6ad-421e-a720-e9a52d89acc3")
	)
	(polyline
		(pts
			(xy 119.634 114.173) (xy 120.65 115.189)
		)
		(stroke
			(width 0.508)
			(type default)
		)
		(uuid "35a5122e-63b9-46c6-ab94-ba2384f89ba1")
	)
	(polyline
		(pts
			(xy 69.85 108.966) (xy 73.66 105.156)
		)
		(stroke
			(width 0)
			(type default)
		)
		(uuid "36e1af20-a2a3-4f4c-a12e-4997cfd76752")
	)
	(polyline
		(pts
			(xy 189.484 142.494) (xy 188.976 141.986)
		)
		(stroke
			(width 0)
			(type default)
		)
		(uuid "382e08d6-f7a2-42d7-a826-1931b7e8499c")
	)
	(polyline
		(pts
			(xy 197.358 132.334) (xy 196.088 132.842)
		)
		(stroke
			(width 0)
			(type default)
		)
		(uuid "38899482-cb6d-42ff-b72a-ae3a9da98259")
	)
	(polyline
		(pts
			(xy 123.19 107.696) (xy 123.825 108.331)
		)
		(stroke
			(width 0)
			(type default)
		)
		(uuid "3a6b5a3e-f8ab-4993-a587-9170f1d03d2b")
	)
	(polyline
		(pts
			(xy 225.298 128.524) (xy 227.584 128.524)
		)
		(stroke
			(width 0)
			(type default)
		)
		(uuid "3baab9aa-0736-4238-8164-fe1b3be8e2e1")
	)
	(polyline
		(pts
			(xy 216.408 133.35) (xy 215.138 133.858)
		)
		(stroke
			(width 0)
			(type default)
		)
		(uuid "3bc36d73-fcd9-4017-a631-22e04e270908")
	)
	(polyline
		(pts
			(xy 191.516 129.54) (xy 190.246 128.778)
		)
		(stroke
			(width 0)
			(type default)
		)
		(uuid "3e242618-a132-487a-ade8-e7e4288680fa")
	)
	(polyline
		(pts
			(xy 123.19 108.966) (xy 116.205 108.966)
		)
		(stroke
			(width 0)
			(type default)
		)
		(uuid "3e47cbbf-a4d4-4776-9282-fcc514ced99f")
	)
	(polyline
		(pts
			(xy 128.905 108.331) (xy 128.27 107.696)
		)
		(stroke
			(width 0)
			(type default)
		)
		(uuid "417ae4be-e6fe-483c-8407-529b42c36831")
	)
	(wire
		(pts
			(xy 137.16 88.9) (xy 137.16 91.44)
		)
		(stroke
			(width 0)
			(type default)
		)
		(uuid "41abdf88-a08c-4ebb-a114-f073c9599975")
	)
	(polyline
		(pts
			(xy 64.77 108.966) (xy 65.405 108.966)
		)
		(stroke
			(width 0)
			(type default)
		)
		(uuid "41fd8ae1-27b2-40de-8b12-38fae0410d10")
	)
	(polyline
		(pts
			(xy 196.088 130.048) (xy 197.358 129.794)
		)
		(stroke
			(width 0)
			(type default)
		)
		(uuid "4297d68b-36e0-4351-9d27-008efcf37a58")
	)
	(wire
		(pts
			(xy 185.42 82.55) (xy 191.77 82.55)
		)
		(stroke
			(width 0)
			(type default)
		)
		(uuid "462668f8-74c4-4da9-8eb2-4b7cfb2dc8e6")
	)
	(wire
		(pts
			(xy 113.03 96.52) (xy 119.38 96.52)
		)
		(stroke
			(width 0)
			(type default)
		)
		(uuid "463ec76a-dc4c-444a-a686-fa8d2494588a")
	)
	(polyline
		(pts
			(xy 187.96 142.24) (xy 187.96 128.778)
		)
		(stroke
			(width 0)
			(type default)
		)
		(uuid "48026459-da2a-4c19-a2b9-c99229ad55b7")
	)
	(wire
		(pts
			(xy 137.16 91.44) (xy 137.16 93.98)
		)
		(stroke
			(width 0)
			(type default)
		)
		(uuid "48bec5e9-92df-4fed-acc7-307053e22e70")
	)
	(polyline
		(pts
			(xy 216.408 135.89) (xy 215.138 136.398)
		)
		(stroke
			(width 0)
			(type default)
		)
		(uuid "4a321e67-62c3-4efe-8403-42b3f292432d")
	)
	(wire
		(pts
			(xy 132.08 78.74) (xy 137.16 78.74)
		)
		(stroke
			(width 0)
			(type default)
		)
		(uuid "4d99ed71-c427-480b-aefe-4a9640a5a96c")
	)
	(polyline
		(pts
			(xy 216.408 140.462) (xy 215.138 140.97)
		)
		(stroke
			(width 0)
			(type default)
		)
		(uuid "4e8ba2cb-e1ed-4ce8-961e-3896ff14ba42")
	)
	(polyline
		(pts
			(xy 69.85 112.776) (xy 74.295 108.331)
		)
		(stroke
			(width 0)
			(type default)
		)
		(uuid "5033ecb1-dab3-4749-829d-357ab909a867")
	)
	(polyline
		(pts
			(xy 62.865 108.966) (xy 63.5 108.966)
		)
		(stroke
			(width 0)
			(type default)
		)
		(uuid "50a512ab-60fa-4f9a-a404-c9d81e3043f3")
	)
	(polyline
		(pts
			(xy 198.628 138.43) (xy 217.424 134.366)
		)
		(stroke
			(width 0)
			(type default)
		)
		(uuid "535e7a22-f839-4915-a67f-51c7551b4be7")
	)
	(wire
		(pts
			(xy 132.08 88.9) (xy 137.16 88.9)
		)
		(stroke
			(width 0)
			(type default)
		)
		(uuid "5422b91b-a7d3-4a63-b99e-ef547d61a5de")
	)
	(wire
		(pts
			(xy 111.76 86.36) (xy 119.38 86.36)
		)
		(stroke
			(width 0)
			(type default)
		)
		(uuid "55b3a5b5-85c6-40f3-be0a-a7968bcaa07a")
	)
	(polyline
		(pts
			(xy 216.408 142.24) (xy 215.138 142.748)
		)
		(stroke
			(width 0)
			(type default)
		)
		(uuid "59064612-cad7-43f4-bfd8-f37b995b447f")
	)
	(wire
		(pts
			(xy 185.42 87.63) (xy 191.77 87.63)
		)
		(stroke
			(width 0)
			(type default)
		)
		(uuid "5ccb4770-ac6d-4630-b19e-5b79f509e91f")
	)
	(wire
		(pts
			(xy 137.16 83.82) (xy 137.16 86.36)
		)
		(stroke
			(width 0)
			(type default)
		)
		(uuid "5e147aef-88c9-4124-a920-848a3f3cc4f4")
	)
	(polyline
		(pts
			(xy 198.628 134.62) (xy 217.424 138.176)
		)
		(stroke
			(width 0)
			(type default)
		)
		(uuid "5e5681d4-da59-43ab-9508-b1b8e72002f7")
	)
	(polyline
		(pts
			(xy 197.358 141.224) (xy 196.088 141.732)
		)
		(stroke
			(width 0)
			(type default)
		)
		(uuid "5ef03cf0-4216-4d42-ae21-4750202e80e0")
	)
	(wire
		(pts
			(xy 132.08 96.52) (xy 137.16 96.52)
		)
		(stroke
			(width 0)
			(type default)
		)
		(uuid "61bbd727-bb66-46fa-9fee-3c9eb0e95e05")
	)
	(polyline
		(pts
			(xy 217.17 143.256) (xy 215.138 143.256)
		)
		(stroke
			(width 0)
			(type default)
		)
		(uuid "668b498d-941b-4e9b-b63d-1f55367198a5")
	)
	(polyline
		(pts
			(xy 197.358 134.874) (xy 196.088 135.382)
		)
		(stroke
			(width 0)
			(type default)
		)
		(uuid "6907be95-59df-4ec4-82df-a8bb71acb934")
	)
	(polyline
		(pts
			(xy 128.905 108.331) (xy 128.905 109.601)
		)
		(stroke
			(width 0)
			(type default)
		)
		(uuid "6ddd5785-273d-431c-bbd5-602a97610d72")
	)
	(polyline
		(pts
			(xy 216.408 139.192) (xy 215.138 139.7)
		)
		(stroke
			(width 0)
			(type default)
		)
		(uuid "6dff5fe9-1c2f-4c12-900a-e20920d8c95f")
	)
	(polyline
		(pts
			(xy 198.12 143.51) (xy 199.39 143.256)
		)
		(stroke
			(width 0)
			(type default)
		)
		(uuid "6ed795de-7769-4c95-beed-5bbcbc377723")
	)
	(polyline
		(pts
			(xy 135.255 108.966) (xy 136.525 109.601)
		)
		(stroke
			(width 0)
			(type default)
		)
		(uuid "7174a414-009e-4227-aeab-118a381c2df4")
	)
	(wire
		(pts
			(xy 113.03 99.06) (xy 119.38 99.06)
		)
		(stroke
			(width 0)
			(type default)
		)
		(uuid "71a0fac5-71e1-49f6-8a7f-032a8fdb491c")
	)
	(polyline
		(pts
			(xy 217.424 130.556) (xy 224.79 130.556)
		)
		(stroke
			(width 0)
			(type dash)
			(color 194 0 0 1)
		)
		(uuid "7437574d-4a86-4b80-8e5d-fcdf334a748f")
	)
	(polyline
		(pts
			(xy 128.905 108.331) (xy 123.825 108.331)
		)
		(stroke
			(width 0)
			(type default)
		)
		(uuid "786239c5-75a0-48cd-8f1d-afbe01e0c832")
	)
	(polyline
		(pts
			(xy 196.088 143.51) (xy 197.358 143.256)
		)
		(stroke
			(width 0)
			(type default)
		)
		(uuid "789a3cab-b885-487d-9932-828b7bd81218")
	)
	(polyline
		(pts
			(xy 198.628 140.97) (xy 217.424 131.826)
		)
		(stroke
			(width 0)
			(type default)
		)
		(uuid "795890e8-1086-4b67-9a8f-f4f13b85097f")
	)
	(polyline
		(pts
			(xy 216.408 132.842) (xy 215.138 133.35)
		)
		(stroke
			(width 0)
			(type default)
		)
		(uuid "7d7345e1-2510-43b1-9e79-c79a1d60ad2c")
	)
	(polyline
		(pts
			(xy 216.408 139.7) (xy 215.138 140.208)
		)
		(stroke
			(width 0)
			(type default)
		)
		(uuid "7df823f6-9aba-4617-8463-a209f4025af0")
	)
	(polyline
		(pts
			(xy 197.358 133.096) (xy 196.088 133.604)
		)
		(stroke
			(width 0)
			(type default)
		)
		(uuid "7f9254b5-faa9-473c-9c71-53528fa596c1")
	)
	(polyline
		(pts
			(xy 216.408 138.43) (xy 215.138 138.938)
		)
		(stroke
			(width 0)
			(type default)
		)
		(uuid "817d27de-5eed-48ee-812d-32fd5c05b87c")
	)
	(wire
		(pts
			(xy 132.08 83.82) (xy 137.16 83.82)
		)
		(stroke
			(width 0)
			(type default)
		)
		(uuid "8342a918-b0c8-41d0-ab26-0f93c132bf92")
	)
	(polyline
		(pts
			(xy 123.19 107.696) (xy 123.19 108.966)
		)
		(stroke
			(width 0)
			(type default)
		)
		(uuid "83a8f827-3b5f-4a70-947e-b2296de04aa4")
	)
	(polyline
		(pts
			(xy 216.408 135.382) (xy 215.138 135.89)
		)
		(stroke
			(width 0)
			(type default)
		)
		(uuid "84a2efb0-09b7-436c-898a-d9b02671e489")
	)
	(polyline
		(pts
			(xy 216.408 140.97) (xy 215.138 141.478)
		)
		(stroke
			(width 0)
			(type default)
		)
		(uuid "84f1a345-9184-4d51-9b03-cccaf1cee79a")
	)
	(polyline
		(pts
			(xy 216.408 130.302) (xy 215.138 130.81)
		)
		(stroke
			(width 0)
			(type default)
		)
		(uuid "852496b9-d891-4184-9363-d7ae21a5f063")
	)
	(polyline
		(pts
			(xy 215.138 129.794) (xy 216.408 129.54)
		)
		(stroke
			(width 0)
			(type default)
		)
		(uuid "85a1aef4-064e-4a1c-ae0d-9a49abc858e6")
	)
	(wire
		(pts
			(xy 185.42 85.09) (xy 191.77 85.09)
		)
		(stroke
			(width 0)
			(type default)
		)
		(uuid "8686aa49-ddf2-48e2-a472-d74fe8ddb236")
	)
	(wire
		(pts
			(xy 185.42 102.87) (xy 191.77 102.87)
		)
		(stroke
			(width 0)
			(type default)
		)
		(uuid "86a85f13-660d-4bd2-bc9b-07794afd5eeb")
	)
	(polyline
		(pts
			(xy 190.246 128.778) (xy 187.96 128.778)
		)
		(stroke
			(width 0)
			(type default)
		)
		(uuid "89619f3d-6be3-4a54-b460-cac6c083b996")
	)
	(wire
		(pts
			(xy 167.64 95.25) (xy 167.64 90.17)
		)
		(stroke
			(width 0)
			(type default)
		)
		(uuid "89c9a259-c666-4346-bc92-3efa11a3e866")
	)
	(polyline
		(pts
			(xy 198.12 143.51) (xy 196.088 143.51)
		)
		(stroke
			(width 0)
			(type default)
		)
		(uuid "94491996-3829-4aa4-b7a7-0288ae7aa159")
	)
	(polyline
		(pts
			(xy 216.408 137.16) (xy 215.138 137.668)
		)
		(stroke
			(width 0)
			(type default)
		)
		(uuid "946b8088-d879-47a4-be06-956d6775475e")
	)
	(polyline
		(pts
			(xy 58.42 108.966) (xy 58.42 112.776)
		)
		(stroke
			(width 0)
			(type default)
		)
		(uuid "94dda870-ff67-4b7a-8fb4-96bdaea2d844")
	)
	(wire
		(pts
			(xy 113.03 93.98) (xy 119.38 93.98)
		)
		(stroke
			(width 0)
			(type default)
		)
		(uuid "97311a66-b638-48b9-abe6-a78533999d92")
	)
	(polyline
		(pts
			(xy 197.358 131.064) (xy 196.088 131.572)
		)
		(stroke
			(width 0)
			(type default)
		)
		(uuid "99473049-37e0-4285-a119-a57bd3a66647")
	)
	(wire
		(pts
			(xy 132.08 91.44) (xy 137.16 91.44)
		)
		(stroke
			(width 0)
			(type default)
		)
		(uuid "9a1175ac-c489-44c3-a1bf-ff88e0f37cde")
	)
	(polyline
		(pts
			(xy 69.85 112.776) (xy 69.85 108.966)
		)
		(stroke
			(width 0)
			(type default)
		)
		(uuid "a0852997-868e-457f-880b-5970ebe76cfa")
	)
	(polyline
		(pts
			(xy 69.85 108.966) (xy 65.405 108.966)
		)
		(stroke
			(width 0)
			(type default)
		)
		(uuid "a52aa8b3-0b6a-4d8b-b8ab-0dfe32a9ce2a")
	)
	(polyline
		(pts
			(xy 136.525 109.601) (xy 136.525 117.856)
		)
		(stroke
			(width 0)
			(type default)
		)
		(uuid "a5d7f737-e318-4a8c-a3fe-482906fc58df")
	)
	(polyline
		(pts
			(xy 226.06 142.748) (xy 227.584 141.986)
		)
		(stroke
			(width 0)
			(type default)
		)
		(uuid "a8653f1f-143c-4766-81d3-8ba20daafbe9")
	)
	(wire
		(pts
			(xy 137.16 86.36) (xy 137.16 88.9)
		)
		(stroke
			(width 0)
			(type default)
		)
		(uuid "a9f20cae-dc1e-48c4-8665-7c80e75b6d76")
	)
	(polyline
		(pts
			(xy 135.255 108.966) (xy 128.905 108.966)
		)
		(stroke
			(width 0)
			(type default)
		)
		(uuid "ab2f116d-69b6-451a-9340-b0260229df66")
	)
	(polyline
		(pts
			(xy 215.138 143.256) (xy 216.408 143.002)
		)
		(stroke
			(width 0)
			(type default)
		)
		(uuid "ad15f9ab-8a39-4e72-b03c-19b90114a2f8")
	)
	(polyline
		(pts
			(xy 198.628 139.7) (xy 217.424 133.096)
		)
		(stroke
			(width 0)
			(type default)
		)
		(uuid "adc3a627-f5b7-4e61-ad26-e3fc4d6d1152")
	)
	(polyline
		(pts
			(xy 198.628 142.24) (xy 217.424 130.556)
		)
		(stroke
			(width 0)
			(type default)
			(color 194 0 0 1)
		)
		(uuid "b22f53b2-1d76-465f-9433-5c66290e49aa")
	)
	(polyline
		(pts
			(xy 128.27 107.696) (xy 123.19 107.696)
		)
		(stroke
			(width 0)
			(type default)
		)
		(uuid "b2d67e6f-2ce0-4cbc-ba23-99755926435b")
	)
	(wire
		(pts
			(xy 167.64 90.17) (xy 191.77 90.17)
		)
		(stroke
			(width 0)
			(type default)
		)
		(uuid "b3742311-555c-4bb0-831e-55bd6d6eb0d6")
	)
	(wire
		(pts
			(xy 167.64 95.25) (xy 191.77 95.25)
		)
		(stroke
			(width 0)
			(type default)
		)
		(uuid "b7bbc109-58b0-4c7b-b20b-398d2a46fb95")
	)
	(polyline
		(pts
			(xy 62.865 108.966) (xy 58.42 108.966)
		)
		(stroke
			(width 0)
			(type default)
		)
		(uuid "b7f7a9e4-a62d-4eab-8050-7d5b5a132188")
	)
	(polyline
		(pts
			(xy 197.358 138.176) (xy 196.088 138.684)
		)
		(stroke
			(width 0)
			(type default)
		)
		(uuid "b93e3761-0cc3-49d4-a45b-98dff5940be6")
	)
	(wire
		(pts
			(xy 132.08 81.28) (xy 137.16 81.28)
		)
		(stroke
			(width 0)
			(type default)
		)
		(uuid "b9bdd9a5-d493-4602-a331-c921d25061aa")
	)
	(wire
		(pts
			(xy 137.16 78.74) (xy 137.16 81.28)
		)
		(stroke
			(width 0)
			(type default)
		)
		(uuid "ba514878-289a-4c37-8a44-3cbe70f77faa")
	)
	(polyline
		(pts
			(xy 117.475 109.601) (xy 117.475 117.856)
		)
		(stroke
			(width 0)
			(type default)
		)
		(uuid "ba794741-0744-4701-aa3f-5b3c554f29c6")
	)
	(polyline
		(pts
			(xy 227.584 141.986) (xy 227.584 128.524)
		)
		(stroke
			(width 0)
			(type default)
		)
		(uuid "bdc8fbc0-b973-4480-90bc-ded912d16837")
	)
	(wire
		(pts
			(xy 132.08 93.98) (xy 137.16 93.98)
		)
		(stroke
			(width 0)
			(type default)
		)
		(uuid "c0b8c513-d2ef-43a5-b1e2-c7de0a123d0b")
	)
	(polyline
		(pts
			(xy 197.358 142.494) (xy 196.088 143.002)
		)
		(stroke
			(width 0)
			(type default)
		)
		(uuid "c1a38dbf-ca63-41e1-b7d7-5f6102359efd")
	)
	(polyline
		(pts
			(xy 224.028 129.286) (xy 225.298 128.524)
		)
		(stroke
			(width 0)
			(type default)
		)
		(uuid "c1a67fcf-68a5-4161-b090-0018a97d91d9")
	)
	(wire
		(pts
			(xy 132.08 99.06) (xy 137.16 99.06)
		)
		(stroke
			(width 0)
			(type default)
		)
		(uuid "c20de9d2-e8d9-4325-9f80-ad5e4e622a84")
	)
	(polyline
		(pts
			(xy 197.358 133.604) (xy 196.088 134.112)
		)
		(stroke
			(width 0)
			(type default)
		)
		(uuid "c26bdd88-0025-4af0-b78f-a9e35fe84a85")
	)
	(polyline
		(pts
			(xy 197.358 138.684) (xy 196.088 139.192)
		)
		(stroke
			(width 0)
			(type default)
		)
		(uuid "c2858cda-d065-455c-8630-1f9b81c07c37")
	)
	(polyline
		(pts
			(xy 198.628 135.89) (xy 217.424 136.906)
		)
		(stroke
			(width 0)
			(type default)
		)
		(uuid "c3242c45-0507-44dc-b77f-bdb04d23efb0")
	)
	(polyline
		(pts
			(xy 189.484 129.54) (xy 187.96 128.778)
		)
		(stroke
			(width 0)
			(type default)
		)
		(uuid "c454e6b5-6792-48b4-925a-0dedf7b4fe27")
	)
	(polyline
		(pts
			(xy 197.358 137.414) (xy 196.088 137.922)
		)
		(stroke
			(width 0)
			(type default)
		)
		(uuid "c8a96487-6b21-42d7-84c0-def51e36617a")
	)
	(polyline
		(pts
			(xy 216.408 136.652) (xy 215.138 137.16)
		)
		(stroke
			(width 0)
			(type default)
		)
		(uuid "cbd5be2c-265a-4962-94ba-f623f3f6d546")
	)
	(polyline
		(pts
			(xy 197.358 134.366) (xy 196.088 134.874)
		)
		(stroke
			(width 0)
			(type default)
		)
		(uuid "cbef3393-6f4c-42c0-8497-4232b0aa72c7")
	)
	(polyline
		(pts
			(xy 216.408 131.572) (xy 215.138 132.08)
		)
		(stroke
			(width 0)
			(type default)
		)
		(uuid "cca43cfd-bc36-43a2-81bd-31cd2e8ddd68")
	)
	(wire
		(pts
			(xy 137.16 99.06) (xy 137.16 96.52)
		)
		(stroke
			(width 0)
			(type default)
		)
		(uuid "ccb7c01c-755b-438f-909c-b33a5ed28c39")
	)
	(wire
		(pts
			(xy 185.42 92.71) (xy 191.77 92.71)
		)
		(stroke
			(width 0)
			(type default)
		)
		(uuid "d0cd0236-ebf0-496e-acc6-d0ce0acd398a")
	)
	(wire
		(pts
			(xy 113.03 91.44) (xy 119.38 91.44)
		)
		(stroke
			(width 0)
			(type default)
		)
		(uuid "d3cd2054-a755-4a23-afb2-8f35bfa83f34")
	)
	(wire
		(pts
			(xy 113.03 101.6) (xy 119.38 101.6)
		)
		(stroke
			(width 0)
			(type default)
		)
		(uuid "d6d12a54-45ab-4b41-9b86-1cbdaa3d82eb")
	)
	(wire
		(pts
			(xy 185.42 97.79) (xy 191.77 97.79)
		)
		(stroke
			(width 0)
			(type default)
		)
		(uuid "d75f206c-3b88-42cf-85e4-b033e295dcfb")
	)
	(wire
		(pts
			(xy 137.16 81.28) (xy 137.16 83.82)
		)
		(stroke
			(width 0)
			(type default)
		)
		(uuid "d8882c14-7cd2-4eb2-a1eb-9e116c6a550c")
	)
	(wire
		(pts
			(xy 113.03 83.82) (xy 119.38 83.82)
		)
		(stroke
			(width 0)
			(type default)
		)
		(uuid "d92bec52-97fc-4f1a-b326-1a87e7df83c2")
	)
	(polyline
		(pts
			(xy 197.358 135.636) (xy 196.088 136.144)
		)
		(stroke
			(width 0)
			(type default)
		)
		(uuid "d94e0fb6-a448-4165-9fe3-3783d3d9826c")
	)
	(wire
		(pts
			(xy 167.64 90.17) (xy 167.64 85.09)
		)
		(stroke
			(width 0)
			(type default)
		)
		(uuid "dabdc328-549d-4395-b911-6443318564c6")
	)
	(polyline
		(pts
			(xy 135.255 117.221) (xy 136.525 117.856)
		)
		(stroke
			(width 0)
			(type dash)
		)
		(uuid "de5e49ab-9d9d-47b6-a45c-5d378954a830")
	)
	(polyline
		(pts
			(xy 216.408 134.62) (xy 215.138 135.128)
		)
		(stroke
			(width 0)
			(type default)
		)
		(uuid "e07357b2-7fc1-4ee1-a3cb-e64bac5bb982")
	)
	(wire
		(pts
			(xy 137.16 96.52) (xy 137.16 93.98)
		)
		(stroke
			(width 0)
			(type default)
		)
		(uuid "e077aaa0-fcf4-4fa7-94e5-a0b380730d41")
	)
	(polyline
		(pts
			(xy 216.408 134.112) (xy 215.138 134.62)
		)
		(stroke
			(width 0)
			(type default)
		)
		(uuid "e2a679cc-5672-46e7-ba1c-754b20fe3d15")
	)
	(polyline
		(pts
			(xy 58.42 108.966) (xy 64.135 104.521)
		)
		(stroke
			(width 0)
			(type default)
		)
		(uuid "e3968b7d-93fe-482f-8ede-dfeb5ef0c439")
	)
	(polyline
		(pts
			(xy 198.628 132.08) (xy 217.424 140.716)
		)
		(stroke
			(width 0)
			(type default)
		)
		(uuid "e59ff4ef-79ea-4786-98fa-f0fa90999830")
	)
	(polyline
		(pts
			(xy 189.484 143.002) (xy 187.96 142.24)
		)
		(stroke
			(width 0)
			(type default)
		)
		(uuid "e9a083f7-bbe9-44dd-9c5f-12e02f864fba")
	)
	(polyline
		(pts
			(xy 198.628 130.81) (xy 217.424 141.986)
		)
		(stroke
			(width 0)
			(type default)
		)
		(uuid "eabe8871-cd5b-44b4-80b5-ecee65ee19ad")
	)
	(polyline
		(pts
			(xy 226.06 129.286) (xy 227.584 128.524)
		)
		(stroke
			(width 0)
			(type default)
		)
		(uuid "ec81c3bd-4e0c-4de4-9d0d-089590dce9b3")
	)
	(polyline
		(pts
			(xy 198.628 133.35) (xy 217.424 139.446)
		)
		(stroke
			(width 0)
			(type default)
		)
		(uuid "ef9ee086-8672-46b8-9dc0-e8d0be2058f2")
	)
	(polyline
		(pts
			(xy 116.205 108.966) (xy 117.475 109.601)
		)
		(stroke
			(width 0)
			(type default)
		)
		(uuid "f207a9e5-ca78-47be-8169-8edb2928e539")
	)
	(polyline
		(pts
			(xy 215.138 129.794) (xy 215.138 143.256)
		)
		(stroke
			(width 0)
			(type default)
		)
		(uuid "f312b928-0d1d-44ec-96f6-fe9b2716f491")
	)
	(polyline
		(pts
			(xy 197.358 139.954) (xy 196.088 140.462)
		)
		(stroke
			(width 0)
			(type default)
		)
		(uuid "f6fbbc7a-014c-42b6-8979-cef4d093c11e")
	)
	(wire
		(pts
			(xy 132.08 86.36) (xy 137.16 86.36)
		)
		(stroke
			(width 0)
			(type default)
		)
		(uuid "f8f36e8d-171b-4c0d-ab9e-600fd2ab489a")
	)
	(polyline
		(pts
			(xy 198.628 137.16) (xy 217.424 135.636)
		)
		(stroke
			(width 0)
			(type default)
		)
		(uuid "f90a4969-4ca3-4a23-9f03-cbfd3a1a94d4")
	)
	(polyline
		(pts
			(xy 190.754 142.24) (xy 198.628 142.24)
		)
		(stroke
			(width 0)
			(type dash)
			(color 194 0 0 1)
		)
		(uuid "fb0ec7ea-f1c6-4f30-acea-da99b73a6026")
	)
	(polyline
		(pts
			(xy 226.06 142.24) (xy 226.568 141.732)
		)
		(stroke
			(width 0)
			(type default)
		)
		(uuid "fbd4dec0-b5d9-4ab6-8855-c149a27bcbff")
	)
	(polyline
		(pts
			(xy 58.42 112.776) (xy 64.77 107.696)
		)
		(stroke
			(width 0)
			(type dash)
		)
		(uuid "fc042cf3-de25-4582-a083-155e8776cafb")
	)
	(polyline
		(pts
			(xy 121.666 113.665) (xy 121.666 119.253)
		)
		(stroke
			(width 0.508)
			(type default)
		)
		(uuid "fdab0010-b009-409a-9e1e-348ddb137e87")
	)
	(polyline
		(pts
			(xy 216.408 137.922) (xy 215.138 138.43)
		)
		(stroke
			(width 0)
			(type default)
		)
		(uuid "fe8d8b57-f7fe-40c3-b28a-4ec93dcb85a5")
	)
	(rectangle
		(start 191.008 133.604)
		(end 190.246 132.842)
		(stroke
			(width 0)
			(type default)
		)
		(fill
			(type none)
		)
		(uuid 09175aa1-5884-408a-a27e-c33a2e1c55de)
	)
	(rectangle
		(start 225.298 140.208)
		(end 224.536 140.97)
		(stroke
			(width 0)
			(type default)
		)
		(fill
			(type none)
		)
		(uuid 23802998-d9f7-4271-b088-8f787599d1c2)
	)
	(rectangle
		(start 198.12 137.414)
		(end 198.882 136.652)
		(stroke
			(width 0)
			(type default)
		)
		(fill
			(type none)
		)
		(uuid 27dc59ec-c57a-4be3-b1fb-ae1cf86a4a58)
	)
	(rectangle
		(start 191.008 142.494)
		(end 190.246 141.732)
		(stroke
			(width 0)
			(type default)
		)
		(fill
			(type none)
		)
		(uuid 2a870bc4-65c9-44ed-8d07-d2cd4c5332ef)
	)
	(circle
		(center 67.945 109.982)
		(radius 0.3592)
		(stroke
			(width 0)
			(type default)
		)
		(fill
			(type color)
			(color 0 0 0 0)
		)
		(uuid 336688a4-7565-4b6a-b4a0-78c20cfbbf1a)
	)
	(rectangle
		(start 217.17 132.08)
		(end 217.932 131.318)
		(stroke
			(width 0)
			(type default)
		)
		(fill
			(type none)
		)
		(uuid 43ab19bb-c610-460e-81b1-0565f5c34e9c)
	)
	(rectangle
		(start 225.298 137.668)
		(end 224.536 138.43)
		(stroke
			(width 0)
			(type default)
		)
		(fill
			(type none)
		)
		(uuid 4e1d3751-3e2b-4754-9e8f-595d08c25518)
	)
	(rectangle
		(start 198.12 138.684)
		(end 198.882 137.922)
		(stroke
			(width 0)
			(type default)
		)
		(fill
			(type none)
		)
		(uuid 56e74f45-236f-4ce0-8802-6074fcad4c24)
	)
	(rectangle
		(start 198.12 139.954)
		(end 198.882 139.192)
		(stroke
			(width 0)
			(type default)
		)
		(fill
			(type none)
		)
		(uuid 5925fa77-4547-4d3c-851a-7d757672fcc0)
	)
	(rectangle
		(start 217.17 135.89)
		(end 217.932 135.128)
		(stroke
			(width 0)
			(type default)
		)
		(fill
			(type none)
		)
		(uuid 5989719b-db43-42a2-8720-6f3ff6738550)
	)
	(rectangle
		(start 217.17 140.97)
		(end 217.932 140.208)
		(stroke
			(width 0)
			(type default)
		)
		(fill
			(type none)
		)
		(uuid 5b3d487d-bc9d-460e-b1f7-ff8ce5329821)
	)
	(rectangle
		(start 133.35 113.792)
		(end 134.366 114.808)
		(stroke
			(width 0)
			(type default)
		)
		(fill
			(type none)
		)
		(uuid 5b743542-8729-4a34-84af-e93239fe1065)
	)
	(rectangle
		(start 191.008 137.414)
		(end 190.246 136.652)
		(stroke
			(width 0)
			(type default)
		)
		(fill
			(type none)
		)
		(uuid 61b63cf9-0faa-41fa-9f31-f240eb6931cd)
	)
	(rectangle
		(start 224.028 129.286)
		(end 226.06 142.748)
		(stroke
			(width 0)
			(type default)
		)
		(fill
			(type none)
		)
		(uuid 6a6bf066-57cf-4895-8467-b94b6273b8f3)
	)
	(rectangle
		(start 197.358 129.794)
		(end 199.39 143.256)
		(stroke
			(width 0)
			(type default)
		)
		(fill
			(type none)
		)
		(uuid 6c19ad34-6146-47df-a718-d0d548b9ab35)
	)
	(rectangle
		(start 119.126 113.665)
		(end 120.142 114.681)
		(stroke
			(width 0)
			(type default)
		)
		(fill
			(type none)
		)
		(uuid 71ebd2d4-d6ad-44a1-8886-35bd7904f590)
	)
	(rectangle
		(start 198.12 134.874)
		(end 198.882 134.112)
		(stroke
			(width 0)
			(type default)
		)
		(fill
			(type none)
		)
		(uuid 774725b9-2204-403a-a1ff-48a15d887132)
	)
	(rectangle
		(start 191.008 139.954)
		(end 190.246 139.192)
		(stroke
			(width 0)
			(type default)
		)
		(fill
			(type none)
		)
		(uuid 7b0a4d3e-eeda-4841-9f9b-d7c24432ff6a)
	)
	(rectangle
		(start 225.298 141.478)
		(end 224.536 142.24)
		(stroke
			(width 0)
			(type default)
		)
		(fill
			(type none)
		)
		(uuid 7f752f77-924a-4af0-9771-655f6930352c)
	)
	(rectangle
		(start 225.298 132.588)
		(end 224.536 133.35)
		(stroke
			(width 0)
			(type default)
		)
		(fill
			(type none)
		)
		(uuid 84f9614a-959b-4b43-bae5-01c1c2670bbf)
	)
	(rectangle
		(start 198.12 142.494)
		(end 198.882 141.732)
		(stroke
			(width 0)
			(type default)
		)
		(fill
			(type none)
		)
		(uuid 8552b450-bef8-4268-a55d-c93efba6e04d)
	)
	(rectangle
		(start 198.12 141.224)
		(end 198.882 140.462)
		(stroke
			(width 0)
			(type default)
		)
		(fill
			(type none)
		)
		(uuid 8fd7a186-2976-49a3-b8ff-03ac2434a3e6)
	)
	(rectangle
		(start 191.008 138.684)
		(end 190.246 137.922)
		(stroke
			(width 0)
			(type default)
		)
		(fill
			(type none)
		)
		(uuid 93c00354-60a2-492b-ac00-a644620ea544)
	)
	(rectangle
		(start 133.35 111.76)
		(end 134.366 112.776)
		(stroke
			(width 0)
			(type default)
		)
		(fill
			(type none)
		)
		(uuid 94bba593-f560-45f7-86fa-f4e639e7c048)
	)
	(rectangle
		(start 189.484 143.002)
		(end 191.516 129.54)
		(stroke
			(width 0)
			(type default)
		)
		(fill
			(type none)
		)
		(uuid ad394cc2-7efc-4c3e-b37b-f34641416d0f)
	)
	(rectangle
		(start 217.17 133.35)
		(end 217.932 132.588)
		(stroke
			(width 0)
			(type default)
		)
		(fill
			(type none)
		)
		(uuid aea9c548-69a0-4333-9e71-64420e940796)
	)
	(rectangle
		(start 225.298 133.858)
		(end 224.536 134.62)
		(stroke
			(width 0)
			(type default)
		)
		(fill
			(type none)
		)
		(uuid b130268d-ae8b-44d2-ac30-f61c46c52748)
	)
	(rectangle
		(start 217.17 139.7)
		(end 217.932 138.938)
		(stroke
			(width 0)
			(type default)
		)
		(fill
			(type none)
		)
		(uuid b74618b4-8848-42a0-b376-6df660f24e5e)
	)
	(rectangle
		(start 217.17 137.16)
		(end 217.932 136.398)
		(stroke
			(width 0)
			(type default)
		)
		(fill
			(type none)
		)
		(uuid b7795f76-54c9-4b55-8f7b-05fa86000faf)
	)
	(rectangle
		(start 225.298 131.318)
		(end 224.536 132.08)
		(stroke
			(width 0)
			(type default)
		)
		(fill
			(type none)
		)
		(uuid c0885bce-4882-46a8-ab78-eabb4d0ce021)
	)
	(rectangle
		(start 191.008 132.334)
		(end 190.246 131.572)
		(stroke
			(width 0)
			(type default)
		)
		(fill
			(type none)
		)
		(uuid c0cf303b-d0aa-4cca-8f34-cc8821491237)
	)
	(rectangle
		(start 225.298 135.128)
		(end 224.536 135.89)
		(stroke
			(width 0)
			(type default)
		)
		(fill
			(type none)
		)
		(uuid c4753259-4e2a-4045-8a14-4135d213e96b)
	)
	(rectangle
		(start 217.17 138.43)
		(end 217.932 137.668)
		(stroke
			(width 0)
			(type default)
		)
		(fill
			(type none)
		)
		(uuid c4904000-2468-4dbd-bae5-1fb206d2bf54)
	)
	(rectangle
		(start 217.17 134.62)
		(end 217.932 133.858)
		(stroke
			(width 0)
			(type default)
		)
		(fill
			(type none)
		)
		(uuid c6dadd0a-8fdf-482b-9963-9d5cd4ac73cd)
	)
	(rectangle
		(start 217.17 130.81)
		(end 217.932 130.048)
		(stroke
			(width 0)
			(type default)
		)
		(fill
			(type none)
		)
		(uuid ca593357-e51a-4ffd-a14e-6f85549c3bde)
	)
	(rectangle
		(start 198.12 136.144)
		(end 198.882 135.382)
		(stroke
			(width 0)
			(type default)
		)
		(fill
			(type none)
		)
		(uuid caa1ee58-8c57-4462-8ae3-f1f497e1d1bb)
	)
	(rectangle
		(start 191.008 131.064)
		(end 190.246 130.302)
		(stroke
			(width 0)
			(type default)
		)
		(fill
			(type none)
		)
		(uuid cdf7f680-2b0f-484b-b30a-e69d310a3588)
	)
	(rectangle
		(start 225.298 130.048)
		(end 224.536 130.81)
		(stroke
			(width 0)
			(type default)
		)
		(fill
			(type none)
		)
		(uuid d7446108-8759-49d0-8101-1a03f3be5dc9)
	)
	(rectangle
		(start 225.298 138.938)
		(end 224.536 139.7)
		(stroke
			(width 0)
			(type default)
		)
		(fill
			(type none)
		)
		(uuid dfdfa238-b280-451e-a98c-4526de8f8229)
	)
	(rectangle
		(start 191.008 136.144)
		(end 190.246 135.382)
		(stroke
			(width 0)
			(type default)
		)
		(fill
			(type none)
		)
		(uuid e18ed72d-be44-4457-ac08-88da7c0deb09)
	)
	(rectangle
		(start 217.17 142.24)
		(end 217.932 141.478)
		(stroke
			(width 0)
			(type default)
		)
		(fill
			(type none)
		)
		(uuid e1aaed00-f673-4955-805f-349b51b75488)
	)
	(rectangle
		(start 198.12 133.604)
		(end 198.882 132.842)
		(stroke
			(width 0)
			(type default)
		)
		(fill
			(type none)
		)
		(uuid ec09a1ce-53d5-4e10-9a5d-6cb3f8acf207)
	)
	(rectangle
		(start 191.008 134.874)
		(end 190.246 134.112)
		(stroke
			(width 0)
			(type default)
		)
		(fill
			(type none)
		)
		(uuid edbeebc9-0754-4acb-bc37-9036f56a0d65)
	)
	(rectangle
		(start 218.44 143.002)
		(end 216.408 129.54)
		(stroke
			(width 0)
			(type default)
		)
		(fill
			(type none)
		)
		(uuid f0661edc-8855-4701-86f9-0e03f68d263c)
	)
	(rectangle
		(start 191.008 141.224)
		(end 190.246 140.462)
		(stroke
			(width 0)
			(type default)
		)
		(fill
			(type none)
		)
		(uuid f13daa46-dcad-4585-802a-016d01cc1c56)
	)
	(rectangle
		(start 198.12 131.064)
		(end 198.882 130.302)
		(stroke
			(width 0)
			(type default)
		)
		(fill
			(type none)
		)
		(uuid f51cddd6-0e4c-48d1-bd72-274dffb1fd73)
	)
	(rectangle
		(start 225.298 136.398)
		(end 224.536 137.16)
		(stroke
			(width 0)
			(type default)
		)
		(fill
			(type none)
		)
		(uuid f9e12f93-7169-4122-baee-dddc9ce635e2)
	)
	(rectangle
		(start 119.126 111.633)
		(end 120.142 112.649)
		(stroke
			(width 0)
			(type default)
		)
		(fill
			(type none)
		)
		(uuid fdc4fa0e-446d-440e-a7ba-1d3316f165e9)
	)
	(rectangle
		(start 198.12 132.334)
		(end 198.882 131.572)
		(stroke
			(width 0)
			(type default)
		)
		(fill
			(type none)
		)
		(uuid febcf5a9-a7b7-47b8-a154-42c4eb6f94ce)
	)
	(text "1"
		(exclude_from_sim no)
		(at 188.976 144.272 0)
		(effects
			(font
				(size 1.27 1.27)
			)
		)
		(uuid "040167ee-69eb-4011-84ae-a43f98049809")
	)
	(text "1"
		(exclude_from_sim no)
		(at 226.568 144.018 0)
		(effects
			(font
				(size 1.27 1.27)
			)
		)
		(uuid "0b10138a-7079-4301-9193-7e1ffda7ef15")
	)
	(text "3v3_D"
		(exclude_from_sim no)
		(at 230.886 130.556 0)
		(effects
			(font
				(size 1.27 1.27)
				(color 194 0 0 1)
			)
		)
		(uuid "13a49b70-108f-44d0-b479-e430aea01a26")
	)
	(text "MCU Breakout"
		(exclude_from_sim no)
		(at 189.992 124.206 0)
		(effects
			(font
				(size 1.27 1.27)
			)
		)
		(uuid "165d1151-f3f9-43dd-95d1-a4b4ff2b37e3")
	)
	(text "1"
		(exclude_from_sim no)
		(at 216.916 145.288 90)
		(effects
			(font
				(size 1.27 1.27)
			)
		)
		(uuid "1fd6f490-a8ad-4fbf-9a44-692d3c43c2b6")
	)
	(text "19"
		(exclude_from_sim no)
		(at 132.588 114.554 0)
		(effects
			(font
				(size 0.508 0.508)
			)
		)
		(uuid "22fab855-cabc-45d6-a483-9c6075da276f")
	)
	(text "1"
		(exclude_from_sim no)
		(at 118.618 114.427 0)
		(effects
			(font
				(size 0.508 0.508)
			)
		)
		(uuid "3a382747-cd8a-47ec-86f5-553e81eb6d4f")
	)
	(text "2"
		(exclude_from_sim no)
		(at 118.618 112.395 0)
		(effects
			(font
				(size 0.508 0.508)
			)
		)
		(uuid "3a75c776-f7a3-48b3-9a71-0caf5fb40787")
	)
	(text "2"
		(exclude_from_sim no)
		(at 119.888 120.269 0)
		(effects
			(font
				(size 0.508 0.508)
			)
		)
		(uuid "4ced1fb1-978a-4bc2-9b00-c4e240223fc7")
	)
	(text "SatNOGS COMMS"
		(exclude_from_sim no)
		(at 222.25 123.444 0)
		(effects
			(font
				(size 1.27 1.27)
			)
		)
		(uuid "50d97c41-c709-4dc1-bf7e-06a0bdbeb11f")
	)
	(text "Cable Assembly (15134-1002)\n"
		(exclude_from_sim no)
		(at 207.264 149.606 0)
		(effects
			(font
				(size 1.27 1.27)
			)
		)
		(uuid "666b34d5-8004-4140-a63c-a05826afed0d")
	)
	(text "Turned due to opposite layers"
		(exclude_from_sim no)
		(at 205.74 119.38 0)
		(effects
			(font
				(size 1.27 1.27)
			)
		)
		(uuid "6a52c0f6-90c1-4411-9628-d627b78015fa")
	)
	(text "SatNOGS COMMS\nConnector on Bottom Layer\n------------\n10 -> 3v3_D\n9  -> NJRST\n8  -> MCU_NRST\n7  -> JTDI\n6  -> GND\n5  -> JTDO-SWO\n4  -> GND\n3  -> JTMS-SWDIO\n2  -> GND\n1  -> JTCK-SWCLK"
		(exclude_from_sim no)
		(at 214.884 90.17 0)
		(effects
			(font
				(size 1.27 1.27)
			)
			(justify left)
		)
		(uuid "6f21fcf7-f62d-4ac3-a309-04c811406819")
	)
	(text "J-Link EDU\nTop right pin 1\n------------\n1 VCC         2 NC  \n3 nTRST       4 GND\n5 TDI         6 GND\n7 SWDIO/TMS   8 GND\n9 SWCLK/TCLK  10 GND\n11 RTCK       12 GND\n13 SWO/TDO    14 GND\n15 RESET      16 GND\n17 NC         18 GND\n19 NC/+5V     20 GND"
		(exclude_from_sim no)
		(at 67.945 88.265 0)
		(effects
			(font
				(face "KiCad Font")
				(size 1.27 1.27)
			)
		)
		(uuid "72f91973-bab8-4acc-8bd3-a9bd312cc203")
	)
	(text "10"
		(exclude_from_sim no)
		(at 198.628 127.508 90)
		(effects
			(font
				(size 1.27 1.27)
			)
		)
		(uuid "781df3b5-a729-4baa-aaea-67bea5aa0cc8")
	)
	(text "1"
		(exclude_from_sim no)
		(at 197.866 145.542 90)
		(effects
			(font
				(size 1.27 1.27)
			)
		)
		(uuid "7e2bc804-3f5b-4476-993a-21bb17e39afa")
	)
	(text "3v3_D"
		(exclude_from_sim no)
		(at 183.896 142.494 0)
		(effects
			(font
				(size 1.27 1.27)
				(color 194 0 0 1)
			)
		)
		(uuid "853acac4-c4f2-416d-87af-b5e9e5015f77")
	)
	(text "1"
		(exclude_from_sim no)
		(at 119.888 119.253 0)
		(effects
			(font
				(size 0.508 0.508)
			)
		)
		(uuid "88304e56-1969-4d4c-80f2-7a127ad5abac")
	)
	(text "10"
		(exclude_from_sim no)
		(at 226.06 127.254 0)
		(effects
			(font
				(size 1.27 1.27)
			)
		)
		(uuid "91585e7a-4cc4-4342-bc7c-f81daef4e5c5")
	)
	(text "1"
		(exclude_from_sim no)
		(at 68.707 110.236 0)
		(effects
			(font
				(size 0.508 0.508)
			)
		)
		(uuid "9614d367-2c05-4d5c-b304-f22abcf8c47d")
	)
	(text "10"
		(exclude_from_sim no)
		(at 217.678 127.254 90)
		(effects
			(font
				(size 1.27 1.27)
			)
		)
		(uuid "b360b142-96c8-4b9e-ac69-6ada8c6161ef")
	)
	(text "10"
		(exclude_from_sim no)
		(at 189.484 127.508 0)
		(effects
			(font
				(size 1.27 1.27)
			)
		)
		(uuid "c47eab68-579f-4042-8e2f-a47f6a1f3cce")
	)
	(text "20"
		(exclude_from_sim no)
		(at 132.588 112.522 0)
		(effects
			(font
				(size 0.508 0.508)
			)
		)
		(uuid "d27eb4a5-3ac6-479e-8e18-7010f9a31c84")
	)
	(label "JTDO-SWO"
		(at 111.76 86.36 180)
		(fields_autoplaced yes)
		(effects
			(font
				(size 1.27 1.27)
			)
			(justify right bottom)
		)
		(uuid "02e93144-84a5-4f5d-aea8-c97f9579f888")
	)
	(label "JTDI"
		(at 185.42 87.63 180)
		(fields_autoplaced yes)
		(effects
			(font
				(size 1.27 1.27)
			)
			(justify right bottom)
		)
		(uuid "1a4964aa-96e4-4309-81ac-9c0db8673be9")
	)
	(label "JTCK-SWCLK"
		(at 113.03 91.44 180)
		(fields_autoplaced yes)
		(effects
			(font
				(size 1.27 1.27)
			)
			(justify right bottom)
		)
		(uuid "24140202-42bb-4c41-bdb3-3b742116e9c2")
	)
	(label "NJRST"
		(at 185.42 82.55 180)
		(fields_autoplaced yes)
		(effects
			(font
				(size 1.27 1.27)
			)
			(justify right bottom)
		)
		(uuid "2c1a9721-fe05-4a6b-9ba9-cad9f30e1ff9")
	)
	(label "MCU_NRST"
		(at 113.03 83.82 180)
		(fields_autoplaced yes)
		(effects
			(font
				(size 1.27 1.27)
			)
			(justify right bottom)
		)
		(uuid "31d13793-65ee-4649-b1b2-ef9d6023aa36")
	)
	(label "NJRST"
		(at 113.03 99.06 180)
		(fields_autoplaced yes)
		(effects
			(font
				(size 1.27 1.27)
			)
			(justify right bottom)
		)
		(uuid "3df22015-12cf-49e6-90a7-7c8fdc158c3d")
	)
	(label "3V3_D"
		(at 185.42 80.01 180)
		(fields_autoplaced yes)
		(effects
			(font
				(size 1.27 1.27)
			)
			(justify right bottom)
		)
		(uuid "80dd1ed3-30c7-49ec-bbd1-5ab67bce7f44")
	)
	(label "JTCK-SWCLK"
		(at 185.42 102.87 180)
		(fields_autoplaced yes)
		(effects
			(font
				(size 1.27 1.27)
			)
			(justify right bottom)
		)
		(uuid "97e64307-fcb2-4d2a-860f-d0a4ea3a310f")
	)
	(label "JTMS-SWDIO"
		(at 185.42 97.79 180)
		(fields_autoplaced yes)
		(effects
			(font
				(size 1.27 1.27)
			)
			(justify right bottom)
		)
		(uuid "abff0277-bce6-4d65-bf54-3713ad3ff6ef")
	)
	(label "JTMS-SWDIO"
		(at 113.03 93.98 180)
		(fields_autoplaced yes)
		(effects
			(font
				(size 1.27 1.27)
			)
			(justify right bottom)
		)
		(uuid "b7ba142c-87f8-43ae-a5bc-0dd17a485414")
	)
	(label "3V3_D"
		(at 113.03 101.6 180)
		(fields_autoplaced yes)
		(effects
			(font
				(size 1.27 1.27)
			)
			(justify right bottom)
		)
		(uuid "bc43fb16-76ff-4375-b8bf-8aaa930673c0")
	)
	(label "MCU_NRST"
		(at 185.42 85.09 180)
		(fields_autoplaced yes)
		(effects
			(font
				(size 1.27 1.27)
			)
			(justify right bottom)
		)
		(uuid "cd547c73-c721-45c1-812e-1db52a125146")
	)
	(label "JTDO-SWO"
		(at 185.42 92.71 180)
		(fields_autoplaced yes)
		(effects
			(font
				(size 1.27 1.27)
			)
			(justify right bottom)
		)
		(uuid "eeb23060-d1e1-42c8-bf26-ea213ee3f8ea")
	)
	(label "JTDI"
		(at 113.03 96.52 180)
		(fields_autoplaced yes)
		(effects
			(font
				(size 1.27 1.27)
			)
			(justify right bottom)
		)
		(uuid "f292d519-1d3c-4665-8e60-7b198757df56")
	)
	(symbol
		(lib_id "Connector_Generic:Conn_02x10_Odd_Even")
		(at 127 88.9 0)
		(mirror y)
		(unit 1)
		(exclude_from_sim no)
		(in_bom yes)
		(on_board yes)
		(dnp no)
		(uuid "11888ff6-4db1-4ae6-97f7-3ec6e253ba5d")
		(property "Reference" "J2"
			(at 125.73 72.39 0)
			(effects
				(font
					(size 1.27 1.27)
				)
			)
		)
		(property "Value" "SSQ-110-22-F-D-RA"
			(at 125.73 74.93 0)
			(effects
				(font
					(size 1.27 1.27)
				)
			)
		)
		(property "Footprint" "LSF_KICAD_LIB:SAMTEC_SSQ-110-22-G-D-RA"
			(at 127 88.9 0)
			(effects
				(font
					(size 1.27 1.27)
				)
				(hide yes)
			)
		)
		(property "Datasheet" "https://suddendocs.samtec.com/catalog_english/ssq_th.pdf"
			(at 127 88.9 0)
			(effects
				(font
					(size 1.27 1.27)
				)
				(hide yes)
			)
		)
		(property "Description" "Generic connector, double row, 02x10, odd/even pin numbering scheme (row 1 odd numbers, row 2 even numbers), script generated (kicad-library-utils/schlib/autogen/connector/)"
			(at 127 88.9 0)
			(effects
				(font
					(size 1.27 1.27)
				)
				(hide yes)
			)
		)
		(pin "2"
			(uuid "17a9a165-7e83-4d67-80bc-3fe322d69a9a")
		)
		(pin "19"
			(uuid "606d6ef7-4980-4f69-a327-ec2ce76fba81")
		)
		(pin "18"
			(uuid "169763ba-18b8-48c8-9426-5aaafbbba9fa")
		)
		(pin "15"
			(uuid "46b4435e-4213-4f44-afb0-f31584cf4348")
		)
		(pin "20"
			(uuid "c221b9e0-b6e3-4a4a-9c87-120345ffb163")
		)
		(pin "12"
			(uuid "b3d2baf8-5685-4308-98a6-3b4ba56e4e30")
		)
		(pin "4"
			(uuid "78cbf5ac-cf5a-4f2d-882a-c7ac0259c465")
		)
		(pin "3"
			(uuid "29228f9a-6592-46e3-980d-ac9d66d64664")
		)
		(pin "13"
			(uuid "5b66b100-671b-417d-9ed9-9b1b91fe5cf2")
		)
		(pin "5"
			(uuid "ebf8c8c4-897f-43db-8481-c5cee73ee7d2")
		)
		(pin "9"
			(uuid "855d22f0-eb8e-4002-b363-6047be55d532")
		)
		(pin "6"
			(uuid "0a11d525-4b76-4f13-b3a3-cb012835301b")
		)
		(pin "16"
			(uuid "275706a8-e46b-4241-bb10-25e891fb9acc")
		)
		(pin "17"
			(uuid "72abb7a5-c424-4ca4-be22-6ff844ff5cf5")
		)
		(pin "8"
			(uuid "7397272a-c57f-4e97-9a54-6bb2532acb4c")
		)
		(pin "7"
			(uuid "e5022ed9-fee5-4d0a-9358-8f85639ab3e4")
		)
		(pin "1"
			(uuid "913d186d-bb19-4eb2-a37d-f0c940b25c3c")
		)
		(pin "14"
			(uuid "f713431b-282c-4685-a11d-bcf737d7a81a")
		)
		(pin "11"
			(uuid "2f4b6451-4b78-4eb9-b16c-5de586e4d67e")
		)
		(pin "10"
			(uuid "e97109cc-093c-4934-bcfa-9b40f5506ce6")
		)
		(instances
			(project "mcu-breakout-board"
				(path "/9ce38d15-e3fd-449a-85d0-08ce415b8b43"
					(reference "J2")
					(unit 1)
				)
			)
		)
	)
	(symbol
		(lib_id "power:GND")
		(at 167.64 85.09 0)
		(mirror x)
		(unit 1)
		(exclude_from_sim no)
		(in_bom yes)
		(on_board yes)
		(dnp no)
		(fields_autoplaced yes)
		(uuid "2938aa46-e786-4719-a256-95bb170cb61a")
		(property "Reference" "#PWR02"
			(at 167.64 78.74 0)
			(effects
				(font
					(size 1.27 1.27)
				)
				(hide yes)
			)
		)
		(property "Value" "GND"
			(at 167.64 80.01 0)
			(effects
				(font
					(size 1.27 1.27)
				)
			)
		)
		(property "Footprint" ""
			(at 167.64 85.09 0)
			(effects
				(font
					(size 1.27 1.27)
				)
				(hide yes)
			)
		)
		(property "Datasheet" ""
			(at 167.64 85.09 0)
			(effects
				(font
					(size 1.27 1.27)
				)
				(hide yes)
			)
		)
		(property "Description" "Power symbol creates a global label with name \"GND\" , ground"
			(at 167.64 85.09 0)
			(effects
				(font
					(size 1.27 1.27)
				)
				(hide yes)
			)
		)
		(pin "1"
			(uuid "499d5b79-af2b-48f0-b51e-8bf1bb3acb9d")
		)
		(instances
			(project "mcu-breakout-board"
				(path "/9ce38d15-e3fd-449a-85d0-08ce415b8b43"
					(reference "#PWR02")
					(unit 1)
				)
			)
		)
	)
	(symbol
		(lib_id "power:PWR_FLAG")
		(at 167.64 101.6 0)
		(mirror x)
		(unit 1)
		(exclude_from_sim no)
		(in_bom yes)
		(on_board yes)
		(dnp no)
		(fields_autoplaced yes)
		(uuid "8a807fcc-1273-40c0-9476-c0d7fe677fb9")
		(property "Reference" "#FLG01"
			(at 167.64 103.505 0)
			(effects
				(font
					(size 1.27 1.27)
				)
				(hide yes)
			)
		)
		(property "Value" "PWR_FLAG"
			(at 167.64 106.68 0)
			(effects
				(font
					(size 1.27 1.27)
				)
			)
		)
		(property "Footprint" ""
			(at 167.64 101.6 0)
			(effects
				(font
					(size 1.27 1.27)
				)
				(hide yes)
			)
		)
		(property "Datasheet" "~"
			(at 167.64 101.6 0)
			(effects
				(font
					(size 1.27 1.27)
				)
				(hide yes)
			)
		)
		(property "Description" "Special symbol for telling ERC where power comes from"
			(at 167.64 101.6 0)
			(effects
				(font
					(size 1.27 1.27)
				)
				(hide yes)
			)
		)
		(pin "1"
			(uuid "e9d9b436-b3ee-4a91-bf55-7f603c23bbc1")
		)
		(instances
			(project "mcu-breakout-board"
				(path "/9ce38d15-e3fd-449a-85d0-08ce415b8b43"
					(reference "#FLG01")
					(unit 1)
				)
			)
		)
	)
	(symbol
		(lib_id "power:GND")
		(at 137.16 101.6 0)
		(unit 1)
		(exclude_from_sim no)
		(in_bom yes)
		(on_board yes)
		(dnp no)
		(fields_autoplaced yes)
		(uuid "db35d348-5f0e-485a-8e06-445dcdc50515")
		(property "Reference" "#PWR01"
			(at 137.16 107.95 0)
			(effects
				(font
					(size 1.27 1.27)
				)
				(hide yes)
			)
		)
		(property "Value" "GND"
			(at 137.16 106.68 0)
			(effects
				(font
					(size 1.27 1.27)
				)
			)
		)
		(property "Footprint" ""
			(at 137.16 101.6 0)
			(effects
				(font
					(size 1.27 1.27)
				)
				(hide yes)
			)
		)
		(property "Datasheet" ""
			(at 137.16 101.6 0)
			(effects
				(font
					(size 1.27 1.27)
				)
				(hide yes)
			)
		)
		(property "Description" "Power symbol creates a global label with name \"GND\" , ground"
			(at 137.16 101.6 0)
			(effects
				(font
					(size 1.27 1.27)
				)
				(hide yes)
			)
		)
		(pin "1"
			(uuid "4e8c55c5-431e-48f1-ad35-4f2f89c02093")
		)
		(instances
			(project "mcu-breakout-board"
				(path "/9ce38d15-e3fd-449a-85d0-08ce415b8b43"
					(reference "#PWR01")
					(unit 1)
				)
			)
		)
	)
	(symbol
		(lib_id "Connector_Generic:Conn_01x10")
		(at 196.85 90.17 0)
		(unit 1)
		(exclude_from_sim no)
		(in_bom yes)
		(on_board yes)
		(dnp no)
		(uuid "f9ef4223-5ad0-425d-bb6f-51fd5318bc11")
		(property "Reference" "J1"
			(at 199.39 90.1699 0)
			(effects
				(font
					(size 1.27 1.27)
				)
				(justify left)
			)
		)
		(property "Value" "53261-1071"
			(at 199.39 92.7099 0)
			(effects
				(font
					(size 1.27 1.27)
				)
				(justify left)
			)
		)
		(property "Footprint" "Connector_Molex:Molex_PicoBlade_53261-1071_1x10-1MP_P1.25mm_Horizontal"
			(at 196.85 90.17 0)
			(effects
				(font
					(size 1.27 1.27)
				)
				(hide yes)
			)
		)
		(property "Datasheet" "https://www.molex.com/en-us/products/part-detail/532611071?display=pdf"
			(at 196.85 90.17 0)
			(effects
				(font
					(size 1.27 1.27)
				)
				(hide yes)
			)
		)
		(property "Description" "Generic connector, single row, 01x10, script generated (kicad-library-utils/schlib/autogen/connector/)"
			(at 196.85 90.17 0)
			(effects
				(font
					(size 1.27 1.27)
				)
				(hide yes)
			)
		)
		(pin "8"
			(uuid "979e8493-b18c-4607-befb-7b0d6ea4ee0b")
		)
		(pin "9"
			(uuid "2f6c7df4-a026-4b11-9f91-796ed7b98a55")
		)
		(pin "3"
			(uuid "0cbd376a-2cad-42f6-bc47-5efa450348e8")
		)
		(pin "10"
			(uuid "69dfc4e1-f621-478d-9b43-541f835a116f")
		)
		(pin "4"
			(uuid "c1f12d22-03e1-421f-a85d-fd7e7dc2b67f")
		)
		(pin "2"
			(uuid "6b6a1194-40b1-4802-80d8-ce2f276139aa")
		)
		(pin "1"
			(uuid "339b1f99-04ab-4285-bc00-94c6b4b56998")
		)
		(pin "7"
			(uuid "94afbf9a-8a59-4d0e-be2e-72c2607b9300")
		)
		(pin "6"
			(uuid "cf31cdc2-d131-4e8c-82d9-eb26da11aafe")
		)
		(pin "5"
			(uuid "8a700fa3-3351-4614-b8d4-9a96b992cefe")
		)
		(instances
			(project "mcu-breakout-board"
				(path "/9ce38d15-e3fd-449a-85d0-08ce415b8b43"
					(reference "J1")
					(unit 1)
				)
			)
		)
	)
	(sheet_instances
		(path "/"
			(page "1")
		)
	)
)