<Qucs Schematic 24.2.1>
<Properties>
  <View=80,69,1820,1311,0.816181,544,438>
  <Grid=10,10,1>
  <DataSet=clock-divider.dat>
  <DataDisplay=clock-divider.dpl>
  <OpenDisplay=0>
  <Script=clock-divider.m>
  <RunScript=0>
  <showFrame=0>
  <FrameText0=Title>
  <FrameText1=Drawn By:>
  <FrameText2=Date:>
  <FrameText3=Revision:>
</Properties>
<Symbol>
</Symbol>
<Components>
  <GND * 1 290 300 0 0 0 0>
  <Vac V1 1 180 170 18 -26 0 1 "1.65 V" 1 "26 MHz" 0 "0" 0 "0" 0 "0" 0 "0" 0>
  <.TR TR1 1 510 80 0 79 0 0 "lin" 1 "0" 1 "500 ns" 1 "500" 0 "Trapezoidal" 0 "2" 0 "1 ns" 0 "1e-16" 0 "150" 0 "0.001" 0 "1 pA" 0 "1 uV" 0 "26.85" 0 "1e-3" 0 "1e-6" 0 "1" 0 "CroutLU" 0 "no" 0 "yes" 0 "0" 0>
  <C C1 1 290 150 17 -26 0 1 "33 pF" 1 "" 0 "neutral" 0>
  <C C2 1 290 250 17 -26 0 1 "100 pF" 1 "" 0 "neutral" 0>
  <GND * 1 320 850 0 0 0 0>
  <C C6 1 550 800 17 -26 0 1 "55 pF" 1 "" 0 "neutral" 0>
  <C C5 1 1010 800 17 -26 0 1 "5 pF" 1 "" 0 "neutral" 0>
  <R R3 1 870 800 15 -26 0 1 "100 kOhm" 1 "26.85" 0 "0.0" 0 "0.0" 0 "26.85" 0 "european" 0>
  <GND * 1 940 850 0 0 0 0>
  <C C7 1 750 800 17 -26 0 1 "55 pF" 1 "" 0 "neutral" 0>
  <GND * 1 650 850 0 0 0 0>
  <C C8 1 820 750 -26 -61 0 2 "10 nF" 1 "" 0 "neutral" 0>
  <R R1 1 320 800 15 -26 0 1 "10 kOhm" 1 "26.85" 0 "0.0" 0 "0.0" 0 "26.85" 0 "european" 0>
  <.AC AC1 1 1140 1030 0 47 0 0 "lin" 1 "1M Hz" 1 "30 MHz" 1 "200" 1 "no" 0>
  <C C4 1 250 750 -26 -61 0 2 "10 nF" 1 "" 0 "neutral" 0>
  <Iac I1 1 180 800 20 -26 0 1 "2 mA" 1 "26 MHz" 0 "0" 0 "0" 0>
  <C C3 0 450 800 17 -26 0 1 "10 pF" 1 "" 0 "neutral" 0>
  <R R2 1 650 750 -26 -59 1 0 "1 Ohm" 1 "26.85" 0 "0.0" 0 "0.0" 0 "26.85" 0 "european" 0>
</Components>
<Wires>
  <290 280 290 290 "" 0 0 0 "">
  <290 290 290 300 "" 0 0 0 "">
  <180 290 290 290 "" 0 0 0 "">
  <180 200 180 290 "" 0 0 0 "">
  <180 100 180 140 "" 0 0 0 "">
  <180 100 290 100 "" 0 0 0 "">
  <290 100 290 120 "" 0 0 0 "">
  <290 180 290 220 "Vout" 320 180 25 "">
  <320 750 450 750 "" 0 0 0 "">
  <320 750 320 770 "" 0 0 0 "">
  <320 830 320 850 "" 0 0 0 "">
  <550 750 550 770 "" 0 0 0 "">
  <550 830 550 850 "" 0 0 0 "">
  <550 850 650 850 "" 0 0 0 "">
  <870 750 870 770 "" 0 0 0 "">
  <870 830 870 850 "" 0 0 0 "">
  <870 850 940 850 "" 0 0 0 "">
  <1010 830 1010 850 "" 0 0 0 "">
  <1010 750 1010 770 "" 0 0 0 "">
  <870 750 1010 750 "" 0 0 0 "">
  <940 850 1010 850 "" 0 0 0 "">
  <750 750 790 750 "" 0 0 0 "">
  <750 750 750 770 "" 0 0 0 "">
  <750 830 750 850 "" 0 0 0 "">
  <650 850 750 850 "" 0 0 0 "">
  <850 750 870 750 "" 0 0 0 "">
  <450 750 550 750 "" 0 0 0 "">
  <280 750 320 750 "" 0 0 0 "">
  <180 850 320 850 "" 0 0 0 "">
  <180 830 180 850 "" 0 0 0 "">
  <180 750 220 750 "" 0 0 0 "">
  <180 750 180 770 "" 0 0 0 "">
  <450 750 450 770 "" 0 0 0 "">
  <320 850 450 850 "" 0 0 0 "">
  <450 830 450 850 "" 0 0 0 "">
  <680 750 750 750 "" 0 0 0 "">
  <550 750 620 750 "" 0 0 0 "">
  <180 100 180 100 "Vin" 210 70 0 "">
  <1010 750 1010 750 "at" 1040 720 0 "">
  <180 750 180 750 "TCXOin" 150 680 0 "">
</Wires>
<Diagrams>
  <Rect 350 627 482 317 3 #c0c0c0 1 00 1 0 5e-08 5e-07 1 -0.491276 0.2 0.491276 1 -1 0.5 1 315 0 225 1 0 0 "" "" "">
	<"Vout.Vt" #0000ff 0 3 0 0 0>
	<"Vin.Vt" #ff0000 2 3 0 0 0>
  </Rect>
  <Rect 180 1225 728 325 3 #c0c0c0 1 00 1 0 5e-08 5e-07 1 -0.479998 0.2 0.479998 1 -1 0.5 1 315 0 225 1 0 0 "" "" "">
	<"TCXOin.Vt" #0000ff 2 3 0 0 0>
	<"at.Vt" #ff0000 2 3 0 0 0>
  </Rect>
  <Rect 1130 919 496 319 3 #c0c0c0 1 00 1 0 0.2 1 1 -0.1 0.5 1.1 1 -0.1 0.5 1.1 315 0 225 1 0 0 "" "" "">
	<"at.v" #0000ff 0 3 0 0 0>
  </Rect>
</Diagrams>
<Paintings>
</Paintings>
