(kicad_sch
	(version 20231120)
	(generator "eeschema")
	(generator_version "8.0")
	(uuid "e60135aa-f13b-4d7f-a02d-9f5e9a476e7c")
	(paper "A4")
	(title_block
		(title "SatNOGS COMMS")
		(date "2020-02-20")
		(comment 1 "CERN OHL version 1.2")
	)
	(lib_symbols
		(symbol "Connector:TestPoint"
			(pin_numbers hide)
			(pin_names
				(offset 0.762) hide)
			(exclude_from_sim no)
			(in_bom yes)
			(on_board yes)
			(property "Reference" "TP"
				(at 0 6.858 0)
				(effects
					(font
						(size 1.27 1.27)
					)
				)
			)
			(property "Value" "TestPoint"
				(at 0 5.08 0)
				(effects
					(font
						(size 1.27 1.27)
					)
				)
			)
			(property "Footprint" ""
				(at 5.08 0 0)
				(effects
					(font
						(size 1.27 1.27)
					)
					(hide yes)
				)
			)
			(property "Datasheet" "~"
				(at 5.08 0 0)
				(effects
					(font
						(size 1.27 1.27)
					)
					(hide yes)
				)
			)
			(property "Description" "test point"
				(at 0 0 0)
				(effects
					(font
						(size 1.27 1.27)
					)
					(hide yes)
				)
			)
			(property "ki_keywords" "test point tp"
				(at 0 0 0)
				(effects
					(font
						(size 1.27 1.27)
					)
					(hide yes)
				)
			)
			(property "ki_fp_filters" "Pin* Test*"
				(at 0 0 0)
				(effects
					(font
						(size 1.27 1.27)
					)
					(hide yes)
				)
			)
			(symbol "TestPoint_0_1"
				(circle
					(center 0 3.302)
					(radius 0.762)
					(stroke
						(width 0)
						(type default)
					)
					(fill
						(type none)
					)
				)
			)
			(symbol "TestPoint_1_1"
				(pin passive line
					(at 0 0 90)
					(length 2.54)
					(name "1"
						(effects
							(font
								(size 1.27 1.27)
							)
						)
					)
					(number "1"
						(effects
							(font
								(size 1.27 1.27)
							)
						)
					)
				)
			)
		)
		(symbol "Device:C"
			(pin_numbers hide)
			(pin_names
				(offset 0.254)
			)
			(exclude_from_sim no)
			(in_bom yes)
			(on_board yes)
			(property "Reference" "C"
				(at 0.635 2.54 0)
				(effects
					(font
						(size 1.27 1.27)
					)
					(justify left)
				)
			)
			(property "Value" "C"
				(at 0.635 -2.54 0)
				(effects
					(font
						(size 1.27 1.27)
					)
					(justify left)
				)
			)
			(property "Footprint" ""
				(at 0.9652 -3.81 0)
				(effects
					(font
						(size 1.27 1.27)
					)
					(hide yes)
				)
			)
			(property "Datasheet" "~"
				(at 0 0 0)
				(effects
					(font
						(size 1.27 1.27)
					)
					(hide yes)
				)
			)
			(property "Description" "Unpolarized capacitor"
				(at 0 0 0)
				(effects
					(font
						(size 1.27 1.27)
					)
					(hide yes)
				)
			)
			(property "ki_keywords" "cap capacitor"
				(at 0 0 0)
				(effects
					(font
						(size 1.27 1.27)
					)
					(hide yes)
				)
			)
			(property "ki_fp_filters" "C_*"
				(at 0 0 0)
				(effects
					(font
						(size 1.27 1.27)
					)
					(hide yes)
				)
			)
			(symbol "C_0_1"
				(polyline
					(pts
						(xy -2.032 -0.762) (xy 2.032 -0.762)
					)
					(stroke
						(width 0.508)
						(type default)
					)
					(fill
						(type none)
					)
				)
				(polyline
					(pts
						(xy -2.032 0.762) (xy 2.032 0.762)
					)
					(stroke
						(width 0.508)
						(type default)
					)
					(fill
						(type none)
					)
				)
			)
			(symbol "C_1_1"
				(pin passive line
					(at 0 3.81 270)
					(length 2.794)
					(name "~"
						(effects
							(font
								(size 1.27 1.27)
							)
						)
					)
					(number "1"
						(effects
							(font
								(size 1.27 1.27)
							)
						)
					)
				)
				(pin passive line
					(at 0 -3.81 90)
					(length 2.794)
					(name "~"
						(effects
							(font
								(size 1.27 1.27)
							)
						)
					)
					(number "2"
						(effects
							(font
								(size 1.27 1.27)
							)
						)
					)
				)
			)
		)
		(symbol "Device:C_Small"
			(pin_numbers hide)
			(pin_names
				(offset 0.254) hide)
			(exclude_from_sim no)
			(in_bom yes)
			(on_board yes)
			(property "Reference" "C"
				(at 0.254 1.778 0)
				(effects
					(font
						(size 1.27 1.27)
					)
					(justify left)
				)
			)
			(property "Value" "C_Small"
				(at 0.254 -2.032 0)
				(effects
					(font
						(size 1.27 1.27)
					)
					(justify left)
				)
			)
			(property "Footprint" ""
				(at 0 0 0)
				(effects
					(font
						(size 1.27 1.27)
					)
					(hide yes)
				)
			)
			(property "Datasheet" "~"
				(at 0 0 0)
				(effects
					(font
						(size 1.27 1.27)
					)
					(hide yes)
				)
			)
			(property "Description" "Unpolarized capacitor, small symbol"
				(at 0 0 0)
				(effects
					(font
						(size 1.27 1.27)
					)
					(hide yes)
				)
			)
			(property "ki_keywords" "capacitor cap"
				(at 0 0 0)
				(effects
					(font
						(size 1.27 1.27)
					)
					(hide yes)
				)
			)
			(property "ki_fp_filters" "C_*"
				(at 0 0 0)
				(effects
					(font
						(size 1.27 1.27)
					)
					(hide yes)
				)
			)
			(symbol "C_Small_0_1"
				(polyline
					(pts
						(xy -1.524 -0.508) (xy 1.524 -0.508)
					)
					(stroke
						(width 0.3302)
						(type default)
					)
					(fill
						(type none)
					)
				)
				(polyline
					(pts
						(xy -1.524 0.508) (xy 1.524 0.508)
					)
					(stroke
						(width 0.3048)
						(type default)
					)
					(fill
						(type none)
					)
				)
			)
			(symbol "C_Small_1_1"
				(pin passive line
					(at 0 2.54 270)
					(length 2.032)
					(name "~"
						(effects
							(font
								(size 1.27 1.27)
							)
						)
					)
					(number "1"
						(effects
							(font
								(size 1.27 1.27)
							)
						)
					)
				)
				(pin passive line
					(at 0 -2.54 90)
					(length 2.032)
					(name "~"
						(effects
							(font
								(size 1.27 1.27)
							)
						)
					)
					(number "2"
						(effects
							(font
								(size 1.27 1.27)
							)
						)
					)
				)
			)
		)
		(symbol "Device:Q_NPN_BEC"
			(pin_names
				(offset 0) hide)
			(exclude_from_sim no)
			(in_bom yes)
			(on_board yes)
			(property "Reference" "Q"
				(at 5.08 1.27 0)
				(effects
					(font
						(size 1.27 1.27)
					)
					(justify left)
				)
			)
			(property "Value" "Q_NPN_BEC"
				(at 5.08 -1.27 0)
				(effects
					(font
						(size 1.27 1.27)
					)
					(justify left)
				)
			)
			(property "Footprint" ""
				(at 5.08 2.54 0)
				(effects
					(font
						(size 1.27 1.27)
					)
					(hide yes)
				)
			)
			(property "Datasheet" "~"
				(at 0 0 0)
				(effects
					(font
						(size 1.27 1.27)
					)
					(hide yes)
				)
			)
			(property "Description" "NPN transistor, base/emitter/collector"
				(at 0 0 0)
				(effects
					(font
						(size 1.27 1.27)
					)
					(hide yes)
				)
			)
			(property "ki_keywords" "transistor NPN"
				(at 0 0 0)
				(effects
					(font
						(size 1.27 1.27)
					)
					(hide yes)
				)
			)
			(symbol "Q_NPN_BEC_0_1"
				(polyline
					(pts
						(xy 0.635 0.635) (xy 2.54 2.54)
					)
					(stroke
						(width 0)
						(type default)
					)
					(fill
						(type none)
					)
				)
				(polyline
					(pts
						(xy 0.635 -0.635) (xy 2.54 -2.54) (xy 2.54 -2.54)
					)
					(stroke
						(width 0)
						(type default)
					)
					(fill
						(type none)
					)
				)
				(polyline
					(pts
						(xy 0.635 1.905) (xy 0.635 -1.905) (xy 0.635 -1.905)
					)
					(stroke
						(width 0.508)
						(type default)
					)
					(fill
						(type none)
					)
				)
				(polyline
					(pts
						(xy 1.27 -1.778) (xy 1.778 -1.27) (xy 2.286 -2.286) (xy 1.27 -1.778) (xy 1.27 -1.778)
					)
					(stroke
						(width 0)
						(type default)
					)
					(fill
						(type outline)
					)
				)
				(circle
					(center 1.27 0)
					(radius 2.8194)
					(stroke
						(width 0.254)
						(type default)
					)
					(fill
						(type none)
					)
				)
			)
			(symbol "Q_NPN_BEC_1_1"
				(pin input line
					(at -5.08 0 0)
					(length 5.715)
					(name "B"
						(effects
							(font
								(size 1.27 1.27)
							)
						)
					)
					(number "1"
						(effects
							(font
								(size 1.27 1.27)
							)
						)
					)
				)
				(pin passive line
					(at 2.54 -5.08 90)
					(length 2.54)
					(name "E"
						(effects
							(font
								(size 1.27 1.27)
							)
						)
					)
					(number "2"
						(effects
							(font
								(size 1.27 1.27)
							)
						)
					)
				)
				(pin passive line
					(at 2.54 5.08 270)
					(length 2.54)
					(name "C"
						(effects
							(font
								(size 1.27 1.27)
							)
						)
					)
					(number "3"
						(effects
							(font
								(size 1.27 1.27)
							)
						)
					)
				)
			)
		)
		(symbol "Device:R"
			(pin_numbers hide)
			(pin_names
				(offset 0)
			)
			(exclude_from_sim no)
			(in_bom yes)
			(on_board yes)
			(property "Reference" "R"
				(at 2.032 0 90)
				(effects
					(font
						(size 1.27 1.27)
					)
				)
			)
			(property "Value" "R"
				(at 0 0 90)
				(effects
					(font
						(size 1.27 1.27)
					)
				)
			)
			(property "Footprint" ""
				(at -1.778 0 90)
				(effects
					(font
						(size 1.27 1.27)
					)
					(hide yes)
				)
			)
			(property "Datasheet" "~"
				(at 0 0 0)
				(effects
					(font
						(size 1.27 1.27)
					)
					(hide yes)
				)
			)
			(property "Description" "Resistor"
				(at 0 0 0)
				(effects
					(font
						(size 1.27 1.27)
					)
					(hide yes)
				)
			)
			(property "ki_keywords" "R res resistor"
				(at 0 0 0)
				(effects
					(font
						(size 1.27 1.27)
					)
					(hide yes)
				)
			)
			(property "ki_fp_filters" "R_*"
				(at 0 0 0)
				(effects
					(font
						(size 1.27 1.27)
					)
					(hide yes)
				)
			)
			(symbol "R_0_1"
				(rectangle
					(start -1.016 -2.54)
					(end 1.016 2.54)
					(stroke
						(width 0.254)
						(type default)
					)
					(fill
						(type none)
					)
				)
			)
			(symbol "R_1_1"
				(pin passive line
					(at 0 3.81 270)
					(length 1.27)
					(name "~"
						(effects
							(font
								(size 1.27 1.27)
							)
						)
					)
					(number "1"
						(effects
							(font
								(size 1.27 1.27)
							)
						)
					)
				)
				(pin passive line
					(at 0 -3.81 90)
					(length 1.27)
					(name "~"
						(effects
							(font
								(size 1.27 1.27)
							)
						)
					)
					(number "2"
						(effects
							(font
								(size 1.27 1.27)
							)
						)
					)
				)
			)
		)
		(symbol "lsf-kicad:EMC1702"
			(exclude_from_sim no)
			(in_bom yes)
			(on_board yes)
			(property "Reference" "U"
				(at 7.62 15.24 0)
				(effects
					(font
						(size 1.27 1.27)
					)
				)
			)
			(property "Value" "EMC1702"
				(at 7.62 17.78 0)
				(effects
					(font
						(size 1.27 1.27)
					)
				)
			)
			(property "Footprint" "lsf-kicad-lib:QFN-12-1EP_4x4mm_P0.8mm_EP2.1x2.1mm"
				(at 53.34 -2.54 0)
				(effects
					(font
						(size 1.27 1.27)
					)
					(hide yes)
				)
			)
			(property "Datasheet" "https://ww1.microchip.com/downloads/aemDocuments/documents/OTH/ProductDocuments/DataSheets/EMC1702-Data-Sheet-DS20006455A.pdf"
				(at 96.52 0 0)
				(effects
					(font
						(size 1.27 1.27)
					)
					(hide yes)
				)
			)
			(property "Description" "High side Current-Sense and Temperature Monitor "
				(at 0 0 0)
				(effects
					(font
						(size 1.27 1.27)
					)
					(hide yes)
				)
			)
			(property "ki_keywords" "Current Sense Temperature Monitor "
				(at 0 0 0)
				(effects
					(font
						(size 1.27 1.27)
					)
					(hide yes)
				)
			)
			(property "ki_fp_filters" "QFN*1EP*4x4mm*P0.8mm*"
				(at 0 0 0)
				(effects
					(font
						(size 1.27 1.27)
					)
					(hide yes)
				)
			)
			(symbol "EMC1702_0_1"
				(rectangle
					(start -10.16 12.7)
					(end 10.16 -12.7)
					(stroke
						(width 0.254)
						(type default)
					)
					(fill
						(type background)
					)
				)
			)
			(symbol "EMC1702_1_1"
				(pin power_in line
					(at 0 15.24 270)
					(length 2.54)
					(name "VDD"
						(effects
							(font
								(size 1.27 1.27)
							)
						)
					)
					(number "1"
						(effects
							(font
								(size 1.27 1.27)
							)
						)
					)
				)
				(pin input line
					(at -12.7 -7.62 0)
					(length 2.54)
					(name "TH_SEL"
						(effects
							(font
								(size 1.27 1.27)
							)
						)
					)
					(number "10"
						(effects
							(font
								(size 1.27 1.27)
							)
						)
					)
				)
				(pin input line
					(at -12.7 7.62 0)
					(length 2.54)
					(name "SENSE-"
						(effects
							(font
								(size 1.27 1.27)
							)
						)
					)
					(number "11"
						(effects
							(font
								(size 1.27 1.27)
							)
						)
					)
				)
				(pin input line
					(at -12.7 5.08 0)
					(length 2.54)
					(name "SENSE+"
						(effects
							(font
								(size 1.27 1.27)
							)
						)
					)
					(number "12"
						(effects
							(font
								(size 1.27 1.27)
							)
						)
					)
				)
				(pin power_in line
					(at 0 -15.24 90)
					(length 2.54)
					(name "GND"
						(effects
							(font
								(size 1.27 1.27)
							)
						)
					)
					(number "13"
						(effects
							(font
								(size 1.27 1.27)
							)
						)
					)
				)
				(pin bidirectional line
					(at -12.7 2.54 0)
					(length 2.54)
					(name "DP"
						(effects
							(font
								(size 1.27 1.27)
							)
						)
					)
					(number "2"
						(effects
							(font
								(size 1.27 1.27)
							)
						)
					)
				)
				(pin bidirectional line
					(at -12.7 0 0)
					(length 2.54)
					(name "DN"
						(effects
							(font
								(size 1.27 1.27)
							)
						)
					)
					(number "3"
						(effects
							(font
								(size 1.27 1.27)
							)
						)
					)
				)
				(pin input line
					(at -12.7 -2.54 0)
					(length 2.54)
					(name "ADDR_SEL"
						(effects
							(font
								(size 1.27 1.27)
							)
						)
					)
					(number "4"
						(effects
							(font
								(size 1.27 1.27)
							)
						)
					)
				)
				(pin open_collector line
					(at 12.7 -2.54 180)
					(length 2.54)
					(name "~{THERM}"
						(effects
							(font
								(size 1.27 1.27)
							)
						)
					)
					(number "5"
						(effects
							(font
								(size 1.27 1.27)
							)
						)
					)
				)
				(pin open_collector line
					(at 12.7 -5.08 180)
					(length 2.54)
					(name "~{ALERT}"
						(effects
							(font
								(size 1.27 1.27)
							)
						)
					)
					(number "6"
						(effects
							(font
								(size 1.27 1.27)
							)
						)
					)
				)
				(pin open_collector line
					(at 12.7 5.08 180)
					(length 2.54)
					(name "SMDATA"
						(effects
							(font
								(size 1.27 1.27)
							)
						)
					)
					(number "7"
						(effects
							(font
								(size 1.27 1.27)
							)
						)
					)
				)
				(pin input line
					(at 12.7 7.62 180)
					(length 2.54)
					(name "SMCLK"
						(effects
							(font
								(size 1.27 1.27)
							)
						)
					)
					(number "8"
						(effects
							(font
								(size 1.27 1.27)
							)
						)
					)
				)
				(pin input line
					(at -12.7 -5.08 0)
					(length 2.54)
					(name "DUR_SEL"
						(effects
							(font
								(size 1.27 1.27)
							)
						)
					)
					(number "9"
						(effects
							(font
								(size 1.27 1.27)
							)
						)
					)
				)
			)
		)
		(symbol "power:GND"
			(power)
			(pin_numbers hide)
			(pin_names
				(offset 0) hide)
			(exclude_from_sim no)
			(in_bom yes)
			(on_board yes)
			(property "Reference" "#PWR"
				(at 0 -6.35 0)
				(effects
					(font
						(size 1.27 1.27)
					)
					(hide yes)
				)
			)
			(property "Value" "GND"
				(at 0 -3.81 0)
				(effects
					(font
						(size 1.27 1.27)
					)
				)
			)
			(property "Footprint" ""
				(at 0 0 0)
				(effects
					(font
						(size 1.27 1.27)
					)
					(hide yes)
				)
			)
			(property "Datasheet" ""
				(at 0 0 0)
				(effects
					(font
						(size 1.27 1.27)
					)
					(hide yes)
				)
			)
			(property "Description" "Power symbol creates a global label with name \"GND\" , ground"
				(at 0 0 0)
				(effects
					(font
						(size 1.27 1.27)
					)
					(hide yes)
				)
			)
			(property "ki_keywords" "global power"
				(at 0 0 0)
				(effects
					(font
						(size 1.27 1.27)
					)
					(hide yes)
				)
			)
			(symbol "GND_0_1"
				(polyline
					(pts
						(xy 0 0) (xy 0 -1.27) (xy 1.27 -1.27) (xy 0 -2.54) (xy -1.27 -1.27) (xy 0 -1.27)
					)
					(stroke
						(width 0)
						(type default)
					)
					(fill
						(type none)
					)
				)
			)
			(symbol "GND_1_1"
				(pin power_in line
					(at 0 0 270)
					(length 0)
					(name "~"
						(effects
							(font
								(size 1.27 1.27)
							)
						)
					)
					(number "1"
						(effects
							(font
								(size 1.27 1.27)
							)
						)
					)
				)
			)
		)
	)
	(junction
		(at 123.19 66.04)
		(diameter 0)
		(color 0 0 0 0)
		(uuid "16c7a960-cff4-4854-b7d1-38d96b343083")
	)
	(junction
		(at 153.67 50.8)
		(diameter 0)
		(color 0 0 0 0)
		(uuid "2b3fd719-e33c-4755-9033-e64122883479")
	)
	(junction
		(at 236.22 91.44)
		(diameter 0)
		(color 0 0 0 0)
		(uuid "2dc712c8-1b8e-43a8-b3f7-da7c3be77938")
	)
	(junction
		(at 27.94 58.42)
		(diameter 0)
		(color 0 0 0 0)
		(uuid "3df1ea19-2e20-4ee8-973e-df45f8d7a83b")
	)
	(junction
		(at 77.47 74.93)
		(diameter 0)
		(color 0 0 0 0)
		(uuid "48de48ca-bcd0-4786-993f-f2d797b76f1d")
	)
	(junction
		(at 236.22 50.8)
		(diameter 0)
		(color 0 0 0 0)
		(uuid "5ee658d6-754f-470d-901d-8f6180609c0a")
	)
	(junction
		(at 153.67 91.44)
		(diameter 0)
		(color 0 0 0 0)
		(uuid "69deb1f4-fd31-47d8-9e08-3e582f44ae45")
	)
	(junction
		(at 252.73 74.93)
		(diameter 0)
		(color 0 0 0 0)
		(uuid "69f0433a-c488-4f1b-a363-537b76793e35")
	)
	(junction
		(at 204.47 58.42)
		(diameter 0)
		(color 0 0 0 0)
		(uuid "6df04f34-cf10-48dc-99c8-ad3eb5ab83b0")
	)
	(junction
		(at 36.83 71.12)
		(diameter 0)
		(color 0 0 0 0)
		(uuid "7598624e-c5c0-40aa-b8de-fc4920326275")
	)
	(junction
		(at 118.11 58.42)
		(diameter 0)
		(color 0 0 0 0)
		(uuid "88870015-a822-4f2b-8ba4-44c523fa7892")
	)
	(junction
		(at 36.83 66.04)
		(diameter 0)
		(color 0 0 0 0)
		(uuid "9ed23523-9537-4c41-bf3b-a611eb8e8810")
	)
	(junction
		(at 60.96 91.44)
		(diameter 0)
		(color 0 0 0 0)
		(uuid "a83ba8b7-7fb7-4295-a517-aa9f715e5a72")
	)
	(junction
		(at 123.19 71.12)
		(diameter 0)
		(color 0 0 0 0)
		(uuid "b0a4fb76-d8d0-4d87-bf3d-b04121991053")
	)
	(junction
		(at 60.96 50.8)
		(diameter 0)
		(color 0 0 0 0)
		(uuid "b9a37924-2692-4d05-bbf6-0a3e6c96b4d9")
	)
	(junction
		(at 213.36 71.12)
		(diameter 0)
		(color 0 0 0 0)
		(uuid "b9a614b2-b5ed-4fb3-8998-dacc50cec32f")
	)
	(junction
		(at 213.36 66.04)
		(diameter 0)
		(color 0 0 0 0)
		(uuid "d2752c62-cdfc-4d56-b143-23e92fb26024")
	)
	(junction
		(at 265.43 74.93)
		(diameter 0)
		(color 0 0 0 0)
		(uuid "d3b92443-a875-4ff4-8b98-8d5dd971161d")
	)
	(junction
		(at 90.17 74.93)
		(diameter 0)
		(color 0 0 0 0)
		(uuid "d5dbd268-dca8-4e41-8fe9-7011c5a2ad4b")
	)
	(no_connect
		(at 223.52 64.77)
		(uuid "3dcd9e4e-05d2-45d7-8198-94d6b9c5b716")
	)
	(no_connect
		(at 223.52 62.23)
		(uuid "3dcd9e4e-05d2-45d7-8198-94d6b9c5b717")
	)
	(no_connect
		(at 48.26 62.23)
		(uuid "3dcd9e4e-05d2-45d7-8198-94d6b9c5b718")
	)
	(no_connect
		(at 48.26 64.77)
		(uuid "3dcd9e4e-05d2-45d7-8198-94d6b9c5b719")
	)
	(no_connect
		(at 48.26 77.47)
		(uuid "4cca9aec-6219-4769-9c50-63b8101c1255")
	)
	(no_connect
		(at 140.97 74.93)
		(uuid "4cca9aec-6219-4769-9c50-63b8101c1256")
	)
	(no_connect
		(at 140.97 77.47)
		(uuid "4cca9aec-6219-4769-9c50-63b8101c1257")
	)
	(no_connect
		(at 48.26 74.93)
		(uuid "6175c101-789f-416e-a416-181b2dbf19b8")
	)
	(no_connect
		(at 223.52 77.47)
		(uuid "b00dca62-0e87-4d82-9f3b-79f28a3ac247")
	)
	(no_connect
		(at 223.52 74.93)
		(uuid "b00dca62-0e87-4d82-9f3b-79f28a3ac248")
	)
	(no_connect
		(at 168.91 72.39)
		(uuid "e56b718e-b526-4a70-9fc5-4e620e216496")
	)
	(no_connect
		(at 168.91 74.93)
		(uuid "e56b718e-b526-4a70-9fc5-4e620e216497")
	)
	(wire
		(pts
			(xy 248.92 74.93) (xy 252.73 74.93)
		)
		(stroke
			(width 0)
			(type default)
		)
		(uuid "01c5dbf6-a17c-47f6-9462-2c84fc45564d")
	)
	(wire
		(pts
			(xy 48.26 69.85) (xy 41.91 69.85)
		)
		(stroke
			(width 0)
			(type default)
		)
		(uuid "028e2191-5695-4c31-9bc7-0dc1a7f17ba2")
	)
	(wire
		(pts
			(xy 132.08 67.31) (xy 132.08 66.04)
		)
		(stroke
			(width 0)
			(type default)
		)
		(uuid "03e4d6ed-703b-416b-9b78-f81f8aa3dfd1")
	)
	(wire
		(pts
			(xy 213.36 66.04) (xy 207.01 66.04)
		)
		(stroke
			(width 0)
			(type default)
		)
		(uuid "047a07b8-4a9a-47ae-9967-172e0f8e9dce")
	)
	(wire
		(pts
			(xy 236.22 91.44) (xy 236.22 92.71)
		)
		(stroke
			(width 0)
			(type default)
		)
		(uuid "054f4669-6df8-40b8-9707-fc4447da61b7")
	)
	(wire
		(pts
			(xy 120.65 66.04) (xy 120.65 58.42)
		)
		(stroke
			(width 0)
			(type default)
		)
		(uuid "06d9e65d-6b63-470a-aece-e730e7cc0969")
	)
	(wire
		(pts
			(xy 30.48 71.12) (xy 36.83 71.12)
		)
		(stroke
			(width 0)
			(type default)
		)
		(uuid "083c34e6-c752-471c-95bc-5e0c78bc244c")
	)
	(wire
		(pts
			(xy 220.98 71.12) (xy 213.36 71.12)
		)
		(stroke
			(width 0)
			(type default)
		)
		(uuid "09402122-9fcb-48e8-b756-8f54ce1ae445")
	)
	(wire
		(pts
			(xy 132.08 69.85) (xy 132.08 71.12)
		)
		(stroke
			(width 0)
			(type default)
		)
		(uuid "09e3db90-3d4b-46f3-a691-9fb6048708cc")
	)
	(wire
		(pts
			(xy 19.05 76.2) (xy 30.48 76.2)
		)
		(stroke
			(width 0)
			(type default)
		)
		(uuid "0a0cc258-830b-4978-b89e-80955507ba6c")
	)
	(wire
		(pts
			(xy 153.67 85.09) (xy 153.67 91.44)
		)
		(stroke
			(width 0)
			(type default)
		)
		(uuid "0ba98183-3662-4cde-89b4-a613ee5ba314")
	)
	(wire
		(pts
			(xy 72.39 50.8) (xy 68.58 50.8)
		)
		(stroke
			(width 0)
			(type default)
		)
		(uuid "0c3504f3-b1ac-4d16-89e8-22bd078339b8")
	)
	(wire
		(pts
			(xy 132.08 69.85) (xy 140.97 69.85)
		)
		(stroke
			(width 0)
			(type default)
		)
		(uuid "102c1cbd-0774-46ef-9306-60e78b8bdaa0")
	)
	(wire
		(pts
			(xy 204.47 58.42) (xy 195.58 58.42)
		)
		(stroke
			(width 0)
			(type default)
		)
		(uuid "11045726-ed18-4101-9160-64ccfabc442d")
	)
	(wire
		(pts
			(xy 109.22 76.2) (xy 120.65 76.2)
		)
		(stroke
			(width 0)
			(type default)
		)
		(uuid "11c6cf9c-c723-4c5a-ad9a-ac1095a8dc96")
	)
	(wire
		(pts
			(xy 77.47 76.2) (xy 77.47 74.93)
		)
		(stroke
			(width 0)
			(type default)
		)
		(uuid "1976a753-bfe0-4f99-a351-04699d9444bb")
	)
	(wire
		(pts
			(xy 219.71 72.39) (xy 223.52 72.39)
		)
		(stroke
			(width 0)
			(type default)
		)
		(uuid "1e321874-cb57-45e0-a08f-f38f88e3b2e9")
	)
	(wire
		(pts
			(xy 30.48 76.2) (xy 30.48 71.12)
		)
		(stroke
			(width 0)
			(type default)
		)
		(uuid "206124c3-b488-4e72-bfc7-f9a6460c7cae")
	)
	(wire
		(pts
			(xy 207.01 58.42) (xy 207.01 66.04)
		)
		(stroke
			(width 0)
			(type default)
		)
		(uuid "21b16e3a-0300-4fd6-a164-07559eaf55ed")
	)
	(wire
		(pts
			(xy 19.05 69.85) (xy 19.05 76.2)
		)
		(stroke
			(width 0)
			(type default)
		)
		(uuid "24763bac-ec56-4297-9f69-60a4c2225b6b")
	)
	(wire
		(pts
			(xy 219.71 87.63) (xy 219.71 91.44)
		)
		(stroke
			(width 0)
			(type default)
		)
		(uuid "24dda54c-0321-4dbe-8f9a-a31069738f7d")
	)
	(wire
		(pts
			(xy 60.96 91.44) (xy 60.96 92.71)
		)
		(stroke
			(width 0)
			(type default)
		)
		(uuid "26db6759-809c-4f6c-9ec8-3bc7d7b28ec0")
	)
	(wire
		(pts
			(xy 153.67 91.44) (xy 153.67 92.71)
		)
		(stroke
			(width 0)
			(type default)
		)
		(uuid "2b107b03-2555-42c8-9e08-079df0568938")
	)
	(wire
		(pts
			(xy 48.26 67.31) (xy 41.91 67.31)
		)
		(stroke
			(width 0)
			(type default)
		)
		(uuid "2cde3fda-feca-491a-9417-67652da3a3d8")
	)
	(wire
		(pts
			(xy 73.66 74.93) (xy 77.47 74.93)
		)
		(stroke
			(width 0)
			(type default)
		)
		(uuid "2d6aadd0-237d-47ac-8254-378109dae71e")
	)
	(wire
		(pts
			(xy 223.52 67.31) (xy 220.98 67.31)
		)
		(stroke
			(width 0)
			(type default)
		)
		(uuid "2dd0f22d-416b-484b-ab6f-f8487387dc35")
	)
	(wire
		(pts
			(xy 109.22 58.42) (xy 109.22 59.69)
		)
		(stroke
			(width 0)
			(type default)
		)
		(uuid "2fef79ec-ae16-4742-a67c-e75dc23aedea")
	)
	(wire
		(pts
			(xy 30.48 58.42) (xy 27.94 58.42)
		)
		(stroke
			(width 0)
			(type default)
		)
		(uuid "303e1d49-3baa-4a69-959d-fe3b5def9c7d")
	)
	(wire
		(pts
			(xy 44.45 87.63) (xy 44.45 91.44)
		)
		(stroke
			(width 0)
			(type default)
		)
		(uuid "35468bcc-f38c-4d98-8c94-0cc8ecc10108")
	)
	(wire
		(pts
			(xy 207.01 71.12) (xy 207.01 76.2)
		)
		(stroke
			(width 0)
			(type default)
		)
		(uuid "35d4cace-e418-46d8-99fc-82ceb36c2c4c")
	)
	(wire
		(pts
			(xy 120.65 71.12) (xy 123.19 71.12)
		)
		(stroke
			(width 0)
			(type default)
		)
		(uuid "38a8f125-8d3f-4531-b9a7-797004328a25")
	)
	(wire
		(pts
			(xy 60.96 44.45) (xy 60.96 50.8)
		)
		(stroke
			(width 0)
			(type default)
		)
		(uuid "3a0a9998-2cda-4da2-9cf5-e90d754bd38f")
	)
	(wire
		(pts
			(xy 30.48 66.04) (xy 30.48 58.42)
		)
		(stroke
			(width 0)
			(type default)
		)
		(uuid "432d9648-2396-46e6-97eb-25d20cc1188c")
	)
	(wire
		(pts
			(xy 30.48 66.04) (xy 36.83 66.04)
		)
		(stroke
			(width 0)
			(type default)
		)
		(uuid "44ffda19-11c5-4592-8672-500561a68acd")
	)
	(wire
		(pts
			(xy 41.91 69.85) (xy 41.91 71.12)
		)
		(stroke
			(width 0)
			(type default)
		)
		(uuid "4ac6b5da-c1e7-4248-9a30-d56070817002")
	)
	(wire
		(pts
			(xy 123.19 71.12) (xy 132.08 71.12)
		)
		(stroke
			(width 0)
			(type default)
		)
		(uuid "4fca684c-cd2b-4e7c-a9e1-cf05e1fc28b3")
	)
	(wire
		(pts
			(xy 123.19 66.04) (xy 132.08 66.04)
		)
		(stroke
			(width 0)
			(type default)
		)
		(uuid "51d167c2-4ee3-4c70-bcef-a0de962bfa35")
	)
	(wire
		(pts
			(xy 167.64 64.77) (xy 166.37 64.77)
		)
		(stroke
			(width 0)
			(type default)
		)
		(uuid "51e081dd-14da-453b-ad0a-f912cce13100")
	)
	(wire
		(pts
			(xy 250.19 64.77) (xy 248.92 64.77)
		)
		(stroke
			(width 0)
			(type default)
		)
		(uuid "557800f1-0731-4d80-a567-c14c91125473")
	)
	(wire
		(pts
			(xy 118.11 58.42) (xy 118.11 64.77)
		)
		(stroke
			(width 0)
			(type default)
		)
		(uuid "58484e5b-960c-4863-ae61-b0313ad296cb")
	)
	(wire
		(pts
			(xy 118.11 64.77) (xy 116.84 64.77)
		)
		(stroke
			(width 0)
			(type default)
		)
		(uuid "5b7ea658-c1cc-4be7-aa7e-1bca945d14c3")
	)
	(wire
		(pts
			(xy 73.66 62.23) (xy 74.93 62.23)
		)
		(stroke
			(width 0)
			(type default)
		)
		(uuid "605ef108-bf65-4b3c-b035-f1692fd7a098")
	)
	(wire
		(pts
			(xy 139.7 62.23) (xy 140.97 62.23)
		)
		(stroke
			(width 0)
			(type default)
		)
		(uuid "62183917-1389-427e-8f17-6f2b5592446d")
	)
	(wire
		(pts
			(xy 207.01 58.42) (xy 204.47 58.42)
		)
		(stroke
			(width 0)
			(type default)
		)
		(uuid "66ac1fbc-129a-4416-a037-fc9ae7d93281")
	)
	(wire
		(pts
			(xy 138.43 80.01) (xy 138.43 72.39)
		)
		(stroke
			(width 0)
			(type default)
		)
		(uuid "6828a7e2-f7e5-4780-8667-2be92c4523a9")
	)
	(wire
		(pts
			(xy 60.96 50.8) (xy 60.96 54.61)
		)
		(stroke
			(width 0)
			(type default)
		)
		(uuid "6b0ab594-c42d-48ce-81e4-6c9cdcf3d982")
	)
	(wire
		(pts
			(xy 248.92 72.39) (xy 251.46 72.39)
		)
		(stroke
			(width 0)
			(type default)
		)
		(uuid "7855b411-1eee-4697-bb8e-5f5f95db9c01")
	)
	(wire
		(pts
			(xy 236.22 50.8) (xy 236.22 54.61)
		)
		(stroke
			(width 0)
			(type default)
		)
		(uuid "78766dbc-0873-4ee2-9724-3a283e00b3c7")
	)
	(wire
		(pts
			(xy 138.43 91.44) (xy 153.67 91.44)
		)
		(stroke
			(width 0)
			(type default)
		)
		(uuid "7bcd9f6b-f057-49c9-b8c6-b4bcdd9ff5c2")
	)
	(wire
		(pts
			(xy 132.08 67.31) (xy 140.97 67.31)
		)
		(stroke
			(width 0)
			(type default)
		)
		(uuid "7c0b6377-a3a1-451b-8866-b59bdbf5b8a5")
	)
	(wire
		(pts
			(xy 219.71 91.44) (xy 236.22 91.44)
		)
		(stroke
			(width 0)
			(type default)
		)
		(uuid "7c7c30c7-d3f8-45d3-b9bc-141d07204090")
	)
	(wire
		(pts
			(xy 138.43 87.63) (xy 138.43 91.44)
		)
		(stroke
			(width 0)
			(type default)
		)
		(uuid "7f9f620c-a43b-49cc-90fd-82de31b82625")
	)
	(wire
		(pts
			(xy 236.22 44.45) (xy 236.22 50.8)
		)
		(stroke
			(width 0)
			(type default)
		)
		(uuid "7fee5ffc-124a-436a-b19a-7033ceaa6553")
	)
	(wire
		(pts
			(xy 195.58 69.85) (xy 195.58 76.2)
		)
		(stroke
			(width 0)
			(type default)
		)
		(uuid "81ec1df2-e272-44d4-95b7-d91e70e932f7")
	)
	(wire
		(pts
			(xy 139.7 64.77) (xy 140.97 64.77)
		)
		(stroke
			(width 0)
			(type default)
		)
		(uuid "8337588e-a412-4fe5-b34c-b6c43decd25c")
	)
	(wire
		(pts
			(xy 252.73 76.2) (xy 252.73 74.93)
		)
		(stroke
			(width 0)
			(type default)
		)
		(uuid "8478c86c-51dd-4136-b06c-a555273d4aef")
	)
	(wire
		(pts
			(xy 92.71 74.93) (xy 90.17 74.93)
		)
		(stroke
			(width 0)
			(type default)
		)
		(uuid "85ad4ffc-0ea1-43e4-92d8-353fb427e768")
	)
	(wire
		(pts
			(xy 219.71 80.01) (xy 219.71 72.39)
		)
		(stroke
			(width 0)
			(type default)
		)
		(uuid "872507c6-71dc-480c-b6da-4f98a9942a3b")
	)
	(wire
		(pts
			(xy 247.65 50.8) (xy 243.84 50.8)
		)
		(stroke
			(width 0)
			(type default)
		)
		(uuid "893b0462-0797-4616-a276-c14dd529d11d")
	)
	(wire
		(pts
			(xy 220.98 67.31) (xy 220.98 66.04)
		)
		(stroke
			(width 0)
			(type default)
		)
		(uuid "8b31886b-aea3-4178-bef7-0ca30b3d7b7e")
	)
	(wire
		(pts
			(xy 120.65 76.2) (xy 120.65 71.12)
		)
		(stroke
			(width 0)
			(type default)
		)
		(uuid "8ba6378b-85fd-4f88-bb49-d52dca6acc06")
	)
	(wire
		(pts
			(xy 27.94 58.42) (xy 19.05 58.42)
		)
		(stroke
			(width 0)
			(type default)
		)
		(uuid "8d8e5dd5-d2ed-4075-87a8-5e01bf2bc6b5")
	)
	(wire
		(pts
			(xy 90.17 73.66) (xy 90.17 74.93)
		)
		(stroke
			(width 0)
			(type default)
		)
		(uuid "8e0c5657-7788-4c0a-ba53-a77fb8a0905d")
	)
	(wire
		(pts
			(xy 213.36 71.12) (xy 207.01 71.12)
		)
		(stroke
			(width 0)
			(type default)
		)
		(uuid "923b7d7f-8def-4b6d-94e7-8018fb29775e")
	)
	(wire
		(pts
			(xy 204.47 64.77) (xy 203.2 64.77)
		)
		(stroke
			(width 0)
			(type default)
		)
		(uuid "923f4246-4ffc-4fd3-bcaa-32d75e70325c")
	)
	(wire
		(pts
			(xy 265.43 73.66) (xy 265.43 74.93)
		)
		(stroke
			(width 0)
			(type default)
		)
		(uuid "94b18161-0dda-4ea0-9c85-ef2a4069df0d")
	)
	(wire
		(pts
			(xy 166.37 62.23) (xy 167.64 62.23)
		)
		(stroke
			(width 0)
			(type default)
		)
		(uuid "9803e1ae-6c0f-483a-b618-d2b73b6bdcd6")
	)
	(wire
		(pts
			(xy 44.45 72.39) (xy 48.26 72.39)
		)
		(stroke
			(width 0)
			(type default)
		)
		(uuid "9b5149f5-c6c3-42b4-85b1-4a65eb6f8432")
	)
	(wire
		(pts
			(xy 220.98 69.85) (xy 220.98 71.12)
		)
		(stroke
			(width 0)
			(type default)
		)
		(uuid "a2722036-c898-4f92-8315-792cec6c6c46")
	)
	(wire
		(pts
			(xy 60.96 85.09) (xy 60.96 91.44)
		)
		(stroke
			(width 0)
			(type default)
		)
		(uuid "a411c9ad-5456-40f7-a93d-edc85b4047c9")
	)
	(wire
		(pts
			(xy 44.45 80.01) (xy 44.45 72.39)
		)
		(stroke
			(width 0)
			(type default)
		)
		(uuid "a56d22db-ac24-40e3-876d-50259544db54")
	)
	(wire
		(pts
			(xy 265.43 64.77) (xy 265.43 66.04)
		)
		(stroke
			(width 0)
			(type default)
		)
		(uuid "a5b7c8c3-1351-4e68-a449-2cd2a3f53da8")
	)
	(wire
		(pts
			(xy 27.94 58.42) (xy 27.94 64.77)
		)
		(stroke
			(width 0)
			(type default)
		)
		(uuid "a5d8dad4-6fb1-42c1-a5e7-4d6a595e5e61")
	)
	(wire
		(pts
			(xy 265.43 74.93) (xy 252.73 74.93)
		)
		(stroke
			(width 0)
			(type default)
		)
		(uuid "afbc8996-5884-4249-bed3-09b64a97ca33")
	)
	(wire
		(pts
			(xy 90.17 64.77) (xy 90.17 66.04)
		)
		(stroke
			(width 0)
			(type default)
		)
		(uuid "b142f3a4-0d69-4bc5-8e93-ac66121d9343")
	)
	(wire
		(pts
			(xy 120.65 58.42) (xy 118.11 58.42)
		)
		(stroke
			(width 0)
			(type default)
		)
		(uuid "b16ea4cd-aad1-452d-9319-b7f4188ee17b")
	)
	(wire
		(pts
			(xy 118.11 58.42) (xy 109.22 58.42)
		)
		(stroke
			(width 0)
			(type default)
		)
		(uuid "b1fb2261-9c20-43da-8dc3-752ca666bde0")
	)
	(wire
		(pts
			(xy 109.22 69.85) (xy 109.22 76.2)
		)
		(stroke
			(width 0)
			(type default)
		)
		(uuid "b388281f-6a49-4fe3-8003-4b69877c9e14")
	)
	(wire
		(pts
			(xy 165.1 50.8) (xy 161.29 50.8)
		)
		(stroke
			(width 0)
			(type default)
		)
		(uuid "b40fccfe-bf3d-4747-96b0-7ff99a7dd189")
	)
	(wire
		(pts
			(xy 250.19 62.23) (xy 248.92 62.23)
		)
		(stroke
			(width 0)
			(type default)
		)
		(uuid "b7f80015-e90a-4fbe-b601-45518e1720d7")
	)
	(wire
		(pts
			(xy 153.67 50.8) (xy 153.67 54.61)
		)
		(stroke
			(width 0)
			(type default)
		)
		(uuid "bcf2a642-e74e-41c9-bd46-551e7ba39871")
	)
	(wire
		(pts
			(xy 36.83 66.04) (xy 41.91 66.04)
		)
		(stroke
			(width 0)
			(type default)
		)
		(uuid "c3d15c99-110f-42bd-8028-eb7bbbd6425f")
	)
	(wire
		(pts
			(xy 236.22 85.09) (xy 236.22 91.44)
		)
		(stroke
			(width 0)
			(type default)
		)
		(uuid "c3edd66e-ee25-4dbe-8f36-5dd8b076707c")
	)
	(wire
		(pts
			(xy 27.94 64.77) (xy 26.67 64.77)
		)
		(stroke
			(width 0)
			(type default)
		)
		(uuid "c4051062-5ab3-4bdc-a265-28dc7a5c71a8")
	)
	(wire
		(pts
			(xy 220.98 66.04) (xy 213.36 66.04)
		)
		(stroke
			(width 0)
			(type default)
		)
		(uuid "c86c4c4e-cee6-4f06-962b-e3716db1eb76")
	)
	(wire
		(pts
			(xy 36.83 71.12) (xy 41.91 71.12)
		)
		(stroke
			(width 0)
			(type default)
		)
		(uuid "cf505fd6-9921-4ac6-91b3-85a842496c51")
	)
	(wire
		(pts
			(xy 19.05 58.42) (xy 19.05 59.69)
		)
		(stroke
			(width 0)
			(type default)
		)
		(uuid "d5755fbb-1241-4d3d-8b5d-07e656cfe6b9")
	)
	(wire
		(pts
			(xy 120.65 66.04) (xy 123.19 66.04)
		)
		(stroke
			(width 0)
			(type default)
		)
		(uuid "d99792d5-3514-4630-bfd4-bc8428ef6c38")
	)
	(wire
		(pts
			(xy 265.43 74.93) (xy 269.24 74.93)
		)
		(stroke
			(width 0)
			(type default)
		)
		(uuid "dd241c56-d77c-4b53-9c97-47acb5b1961a")
	)
	(wire
		(pts
			(xy 73.66 72.39) (xy 76.2 72.39)
		)
		(stroke
			(width 0)
			(type default)
		)
		(uuid "de205569-822b-4cec-bb39-f0eeebe39a89")
	)
	(wire
		(pts
			(xy 44.45 91.44) (xy 60.96 91.44)
		)
		(stroke
			(width 0)
			(type default)
		)
		(uuid "e4d10759-f824-4696-b03c-2ec5fa599648")
	)
	(wire
		(pts
			(xy 166.37 74.93) (xy 168.91 74.93)
		)
		(stroke
			(width 0)
			(type default)
		)
		(uuid "e81ab394-7072-408b-ad81-6680ad268b76")
	)
	(wire
		(pts
			(xy 90.17 74.93) (xy 77.47 74.93)
		)
		(stroke
			(width 0)
			(type default)
		)
		(uuid "ea62d045-7f28-4845-9dc6-68bec1b5eb77")
	)
	(wire
		(pts
			(xy 195.58 58.42) (xy 195.58 59.69)
		)
		(stroke
			(width 0)
			(type default)
		)
		(uuid "eac779c0-467e-4980-885e-e0f71f894bdc")
	)
	(wire
		(pts
			(xy 204.47 58.42) (xy 204.47 64.77)
		)
		(stroke
			(width 0)
			(type default)
		)
		(uuid "f4210df0-7ee5-4d04-b6f6-1ab7230eec86")
	)
	(wire
		(pts
			(xy 195.58 76.2) (xy 207.01 76.2)
		)
		(stroke
			(width 0)
			(type default)
		)
		(uuid "f4cd8bce-2ca2-48ed-a0de-dfd30254151d")
	)
	(wire
		(pts
			(xy 138.43 72.39) (xy 140.97 72.39)
		)
		(stroke
			(width 0)
			(type default)
		)
		(uuid "f4dcc4ba-ffbe-46aa-9dd7-904be200691e")
	)
	(wire
		(pts
			(xy 166.37 72.39) (xy 168.91 72.39)
		)
		(stroke
			(width 0)
			(type default)
		)
		(uuid "f5f30d86-f3d1-4b31-9eea-5b8a32c12502")
	)
	(wire
		(pts
			(xy 153.67 44.45) (xy 153.67 50.8)
		)
		(stroke
			(width 0)
			(type default)
		)
		(uuid "f6d179ea-f428-4b92-83c3-f9b0cbd5c5b3")
	)
	(wire
		(pts
			(xy 74.93 64.77) (xy 73.66 64.77)
		)
		(stroke
			(width 0)
			(type default)
		)
		(uuid "fbe3d599-804b-4434-a0f7-d1228fca0003")
	)
	(wire
		(pts
			(xy 223.52 69.85) (xy 220.98 69.85)
		)
		(stroke
			(width 0)
			(type default)
		)
		(uuid "fca40596-9a85-4a7e-b826-2b5726244c8a")
	)
	(wire
		(pts
			(xy 41.91 67.31) (xy 41.91 66.04)
		)
		(stroke
			(width 0)
			(type default)
		)
		(uuid "fe8f657f-85f5-4a99-bf9c-fff59ba4c094")
	)
	(text "PCB Temperature monitor\nAddr: 0101_101"
		(exclude_from_sim no)
		(at 118.11 46.99 0)
		(effects
			(font
				(size 1.27 1.27)
			)
			(justify left bottom)
		)
		(uuid "27f37be1-f41b-4f91-9608-f709ea51242b")
	)
	(text "PA S-Band Temperature\nAddr: 0101_001"
		(exclude_from_sim no)
		(at 201.93 46.99 0)
		(effects
			(font
				(size 1.27 1.27)
			)
			(justify left bottom)
		)
		(uuid "7f7703d5-e789-4ab7-a485-ccdff65948bf")
	)
	(text "PA UHF Temperature\nAddr: 1001_101"
		(exclude_from_sim no)
		(at 29.21 46.99 0)
		(effects
			(font
				(size 1.27 1.27)
			)
			(justify left bottom)
		)
		(uuid "dc672fc4-349f-4386-9438-aaaac984aa5b")
	)
	(global_label "3V3_D"
		(shape input)
		(at 90.17 64.77 90)
		(fields_autoplaced yes)
		(effects
			(font
				(size 1.27 1.27)
			)
			(justify left)
		)
		(uuid "12d1d240-be25-4a21-8c38-2d67cf7d1f60")
		(property "Intersheetrefs" "${INTERSHEET_REFS}"
			(at 123.19 -8.89 0)
			(effects
				(font
					(size 1.27 1.27)
				)
				(hide yes)
			)
		)
	)
	(global_label "3V3_D"
		(shape input)
		(at 153.67 44.45 180)
		(fields_autoplaced yes)
		(effects
			(font
				(size 1.27 1.27)
			)
			(justify right)
		)
		(uuid "31f305f9-9558-460d-b399-5c05cc93e4d9")
		(property "Intersheetrefs" "${INTERSHEET_REFS}"
			(at 80.01 11.43 0)
			(effects
				(font
					(size 1.27 1.27)
				)
				(hide yes)
			)
		)
	)
	(global_label "3V3_D"
		(shape input)
		(at 236.22 44.45 180)
		(fields_autoplaced yes)
		(effects
			(font
				(size 1.27 1.27)
			)
			(justify right)
		)
		(uuid "3dbc9707-c9a4-4092-8caa-4d09ad30869a")
		(property "Intersheetrefs" "${INTERSHEET_REFS}"
			(at 162.56 11.43 0)
			(effects
				(font
					(size 1.27 1.27)
				)
				(hide yes)
			)
		)
	)
	(global_label "3V3_D"
		(shape input)
		(at 60.96 44.45 180)
		(fields_autoplaced yes)
		(effects
			(font
				(size 1.27 1.27)
			)
			(justify right)
		)
		(uuid "636b6990-8277-4c2a-98f1-ac38d762ce7f")
		(property "Intersheetrefs" "${INTERSHEET_REFS}"
			(at -12.7 11.43 0)
			(effects
				(font
					(size 1.27 1.27)
				)
				(hide yes)
			)
		)
	)
	(global_label "3V3_D"
		(shape input)
		(at 265.43 64.77 90)
		(fields_autoplaced yes)
		(effects
			(font
				(size 1.27 1.27)
			)
			(justify left)
		)
		(uuid "87e8dae2-0337-4d49-b2ff-992c526496bd")
		(property "Intersheetrefs" "${INTERSHEET_REFS}"
			(at 298.45 -8.89 0)
			(effects
				(font
					(size 1.27 1.27)
				)
				(hide yes)
			)
		)
	)
	(hierarchical_label "ALERT_T_PA_S"
		(shape output)
		(at 269.24 74.93 0)
		(fields_autoplaced yes)
		(effects
			(font
				(size 1.27 1.27)
			)
			(justify left)
		)
		(uuid "01338850-e9ed-4272-b85d-8d56e9298864")
	)
	(hierarchical_label "SMCLK_T_S"
		(shape input)
		(at 250.19 62.23 0)
		(fields_autoplaced yes)
		(effects
			(font
				(size 1.27 1.27)
			)
			(justify left)
		)
		(uuid "3a6bc91f-e221-4153-93e9-30b371cec447")
	)
	(hierarchical_label "SMDATA_T_S"
		(shape bidirectional)
		(at 250.19 64.77 0)
		(fields_autoplaced yes)
		(effects
			(font
				(size 1.27 1.27)
			)
			(justify left)
		)
		(uuid "3c9fdb2f-ecf9-44d3-83c1-9c763d03af90")
	)
	(hierarchical_label "SMDATA_T_SYS"
		(shape bidirectional)
		(at 167.64 64.77 0)
		(fields_autoplaced yes)
		(effects
			(font
				(size 1.27 1.27)
			)
			(justify left)
		)
		(uuid "45099ef8-b470-4f34-a90e-0a936a6b6d10")
	)
	(hierarchical_label "ALERT_T_PA_U"
		(shape output)
		(at 92.71 74.93 0)
		(fields_autoplaced yes)
		(effects
			(font
				(size 1.27 1.27)
			)
			(justify left)
		)
		(uuid "53f47836-096c-448f-8c94-f2235e5557d3")
	)
	(hierarchical_label "SMDATA_T_U"
		(shape bidirectional)
		(at 74.93 64.77 0)
		(fields_autoplaced yes)
		(effects
			(font
				(size 1.27 1.27)
			)
			(justify left)
		)
		(uuid "5f37d1c5-2973-42d6-8e87-1c596d447096")
	)
	(hierarchical_label "Vin_I_SENSE_p"
		(shape input)
		(at 139.7 64.77 180)
		(fields_autoplaced yes)
		(effects
			(font
				(size 1.27 1.27)
			)
			(justify right)
		)
		(uuid "8091a85a-fae3-484b-8f24-9ee2b3bfecdd")
	)
	(hierarchical_label "SMCLK_T_U"
		(shape input)
		(at 74.93 62.23 0)
		(fields_autoplaced yes)
		(effects
			(font
				(size 1.27 1.27)
			)
			(justify left)
		)
		(uuid "8a50b5f7-d609-409d-947b-39530ce2e158")
	)
	(hierarchical_label "SMCLK_T_SYS"
		(shape input)
		(at 167.64 62.23 0)
		(fields_autoplaced yes)
		(effects
			(font
				(size 1.27 1.27)
			)
			(justify left)
		)
		(uuid "8fb20e93-f7b0-4261-985f-c093706f08ba")
	)
	(hierarchical_label "Vin_I_SENSE_n"
		(shape input)
		(at 139.7 62.23 180)
		(fields_autoplaced yes)
		(effects
			(font
				(size 1.27 1.27)
			)
			(justify right)
		)
		(uuid "978722c3-774e-43b7-b974-cc9728e318db")
	)
	(symbol
		(lib_id "power:GND")
		(at 72.39 50.8 0)
		(unit 1)
		(exclude_from_sim no)
		(in_bom yes)
		(on_board yes)
		(dnp no)
		(uuid "00000000-0000-0000-0000-00005e8d3792")
		(property "Reference" "#PWR0702"
			(at 72.39 57.15 0)
			(effects
				(font
					(size 1.27 1.27)
				)
				(hide yes)
			)
		)
		(property "Value" "GND"
			(at 72.4916 54.737 0)
			(effects
				(font
					(size 1.27 1.27)
				)
			)
		)
		(property "Footprint" ""
			(at 72.39 50.8 0)
			(effects
				(font
					(size 1.27 1.27)
				)
				(hide yes)
			)
		)
		(property "Datasheet" ""
			(at 72.39 50.8 0)
			(effects
				(font
					(size 1.27 1.27)
				)
				(hide yes)
			)
		)
		(property "Description" ""
			(at 72.39 50.8 0)
			(effects
				(font
					(size 1.27 1.27)
				)
				(hide yes)
			)
		)
		(pin "1"
			(uuid "62d70b7d-8ada-46ad-a877-332d748c2473")
		)
		(instances
			(project "satnogs-comms"
				(path "/e315fb88-f764-4ec7-a92b-006692d5e26f/00000000-0000-0000-0000-00005e8bb47c"
					(reference "#PWR0702")
					(unit 1)
				)
			)
		)
	)
	(symbol
		(lib_id "power:GND")
		(at 60.96 92.71 0)
		(unit 1)
		(exclude_from_sim no)
		(in_bom yes)
		(on_board yes)
		(dnp no)
		(uuid "00000000-0000-0000-0000-00005ecf3973")
		(property "Reference" "#PWR0701"
			(at 60.96 99.06 0)
			(effects
				(font
					(size 1.27 1.27)
				)
				(hide yes)
			)
		)
		(property "Value" "GND"
			(at 61.0616 96.647 0)
			(effects
				(font
					(size 1.27 1.27)
				)
			)
		)
		(property "Footprint" ""
			(at 60.96 92.71 0)
			(effects
				(font
					(size 1.27 1.27)
				)
				(hide yes)
			)
		)
		(property "Datasheet" ""
			(at 60.96 92.71 0)
			(effects
				(font
					(size 1.27 1.27)
				)
				(hide yes)
			)
		)
		(property "Description" ""
			(at 60.96 92.71 0)
			(effects
				(font
					(size 1.27 1.27)
				)
				(hide yes)
			)
		)
		(pin "1"
			(uuid "534d87c1-bf1e-4965-ad11-3e2aa081e8e8")
		)
		(instances
			(project "satnogs-comms"
				(path "/e315fb88-f764-4ec7-a92b-006692d5e26f/00000000-0000-0000-0000-00005e8bb47c"
					(reference "#PWR0701")
					(unit 1)
				)
			)
		)
	)
	(symbol
		(lib_id "Device:C")
		(at 64.77 50.8 270)
		(unit 1)
		(exclude_from_sim no)
		(in_bom yes)
		(on_board yes)
		(dnp yes)
		(uuid "00000000-0000-0000-0000-00005ecf3975")
		(property "Reference" "C701"
			(at 68.58 46.99 90)
			(effects
				(font
					(size 1.27 1.27)
				)
			)
		)
		(property "Value" "DNP"
			(at 68.58 49.3014 90)
			(effects
				(font
					(size 1.27 1.27)
				)
			)
		)
		(property "Footprint" "Capacitor_SMD:C_0402_1005Metric"
			(at 60.96 51.7652 0)
			(effects
				(font
					(size 1.27 1.27)
				)
				(hide yes)
			)
		)
		(property "Datasheet" "~"
			(at 64.77 50.8 0)
			(effects
				(font
					(size 1.27 1.27)
				)
				(hide yes)
			)
		)
		(property "Description" ""
			(at 64.77 50.8 0)
			(effects
				(font
					(size 1.27 1.27)
				)
				(hide yes)
			)
		)
		(property "PartNumber" ""
			(at 64.77 50.8 0)
			(effects
				(font
					(size 1.27 1.27)
				)
				(hide yes)
			)
		)
		(property "Mnf." ""
			(at 64.77 50.8 0)
			(effects
				(font
					(size 1.27 1.27)
				)
				(hide yes)
			)
		)
		(pin "1"
			(uuid "67dca7e5-24d8-4654-9579-d6404307654b")
		)
		(pin "2"
			(uuid "9e477ee6-ad97-4cd4-b02b-4729979c40e2")
		)
		(instances
			(project "satnogs-comms"
				(path "/e315fb88-f764-4ec7-a92b-006692d5e26f/00000000-0000-0000-0000-00005e8bb47c"
					(reference "C701")
					(unit 1)
				)
			)
		)
	)
	(symbol
		(lib_id "Device:Q_NPN_BEC")
		(at 21.59 64.77 0)
		(mirror y)
		(unit 1)
		(exclude_from_sim no)
		(in_bom yes)
		(on_board yes)
		(dnp no)
		(uuid "00922a21-3ca3-465c-af4d-30700047f994")
		(property "Reference" "Q701"
			(at 26.67 69.85 0)
			(effects
				(font
					(size 1.27 1.27)
				)
				(justify left)
			)
		)
		(property "Value" "2SCR523M"
			(at 29.21 72.39 0)
			(effects
				(font
					(size 1.27 1.27)
				)
				(justify left)
			)
		)
		(property "Footprint" "Package_TO_SOT_SMD:SOT-723"
			(at 16.51 62.23 0)
			(effects
				(font
					(size 1.27 1.27)
				)
				(hide yes)
			)
		)
		(property "Datasheet" "~"
			(at 21.59 64.77 0)
			(effects
				(font
					(size 1.27 1.27)
				)
				(hide yes)
			)
		)
		(property "Description" ""
			(at 21.59 64.77 0)
			(effects
				(font
					(size 1.27 1.27)
				)
				(hide yes)
			)
		)
		(property "PartNumber" "2SCR523MT2L"
			(at 21.59 64.77 0)
			(effects
				(font
					(size 1.27 1.27)
				)
				(hide yes)
			)
		)
		(property "Mnf." "ROHM"
			(at 21.59 64.77 0)
			(effects
				(font
					(size 1.27 1.27)
				)
				(hide yes)
			)
		)
		(pin "1"
			(uuid "52fa8ee4-ac05-477a-9b98-da76757c8523")
		)
		(pin "2"
			(uuid "280f4d66-0ef3-4456-b327-279750eaf365")
		)
		(pin "3"
			(uuid "c5b14546-7871-4626-b261-3ee273f227c8")
		)
		(instances
			(project "satnogs-comms"
				(path "/e315fb88-f764-4ec7-a92b-006692d5e26f/00000000-0000-0000-0000-00005e8bb47c"
					(reference "Q701")
					(unit 1)
				)
			)
		)
	)
	(symbol
		(lib_id "lsf-kicad:EMC1702")
		(at 60.96 69.85 0)
		(unit 1)
		(exclude_from_sim no)
		(in_bom yes)
		(on_board yes)
		(dnp no)
		(uuid "043a4192-3b5b-4401-ab91-d3e1b7861dcc")
		(property "Reference" "U701"
			(at 62.23 83.82 0)
			(effects
				(font
					(size 1.27 1.27)
				)
				(justify left)
			)
		)
		(property "Value" "EMC1702"
			(at 62.23 86.36 0)
			(effects
				(font
					(size 1.27 1.27)
				)
				(justify left)
			)
		)
		(property "Footprint" "lsf-kicad-lib:QFN-12-1EP_4x4mm_P0.8mm_EP2.1x2.1mm"
			(at 114.3 72.39 0)
			(effects
				(font
					(size 1.27 1.27)
				)
				(hide yes)
			)
		)
		(property "Datasheet" "https://ww1.microchip.com/downloads/aemDocuments/documents/OTH/ProductDocuments/DataSheets/EMC1702-Data-Sheet-DS20006455A.pdf"
			(at 157.48 69.85 0)
			(effects
				(font
					(size 1.27 1.27)
				)
				(hide yes)
			)
		)
		(property "Description" ""
			(at 60.96 69.85 0)
			(effects
				(font
					(size 1.27 1.27)
				)
				(hide yes)
			)
		)
		(property "Mnf." "Microchip"
			(at 60.96 69.85 0)
			(effects
				(font
					(size 1.27 1.27)
				)
				(hide yes)
			)
		)
		(property "PartNumber" "EMC1702-1-KP-TR"
			(at 60.96 69.85 0)
			(effects
				(font
					(size 1.27 1.27)
				)
				(hide yes)
			)
		)
		(pin "1"
			(uuid "fb898b39-c00a-42a5-b60d-f2fdcf78a421")
		)
		(pin "10"
			(uuid "26281f36-a025-44f3-8024-fe279e48cc10")
		)
		(pin "11"
			(uuid "d6564062-bfdf-4126-b566-2cbd9ea98ece")
		)
		(pin "12"
			(uuid "fef13b85-e462-4ae9-ac46-5b482cd3eb5a")
		)
		(pin "13"
			(uuid "b3b3adbc-deac-4a59-9912-9f57119c49f0")
		)
		(pin "2"
			(uuid "447b0890-f05d-4a71-a79f-5cfc3ef150e2")
		)
		(pin "3"
			(uuid "b4fbefef-c95e-4579-9fbe-b5237ce11f02")
		)
		(pin "4"
			(uuid "36040636-9e44-4852-956c-2bc717cf9506")
		)
		(pin "5"
			(uuid "010fa2cf-d028-4edf-918a-e668c6da9d7a")
		)
		(pin "6"
			(uuid "fe3efd31-6d61-4260-9981-d9d36bcbc923")
		)
		(pin "7"
			(uuid "d518e2ea-89a7-4f56-90e1-9ba8bd1bdeb8")
		)
		(pin "8"
			(uuid "fe85a124-ac15-4666-af61-02c4581ce148")
		)
		(pin "9"
			(uuid "2eb5e6d4-25e4-4c52-a1e1-2bc1c6f05000")
		)
		(instances
			(project "satnogs-comms"
				(path "/e315fb88-f764-4ec7-a92b-006692d5e26f/00000000-0000-0000-0000-00005e8bb47c"
					(reference "U701")
					(unit 1)
				)
			)
		)
	)
	(symbol
		(lib_id "Device:C")
		(at 240.03 50.8 270)
		(unit 1)
		(exclude_from_sim no)
		(in_bom yes)
		(on_board yes)
		(dnp yes)
		(uuid "1067766a-0d2d-4fb6-830e-529d2a840067")
		(property "Reference" "C703"
			(at 243.84 46.99 90)
			(effects
				(font
					(size 1.27 1.27)
				)
			)
		)
		(property "Value" "DNP"
			(at 243.84 49.3014 90)
			(effects
				(font
					(size 1.27 1.27)
				)
			)
		)
		(property "Footprint" "Capacitor_SMD:C_0402_1005Metric"
			(at 236.22 51.7652 0)
			(effects
				(font
					(size 1.27 1.27)
				)
				(hide yes)
			)
		)
		(property "Datasheet" "~"
			(at 240.03 50.8 0)
			(effects
				(font
					(size 1.27 1.27)
				)
				(hide yes)
			)
		)
		(property "Description" ""
			(at 240.03 50.8 0)
			(effects
				(font
					(size 1.27 1.27)
				)
				(hide yes)
			)
		)
		(property "PartNumber" ""
			(at 240.03 50.8 0)
			(effects
				(font
					(size 1.27 1.27)
				)
				(hide yes)
			)
		)
		(property "Mnf." ""
			(at 240.03 50.8 0)
			(effects
				(font
					(size 1.27 1.27)
				)
				(hide yes)
			)
		)
		(pin "1"
			(uuid "83b8e751-bf0c-4418-9205-73eec85f1b5a")
		)
		(pin "2"
			(uuid "9e86e175-9fdc-4110-9374-30c9eed652ed")
		)
		(instances
			(project "satnogs-comms"
				(path "/e315fb88-f764-4ec7-a92b-006692d5e26f/00000000-0000-0000-0000-00005e8bb47c"
					(reference "C703")
					(unit 1)
				)
			)
		)
	)
	(symbol
		(lib_id "power:GND")
		(at 247.65 50.8 0)
		(unit 1)
		(exclude_from_sim no)
		(in_bom yes)
		(on_board yes)
		(dnp no)
		(uuid "1356dac2-66ab-4ec8-a0b8-b8b5cd24cc8e")
		(property "Reference" "#PWR0706"
			(at 247.65 57.15 0)
			(effects
				(font
					(size 1.27 1.27)
				)
				(hide yes)
			)
		)
		(property "Value" "GND"
			(at 247.7516 54.737 0)
			(effects
				(font
					(size 1.27 1.27)
				)
			)
		)
		(property "Footprint" ""
			(at 247.65 50.8 0)
			(effects
				(font
					(size 1.27 1.27)
				)
				(hide yes)
			)
		)
		(property "Datasheet" ""
			(at 247.65 50.8 0)
			(effects
				(font
					(size 1.27 1.27)
				)
				(hide yes)
			)
		)
		(property "Description" ""
			(at 247.65 50.8 0)
			(effects
				(font
					(size 1.27 1.27)
				)
				(hide yes)
			)
		)
		(pin "1"
			(uuid "fe24f692-e13d-4b09-9a57-bde5e090d51d")
		)
		(instances
			(project "satnogs-comms"
				(path "/e315fb88-f764-4ec7-a92b-006692d5e26f/00000000-0000-0000-0000-00005e8bb47c"
					(reference "#PWR0706")
					(unit 1)
				)
			)
		)
	)
	(symbol
		(lib_id "Connector:TestPoint")
		(at 77.47 76.2 180)
		(unit 1)
		(exclude_from_sim no)
		(in_bom no)
		(on_board yes)
		(dnp no)
		(uuid "1562c353-2670-47b7-a24b-fed31516250c")
		(property "Reference" "TP702"
			(at 78.74 81.28 0)
			(effects
				(font
					(size 1.27 1.27)
				)
				(justify left)
			)
		)
		(property "Value" "U_ALERT"
			(at 80.01 83.82 0)
			(effects
				(font
					(size 1.27 1.27)
				)
				(justify left)
			)
		)
		(property "Footprint" "lsf-kicad-lib:TestPoint_D0.8mm_Mask-Only"
			(at 72.39 76.2 0)
			(effects
				(font
					(size 1.27 1.27)
				)
				(hide yes)
			)
		)
		(property "Datasheet" "~"
			(at 72.39 76.2 0)
			(effects
				(font
					(size 1.27 1.27)
				)
				(hide yes)
			)
		)
		(property "Description" ""
			(at 77.47 76.2 0)
			(effects
				(font
					(size 1.27 1.27)
				)
				(hide yes)
			)
		)
		(pin "1"
			(uuid "3a4fd7e1-c52e-471f-b301-e8ecb9a7419b")
		)
		(instances
			(project "satnogs-comms"
				(path "/e315fb88-f764-4ec7-a92b-006692d5e26f/00000000-0000-0000-0000-00005e8bb47c"
					(reference "TP702")
					(unit 1)
				)
			)
		)
	)
	(symbol
		(lib_id "lsf-kicad:EMC1702")
		(at 236.22 69.85 0)
		(unit 1)
		(exclude_from_sim no)
		(in_bom yes)
		(on_board yes)
		(dnp no)
		(uuid "41c9c57e-c215-4c41-ac5d-3f87845300d3")
		(property "Reference" "U703"
			(at 237.49 83.82 0)
			(effects
				(font
					(size 1.27 1.27)
				)
				(justify left)
			)
		)
		(property "Value" "EMC1702"
			(at 237.49 86.36 0)
			(effects
				(font
					(size 1.27 1.27)
				)
				(justify left)
			)
		)
		(property "Footprint" "lsf-kicad-lib:QFN-12-1EP_4x4mm_P0.8mm_EP2.1x2.1mm"
			(at 289.56 72.39 0)
			(effects
				(font
					(size 1.27 1.27)
				)
				(hide yes)
			)
		)
		(property "Datasheet" "https://ww1.microchip.com/downloads/aemDocuments/documents/OTH/ProductDocuments/DataSheets/EMC1702-Data-Sheet-DS20006455A.pdf"
			(at 332.74 69.85 0)
			(effects
				(font
					(size 1.27 1.27)
				)
				(hide yes)
			)
		)
		(property "Description" ""
			(at 236.22 69.85 0)
			(effects
				(font
					(size 1.27 1.27)
				)
				(hide yes)
			)
		)
		(property "Mnf." "Microchip"
			(at 236.22 69.85 0)
			(effects
				(font
					(size 1.27 1.27)
				)
				(hide yes)
			)
		)
		(property "PartNumber" "EMC1702-1-KP-TR"
			(at 236.22 69.85 0)
			(effects
				(font
					(size 1.27 1.27)
				)
				(hide yes)
			)
		)
		(pin "1"
			(uuid "a4e1fe4e-a0b6-44e2-81a1-81257141b844")
		)
		(pin "10"
			(uuid "030cfa87-ea0b-460a-a5e7-683459e70fb4")
		)
		(pin "11"
			(uuid "fb5b7ad2-dcd7-4945-9aef-e377b3674bb7")
		)
		(pin "12"
			(uuid "ac10c79d-0f1e-476d-8ae8-0755fa174901")
		)
		(pin "13"
			(uuid "b55ae977-76ac-428a-a0cb-1d405ecdfb01")
		)
		(pin "2"
			(uuid "540514a2-74aa-4db4-8915-51c0eb937fb7")
		)
		(pin "3"
			(uuid "a3269ed8-f8ef-41dc-8822-983f9c212044")
		)
		(pin "4"
			(uuid "c2770aab-7372-4923-bfce-210210e1af11")
		)
		(pin "5"
			(uuid "23d1053f-571b-4025-86d2-e7b18b072e57")
		)
		(pin "6"
			(uuid "7ae522c6-3d19-45be-b506-a058cc039a8b")
		)
		(pin "7"
			(uuid "044c509d-6a6c-4105-a6ba-b2264d143e80")
		)
		(pin "8"
			(uuid "ab21eed1-f889-49af-b32c-2a6e048cbcdc")
		)
		(pin "9"
			(uuid "0f1c85f0-a7eb-48d8-a7d2-75b464b8ddaf")
		)
		(instances
			(project "satnogs-comms"
				(path "/e315fb88-f764-4ec7-a92b-006692d5e26f/00000000-0000-0000-0000-00005e8bb47c"
					(reference "U703")
					(unit 1)
				)
			)
		)
	)
	(symbol
		(lib_id "lsf-kicad:EMC1702")
		(at 153.67 69.85 0)
		(unit 1)
		(exclude_from_sim no)
		(in_bom yes)
		(on_board yes)
		(dnp no)
		(uuid "43a6cb92-f15d-40a0-84b0-0d431caefd42")
		(property "Reference" "U702"
			(at 154.94 83.82 0)
			(effects
				(font
					(size 1.27 1.27)
				)
				(justify left)
			)
		)
		(property "Value" "EMC1702"
			(at 154.94 86.36 0)
			(effects
				(font
					(size 1.27 1.27)
				)
				(justify left)
			)
		)
		(property "Footprint" "lsf-kicad-lib:QFN-12-1EP_4x4mm_P0.8mm_EP2.1x2.1mm"
			(at 207.01 72.39 0)
			(effects
				(font
					(size 1.27 1.27)
				)
				(hide yes)
			)
		)
		(property "Datasheet" "https://ww1.microchip.com/downloads/aemDocuments/documents/OTH/ProductDocuments/DataSheets/EMC1702-Data-Sheet-DS20006455A.pdf"
			(at 250.19 69.85 0)
			(effects
				(font
					(size 1.27 1.27)
				)
				(hide yes)
			)
		)
		(property "Description" ""
			(at 153.67 69.85 0)
			(effects
				(font
					(size 1.27 1.27)
				)
				(hide yes)
			)
		)
		(property "Mnf." "Microchip"
			(at 153.67 69.85 0)
			(effects
				(font
					(size 1.27 1.27)
				)
				(hide yes)
			)
		)
		(property "PartNumber" "EMC1702-1-KP-TR"
			(at 153.67 69.85 0)
			(effects
				(font
					(size 1.27 1.27)
				)
				(hide yes)
			)
		)
		(pin "1"
			(uuid "9d93d34a-2f24-4d27-ba5b-851e3bf86777")
		)
		(pin "10"
			(uuid "227a016d-9497-486b-ae35-570e02c8bafb")
		)
		(pin "11"
			(uuid "350900a3-35d7-4f34-bf81-e509bbd1e139")
		)
		(pin "12"
			(uuid "0b045e3f-a64e-4ab6-8570-f54a4b6be5c8")
		)
		(pin "13"
			(uuid "1e928431-688c-4304-a493-86364a987dc0")
		)
		(pin "2"
			(uuid "5a4606e9-fd9e-46cf-ac3b-d4714725940b")
		)
		(pin "3"
			(uuid "6251e03b-d9c0-458e-9cef-6084e31badda")
		)
		(pin "4"
			(uuid "40766d40-5654-48dc-88b6-4c5c42c66921")
		)
		(pin "5"
			(uuid "84922825-d34d-4737-bb7a-dd5b479a9eee")
		)
		(pin "6"
			(uuid "6a323d3e-2cba-43da-afd8-c43c49e3bebb")
		)
		(pin "7"
			(uuid "5f12cd6b-13f4-4bff-adc1-7d18de62b5f2")
		)
		(pin "8"
			(uuid "8a730944-b1dd-43e9-960a-1c31a4065bbd")
		)
		(pin "9"
			(uuid "49b0ec8f-5e04-47ba-b7f6-8cffbdb2e73b")
		)
		(instances
			(project "satnogs-comms"
				(path "/e315fb88-f764-4ec7-a92b-006692d5e26f/00000000-0000-0000-0000-00005e8bb47c"
					(reference "U702")
					(unit 1)
				)
			)
		)
	)
	(symbol
		(lib_id "Device:R")
		(at 219.71 83.82 0)
		(unit 1)
		(exclude_from_sim no)
		(in_bom yes)
		(on_board yes)
		(dnp no)
		(uuid "64c171a1-3a0a-4345-84f1-398cba330f5c")
		(property "Reference" "R707"
			(at 219.71 80.01 0)
			(effects
				(font
					(size 1.27 1.27)
				)
				(justify right)
			)
		)
		(property "Value" "2k"
			(at 218.44 82.55 0)
			(effects
				(font
					(size 1.27 1.27)
				)
				(justify right)
			)
		)
		(property "Footprint" "Resistor_SMD:R_0402_1005Metric"
			(at 217.932 83.82 90)
			(effects
				(font
					(size 1.27 1.27)
				)
				(hide yes)
			)
		)
		(property "Datasheet" "~"
			(at 219.71 83.82 0)
			(effects
				(font
					(size 1.27 1.27)
				)
				(hide yes)
			)
		)
		(property "Description" ""
			(at 219.71 83.82 0)
			(effects
				(font
					(size 1.27 1.27)
				)
				(hide yes)
			)
		)
		(property "PartNumber" " CRCW04022K00JNEDC"
			(at 219.71 83.82 0)
			(effects
				(font
					(size 1.27 1.27)
				)
				(hide yes)
			)
		)
		(property "Mnf." "Vishay"
			(at 219.71 83.82 0)
			(effects
				(font
					(size 1.27 1.27)
				)
				(hide yes)
			)
		)
		(pin "1"
			(uuid "8f072260-ca20-4295-8ffe-877126e01773")
		)
		(pin "2"
			(uuid "fc0d4957-26c9-4f9d-8f4a-26788f99ec04")
		)
		(instances
			(project "satnogs-comms"
				(path "/e315fb88-f764-4ec7-a92b-006692d5e26f/00000000-0000-0000-0000-00005e8bb47c"
					(reference "R707")
					(unit 1)
				)
			)
		)
	)
	(symbol
		(lib_id "Device:C")
		(at 157.48 50.8 270)
		(unit 1)
		(exclude_from_sim no)
		(in_bom yes)
		(on_board yes)
		(dnp yes)
		(uuid "660116d6-6d24-4a08-b17f-3b6e24df530a")
		(property "Reference" "C702"
			(at 161.29 46.99 90)
			(effects
				(font
					(size 1.27 1.27)
				)
			)
		)
		(property "Value" "DNP"
			(at 161.29 49.3014 90)
			(effects
				(font
					(size 1.27 1.27)
				)
			)
		)
		(property "Footprint" "Capacitor_SMD:C_0402_1005Metric"
			(at 153.67 51.7652 0)
			(effects
				(font
					(size 1.27 1.27)
				)
				(hide yes)
			)
		)
		(property "Datasheet" "~"
			(at 157.48 50.8 0)
			(effects
				(font
					(size 1.27 1.27)
				)
				(hide yes)
			)
		)
		(property "Description" ""
			(at 157.48 50.8 0)
			(effects
				(font
					(size 1.27 1.27)
				)
				(hide yes)
			)
		)
		(property "PartNumber" ""
			(at 157.48 50.8 0)
			(effects
				(font
					(size 1.27 1.27)
				)
				(hide yes)
			)
		)
		(property "Mnf." ""
			(at 157.48 50.8 0)
			(effects
				(font
					(size 1.27 1.27)
				)
				(hide yes)
			)
		)
		(pin "1"
			(uuid "aef7f02a-1af7-4ea4-9e0d-840763cf71aa")
		)
		(pin "2"
			(uuid "a44280e6-eeeb-4a1e-b011-559980cb5f27")
		)
		(instances
			(project "satnogs-comms"
				(path "/e315fb88-f764-4ec7-a92b-006692d5e26f/00000000-0000-0000-0000-00005e8bb47c"
					(reference "C702")
					(unit 1)
				)
			)
		)
	)
	(symbol
		(lib_id "power:GND")
		(at 165.1 50.8 0)
		(unit 1)
		(exclude_from_sim no)
		(in_bom yes)
		(on_board yes)
		(dnp no)
		(uuid "7aeac98c-a599-41e8-8780-877f646c8a86")
		(property "Reference" "#PWR0704"
			(at 165.1 57.15 0)
			(effects
				(font
					(size 1.27 1.27)
				)
				(hide yes)
			)
		)
		(property "Value" "GND"
			(at 165.2016 54.737 0)
			(effects
				(font
					(size 1.27 1.27)
				)
			)
		)
		(property "Footprint" ""
			(at 165.1 50.8 0)
			(effects
				(font
					(size 1.27 1.27)
				)
				(hide yes)
			)
		)
		(property "Datasheet" ""
			(at 165.1 50.8 0)
			(effects
				(font
					(size 1.27 1.27)
				)
				(hide yes)
			)
		)
		(property "Description" ""
			(at 165.1 50.8 0)
			(effects
				(font
					(size 1.27 1.27)
				)
				(hide yes)
			)
		)
		(pin "1"
			(uuid "e10bb068-7a7e-4b48-a362-0e0ecc76f27d")
		)
		(instances
			(project "satnogs-comms"
				(path "/e315fb88-f764-4ec7-a92b-006692d5e26f/00000000-0000-0000-0000-00005e8bb47c"
					(reference "#PWR0704")
					(unit 1)
				)
			)
		)
	)
	(symbol
		(lib_id "Connector:TestPoint")
		(at 251.46 72.39 270)
		(unit 1)
		(exclude_from_sim no)
		(in_bom no)
		(on_board yes)
		(dnp no)
		(uuid "878df24d-3141-4f7a-b642-cb8c75f8ccde")
		(property "Reference" "TP705"
			(at 252.73 67.31 90)
			(effects
				(font
					(size 1.27 1.27)
				)
				(justify left)
			)
		)
		(property "Value" "S_THERM"
			(at 250.19 69.85 90)
			(effects
				(font
					(size 1.27 1.27)
				)
				(justify left)
			)
		)
		(property "Footprint" "lsf-kicad-lib:TestPoint_D0.8mm_Mask-Only"
			(at 251.46 77.47 0)
			(effects
				(font
					(size 1.27 1.27)
				)
				(hide yes)
			)
		)
		(property "Datasheet" "~"
			(at 251.46 77.47 0)
			(effects
				(font
					(size 1.27 1.27)
				)
				(hide yes)
			)
		)
		(property "Description" ""
			(at 251.46 72.39 0)
			(effects
				(font
					(size 1.27 1.27)
				)
				(hide yes)
			)
		)
		(pin "1"
			(uuid "4efddd66-f187-4f1c-85d6-07b204905d7c")
		)
		(instances
			(project "satnogs-comms"
				(path "/e315fb88-f764-4ec7-a92b-006692d5e26f/00000000-0000-0000-0000-00005e8bb47c"
					(reference "TP705")
					(unit 1)
				)
			)
		)
	)
	(symbol
		(lib_id "power:GND")
		(at 153.67 92.71 0)
		(unit 1)
		(exclude_from_sim no)
		(in_bom yes)
		(on_board yes)
		(dnp no)
		(uuid "9091b3a2-bc1c-4c06-b2a2-fa45869d1438")
		(property "Reference" "#PWR0703"
			(at 153.67 99.06 0)
			(effects
				(font
					(size 1.27 1.27)
				)
				(hide yes)
			)
		)
		(property "Value" "GND"
			(at 153.7716 96.647 0)
			(effects
				(font
					(size 1.27 1.27)
				)
			)
		)
		(property "Footprint" ""
			(at 153.67 92.71 0)
			(effects
				(font
					(size 1.27 1.27)
				)
				(hide yes)
			)
		)
		(property "Datasheet" ""
			(at 153.67 92.71 0)
			(effects
				(font
					(size 1.27 1.27)
				)
				(hide yes)
			)
		)
		(property "Description" ""
			(at 153.67 92.71 0)
			(effects
				(font
					(size 1.27 1.27)
				)
				(hide yes)
			)
		)
		(pin "1"
			(uuid "eb640627-1669-4230-82ae-faae3df5a293")
		)
		(instances
			(project "satnogs-comms"
				(path "/e315fb88-f764-4ec7-a92b-006692d5e26f/00000000-0000-0000-0000-00005e8bb47c"
					(reference "#PWR0703")
					(unit 1)
				)
			)
		)
	)
	(symbol
		(lib_id "Connector:TestPoint")
		(at 252.73 76.2 180)
		(unit 1)
		(exclude_from_sim no)
		(in_bom no)
		(on_board yes)
		(dnp no)
		(uuid "a1f9b842-bae3-43ef-a7aa-9956e3ee2155")
		(property "Reference" "TP706"
			(at 255.27 81.28 0)
			(effects
				(font
					(size 1.27 1.27)
				)
				(justify left)
			)
		)
		(property "Value" "S_ALERT"
			(at 256.54 83.82 0)
			(effects
				(font
					(size 1.27 1.27)
				)
				(justify left)
			)
		)
		(property "Footprint" "lsf-kicad-lib:TestPoint_D0.8mm_Mask-Only"
			(at 247.65 76.2 0)
			(effects
				(font
					(size 1.27 1.27)
				)
				(hide yes)
			)
		)
		(property "Datasheet" "~"
			(at 247.65 76.2 0)
			(effects
				(font
					(size 1.27 1.27)
				)
				(hide yes)
			)
		)
		(property "Description" ""
			(at 252.73 76.2 0)
			(effects
				(font
					(size 1.27 1.27)
				)
				(hide yes)
			)
		)
		(pin "1"
			(uuid "950e4bc7-6ed7-448d-884f-d3e950894943")
		)
		(instances
			(project "satnogs-comms"
				(path "/e315fb88-f764-4ec7-a92b-006692d5e26f/00000000-0000-0000-0000-00005e8bb47c"
					(reference "TP706")
					(unit 1)
				)
			)
		)
	)
	(symbol
		(lib_id "Device:C_Small")
		(at 36.83 68.58 0)
		(unit 1)
		(exclude_from_sim no)
		(in_bom yes)
		(on_board yes)
		(dnp no)
		(uuid "a983188f-c6b3-4edc-88c7-7a8a49189b37")
		(property "Reference" "C704"
			(at 30.48 67.31 0)
			(effects
				(font
					(size 1.27 1.27)
				)
				(justify left)
			)
		)
		(property "Value" "2.2n"
			(at 30.48 69.85 0)
			(effects
				(font
					(size 1.27 1.27)
				)
				(justify left)
			)
		)
		(property "Footprint" "Capacitor_SMD:C_0402_1005Metric"
			(at 36.83 68.58 0)
			(effects
				(font
					(size 1.27 1.27)
				)
				(hide yes)
			)
		)
		(property "Datasheet" "~"
			(at 36.83 68.58 0)
			(effects
				(font
					(size 1.27 1.27)
				)
				(hide yes)
			)
		)
		(property "Description" "ESR 1.08Ohm"
			(at 36.83 68.58 0)
			(effects
				(font
					(size 1.27 1.27)
				)
				(hide yes)
			)
		)
		(property "PartNumber" "CGA2B2X7R1H222K050BA"
			(at 36.83 68.58 0)
			(effects
				(font
					(size 1.27 1.27)
				)
				(hide yes)
			)
		)
		(property "Mnf." "TDK"
			(at 36.83 68.58 0)
			(effects
				(font
					(size 1.27 1.27)
				)
				(hide yes)
			)
		)
		(pin "1"
			(uuid "7b02832f-7163-4d2a-86fd-90660c83ae5d")
		)
		(pin "2"
			(uuid "1bf35194-64cd-4a36-b04d-fcfa7d8925ce")
		)
		(instances
			(project "satnogs-comms"
				(path "/e315fb88-f764-4ec7-a92b-006692d5e26f/00000000-0000-0000-0000-00005e8bb47c"
					(reference "C704")
					(unit 1)
				)
			)
		)
	)
	(symbol
		(lib_id "Device:C_Small")
		(at 213.36 68.58 0)
		(unit 1)
		(exclude_from_sim no)
		(in_bom yes)
		(on_board yes)
		(dnp no)
		(uuid "b2055743-d380-4289-a643-6bf02948fd21")
		(property "Reference" "C706"
			(at 207.01 67.31 0)
			(effects
				(font
					(size 1.27 1.27)
				)
				(justify left)
			)
		)
		(property "Value" "2.2n"
			(at 207.01 69.85 0)
			(effects
				(font
					(size 1.27 1.27)
				)
				(justify left)
			)
		)
		(property "Footprint" "Capacitor_SMD:C_0402_1005Metric"
			(at 213.36 68.58 0)
			(effects
				(font
					(size 1.27 1.27)
				)
				(hide yes)
			)
		)
		(property "Datasheet" "~"
			(at 213.36 68.58 0)
			(effects
				(font
					(size 1.27 1.27)
				)
				(hide yes)
			)
		)
		(property "Description" "ESR 1.08Ohm"
			(at 213.36 68.58 0)
			(effects
				(font
					(size 1.27 1.27)
				)
				(hide yes)
			)
		)
		(property "PartNumber" "CGA2B2X7R1H222K050BA"
			(at 213.36 68.58 0)
			(effects
				(font
					(size 1.27 1.27)
				)
				(hide yes)
			)
		)
		(property "Mnf." "TDK"
			(at 213.36 68.58 0)
			(effects
				(font
					(size 1.27 1.27)
				)
				(hide yes)
			)
		)
		(pin "1"
			(uuid "92306918-9a4b-49b2-8f53-b0afcb478dc8")
		)
		(pin "2"
			(uuid "f1033ca8-993f-4fc1-9df0-8724829a2390")
		)
		(instances
			(project "satnogs-comms"
				(path "/e315fb88-f764-4ec7-a92b-006692d5e26f/00000000-0000-0000-0000-00005e8bb47c"
					(reference "C706")
					(unit 1)
				)
			)
		)
	)
	(symbol
		(lib_id "power:GND")
		(at 236.22 92.71 0)
		(unit 1)
		(exclude_from_sim no)
		(in_bom yes)
		(on_board yes)
		(dnp no)
		(uuid "b64915f4-a9b6-458c-abcd-2491cfcea5d5")
		(property "Reference" "#PWR0705"
			(at 236.22 99.06 0)
			(effects
				(font
					(size 1.27 1.27)
				)
				(hide yes)
			)
		)
		(property "Value" "GND"
			(at 236.3216 96.647 0)
			(effects
				(font
					(size 1.27 1.27)
				)
			)
		)
		(property "Footprint" ""
			(at 236.22 92.71 0)
			(effects
				(font
					(size 1.27 1.27)
				)
				(hide yes)
			)
		)
		(property "Datasheet" ""
			(at 236.22 92.71 0)
			(effects
				(font
					(size 1.27 1.27)
				)
				(hide yes)
			)
		)
		(property "Description" ""
			(at 236.22 92.71 0)
			(effects
				(font
					(size 1.27 1.27)
				)
				(hide yes)
			)
		)
		(pin "1"
			(uuid "c19b929f-f6b4-4f39-8e61-b2da092ea91b")
		)
		(instances
			(project "satnogs-comms"
				(path "/e315fb88-f764-4ec7-a92b-006692d5e26f/00000000-0000-0000-0000-00005e8bb47c"
					(reference "#PWR0705")
					(unit 1)
				)
			)
		)
	)
	(symbol
		(lib_id "Device:Q_NPN_BEC")
		(at 198.12 64.77 0)
		(mirror y)
		(unit 1)
		(exclude_from_sim no)
		(in_bom yes)
		(on_board yes)
		(dnp no)
		(uuid "b94352d5-6f8d-456a-9f7d-281c9a384228")
		(property "Reference" "Q703"
			(at 203.2 69.85 0)
			(effects
				(font
					(size 1.27 1.27)
				)
				(justify left)
			)
		)
		(property "Value" "2SCR523M"
			(at 205.74 72.39 0)
			(effects
				(font
					(size 1.27 1.27)
				)
				(justify left)
			)
		)
		(property "Footprint" "Package_TO_SOT_SMD:SOT-723"
			(at 193.04 62.23 0)
			(effects
				(font
					(size 1.27 1.27)
				)
				(hide yes)
			)
		)
		(property "Datasheet" "~"
			(at 198.12 64.77 0)
			(effects
				(font
					(size 1.27 1.27)
				)
				(hide yes)
			)
		)
		(property "Description" ""
			(at 198.12 64.77 0)
			(effects
				(font
					(size 1.27 1.27)
				)
				(hide yes)
			)
		)
		(property "PartNumber" "2SCR523MT2L"
			(at 198.12 64.77 0)
			(effects
				(font
					(size 1.27 1.27)
				)
				(hide yes)
			)
		)
		(property "Mnf." "ROHM"
			(at 198.12 64.77 0)
			(effects
				(font
					(size 1.27 1.27)
				)
				(hide yes)
			)
		)
		(pin "1"
			(uuid "a07b4a13-d701-4b7d-a14f-288806276d6f")
		)
		(pin "2"
			(uuid "9227df13-f9f3-4f65-bb67-fe7056aa0233")
		)
		(pin "3"
			(uuid "67186568-caf5-414b-ae5f-9c835619b9ff")
		)
		(instances
			(project "satnogs-comms"
				(path "/e315fb88-f764-4ec7-a92b-006692d5e26f/00000000-0000-0000-0000-00005e8bb47c"
					(reference "Q703")
					(unit 1)
				)
			)
		)
	)
	(symbol
		(lib_id "Connector:TestPoint")
		(at 76.2 72.39 270)
		(unit 1)
		(exclude_from_sim no)
		(in_bom no)
		(on_board yes)
		(dnp no)
		(uuid "c5525670-341a-40fc-96a1-e8116dd2f43d")
		(property "Reference" "TP701"
			(at 77.47 67.31 90)
			(effects
				(font
					(size 1.27 1.27)
				)
				(justify left)
			)
		)
		(property "Value" "U_THERM"
			(at 74.93 69.85 90)
			(effects
				(font
					(size 1.27 1.27)
				)
				(justify left)
			)
		)
		(property "Footprint" "lsf-kicad-lib:TestPoint_D0.8mm_Mask-Only"
			(at 76.2 77.47 0)
			(effects
				(font
					(size 1.27 1.27)
				)
				(hide yes)
			)
		)
		(property "Datasheet" "~"
			(at 76.2 77.47 0)
			(effects
				(font
					(size 1.27 1.27)
				)
				(hide yes)
			)
		)
		(property "Description" ""
			(at 76.2 72.39 0)
			(effects
				(font
					(size 1.27 1.27)
				)
				(hide yes)
			)
		)
		(pin "1"
			(uuid "3d85339e-9873-4374-8b70-e92def26245f")
		)
		(instances
			(project "satnogs-comms"
				(path "/e315fb88-f764-4ec7-a92b-006692d5e26f/00000000-0000-0000-0000-00005e8bb47c"
					(reference "TP701")
					(unit 1)
				)
			)
		)
	)
	(symbol
		(lib_id "Device:C_Small")
		(at 123.19 68.58 0)
		(unit 1)
		(exclude_from_sim no)
		(in_bom yes)
		(on_board yes)
		(dnp no)
		(uuid "cac98cb2-0286-430c-b7ea-97c9c2d1b1ff")
		(property "Reference" "C705"
			(at 116.84 67.31 0)
			(effects
				(font
					(size 1.27 1.27)
				)
				(justify left)
			)
		)
		(property "Value" "2.2n"
			(at 116.84 69.85 0)
			(effects
				(font
					(size 1.27 1.27)
				)
				(justify left)
			)
		)
		(property "Footprint" "Capacitor_SMD:C_0402_1005Metric"
			(at 123.19 68.58 0)
			(effects
				(font
					(size 1.27 1.27)
				)
				(hide yes)
			)
		)
		(property "Datasheet" "~"
			(at 123.19 68.58 0)
			(effects
				(font
					(size 1.27 1.27)
				)
				(hide yes)
			)
		)
		(property "Description" "ESR 1.08Ohm"
			(at 123.19 68.58 0)
			(effects
				(font
					(size 1.27 1.27)
				)
				(hide yes)
			)
		)
		(property "PartNumber" "CGA2B2X7R1H222K050BA"
			(at 123.19 68.58 0)
			(effects
				(font
					(size 1.27 1.27)
				)
				(hide yes)
			)
		)
		(property "Mnf." "TDK"
			(at 123.19 68.58 0)
			(effects
				(font
					(size 1.27 1.27)
				)
				(hide yes)
			)
		)
		(pin "1"
			(uuid "09a6d10c-7441-457a-a6d2-04c23f77c4c3")
		)
		(pin "2"
			(uuid "77839c8b-71de-4eab-8c1d-08d717b2db34")
		)
		(instances
			(project "satnogs-comms"
				(path "/e315fb88-f764-4ec7-a92b-006692d5e26f/00000000-0000-0000-0000-00005e8bb47c"
					(reference "C705")
					(unit 1)
				)
			)
		)
	)
	(symbol
		(lib_id "Device:R")
		(at 90.17 69.85 180)
		(unit 1)
		(exclude_from_sim no)
		(in_bom yes)
		(on_board yes)
		(dnp no)
		(uuid "cfdd8bb8-39be-437b-bcb8-a6899cab6b24")
		(property "Reference" "R710"
			(at 87.63 72.39 90)
			(effects
				(font
					(size 1.27 1.27)
				)
				(justify right)
			)
		)
		(property "Value" "100k"
			(at 92.71 72.39 90)
			(effects
				(font
					(size 1.27 1.27)
				)
				(justify right)
			)
		)
		(property "Footprint" "Resistor_SMD:R_0402_1005Metric"
			(at 91.948 69.85 90)
			(effects
				(font
					(size 1.27 1.27)
				)
				(hide yes)
			)
		)
		(property "Datasheet" "~"
			(at 90.17 69.85 0)
			(effects
				(font
					(size 1.27 1.27)
				)
				(hide yes)
			)
		)
		(property "Description" ""
			(at 90.17 69.85 0)
			(effects
				(font
					(size 1.27 1.27)
				)
				(hide yes)
			)
		)
		(property "PartNumber" "CR0402-FX-1003GLF"
			(at 90.17 69.85 0)
			(effects
				(font
					(size 1.27 1.27)
				)
				(hide yes)
			)
		)
		(property "Mnf." "Vishay"
			(at 90.17 69.85 0)
			(effects
				(font
					(size 1.27 1.27)
				)
				(hide yes)
			)
		)
		(pin "1"
			(uuid "c62fe99c-ee42-4ce7-ac1e-3a65e8c981bc")
		)
		(pin "2"
			(uuid "76da41c4-e556-4a56-8abb-461ea6707b20")
		)
		(instances
			(project "satnogs-comms"
				(path "/e315fb88-f764-4ec7-a92b-006692d5e26f/00000000-0000-0000-0000-00005e8bb47c"
					(reference "R710")
					(unit 1)
				)
			)
		)
	)
	(symbol
		(lib_id "Device:R")
		(at 44.45 83.82 0)
		(unit 1)
		(exclude_from_sim no)
		(in_bom yes)
		(on_board yes)
		(dnp no)
		(uuid "d62a76fa-7e9c-445a-9f5e-26e5af816ebe")
		(property "Reference" "R701"
			(at 44.45 80.01 0)
			(effects
				(font
					(size 1.27 1.27)
				)
				(justify right)
			)
		)
		(property "Value" "100"
			(at 43.18 82.55 0)
			(effects
				(font
					(size 1.27 1.27)
				)
				(justify right)
			)
		)
		(property "Footprint" "Resistor_SMD:R_0402_1005Metric"
			(at 42.672 83.82 90)
			(effects
				(font
					(size 1.27 1.27)
				)
				(hide yes)
			)
		)
		(property "Datasheet" "~"
			(at 44.45 83.82 0)
			(effects
				(font
					(size 1.27 1.27)
				)
				(hide yes)
			)
		)
		(property "Description" ""
			(at 44.45 83.82 0)
			(effects
				(font
					(size 1.27 1.27)
				)
				(hide yes)
			)
		)
		(property "PartNumber" "CRCW0402100RFKEDC"
			(at 44.45 83.82 0)
			(effects
				(font
					(size 1.27 1.27)
				)
				(hide yes)
			)
		)
		(property "Mnf." "Vishay"
			(at 44.45 83.82 0)
			(effects
				(font
					(size 1.27 1.27)
				)
				(hide yes)
			)
		)
		(pin "1"
			(uuid "1b71f17e-4381-450e-b536-195b0e3b83d7")
		)
		(pin "2"
			(uuid "ed38ed5d-0271-4d60-b863-5fa24a9de711")
		)
		(instances
			(project "satnogs-comms"
				(path "/e315fb88-f764-4ec7-a92b-006692d5e26f/00000000-0000-0000-0000-00005e8bb47c"
					(reference "R701")
					(unit 1)
				)
			)
		)
	)
	(symbol
		(lib_id "Device:R")
		(at 138.43 83.82 0)
		(unit 1)
		(exclude_from_sim no)
		(in_bom yes)
		(on_board yes)
		(dnp no)
		(uuid "d811692d-ff16-418c-ac12-369fc05ba127")
		(property "Reference" "R704"
			(at 138.43 80.01 0)
			(effects
				(font
					(size 1.27 1.27)
				)
				(justify right)
			)
		)
		(property "Value" "20k"
			(at 137.16 82.55 0)
			(effects
				(font
					(size 1.27 1.27)
				)
				(justify right)
			)
		)
		(property "Footprint" "Resistor_SMD:R_0402_1005Metric"
			(at 136.652 83.82 90)
			(effects
				(font
					(size 1.27 1.27)
				)
				(hide yes)
			)
		)
		(property "Datasheet" "~"
			(at 138.43 83.82 0)
			(effects
				(font
					(size 1.27 1.27)
				)
				(hide yes)
			)
		)
		(property "Description" ""
			(at 138.43 83.82 0)
			(effects
				(font
					(size 1.27 1.27)
				)
				(hide yes)
			)
		)
		(property "PartNumber" "CRCW040220K0JNEDC"
			(at 138.43 83.82 0)
			(effects
				(font
					(size 1.27 1.27)
				)
				(hide yes)
			)
		)
		(property "Mnf." "Vishay"
			(at 138.43 83.82 0)
			(effects
				(font
					(size 1.27 1.27)
				)
				(hide yes)
			)
		)
		(pin "1"
			(uuid "70dcc540-2ff3-462e-99a6-14393a482eb8")
		)
		(pin "2"
			(uuid "e73417ef-780b-4cab-9d8a-57a221b28e54")
		)
		(instances
			(project "satnogs-comms"
				(path "/e315fb88-f764-4ec7-a92b-006692d5e26f/00000000-0000-0000-0000-00005e8bb47c"
					(reference "R704")
					(unit 1)
				)
			)
		)
	)
	(symbol
		(lib_id "Device:R")
		(at 265.43 69.85 180)
		(unit 1)
		(exclude_from_sim no)
		(in_bom yes)
		(on_board yes)
		(dnp no)
		(uuid "e2d06a9d-7a4c-4fca-acb7-58b3605eed87")
		(property "Reference" "R712"
			(at 262.89 72.39 90)
			(effects
				(font
					(size 1.27 1.27)
				)
				(justify right)
			)
		)
		(property "Value" "100k"
			(at 267.97 72.39 90)
			(effects
				(font
					(size 1.27 1.27)
				)
				(justify right)
			)
		)
		(property "Footprint" "Resistor_SMD:R_0402_1005Metric"
			(at 267.208 69.85 90)
			(effects
				(font
					(size 1.27 1.27)
				)
				(hide yes)
			)
		)
		(property "Datasheet" "~"
			(at 265.43 69.85 0)
			(effects
				(font
					(size 1.27 1.27)
				)
				(hide yes)
			)
		)
		(property "Description" ""
			(at 265.43 69.85 0)
			(effects
				(font
					(size 1.27 1.27)
				)
				(hide yes)
			)
		)
		(property "PartNumber" "CR0402-FX-1003GLF"
			(at 265.43 69.85 0)
			(effects
				(font
					(size 1.27 1.27)
				)
				(hide yes)
			)
		)
		(property "Mnf." "Vishay"
			(at 265.43 69.85 0)
			(effects
				(font
					(size 1.27 1.27)
				)
				(hide yes)
			)
		)
		(pin "1"
			(uuid "a88c440b-d8b2-4f96-a23f-b4692f15e4c7")
		)
		(pin "2"
			(uuid "670479bc-4007-4bb1-8c61-a1c65714043e")
		)
		(instances
			(project "satnogs-comms"
				(path "/e315fb88-f764-4ec7-a92b-006692d5e26f/00000000-0000-0000-0000-00005e8bb47c"
					(reference "R712")
					(unit 1)
				)
			)
		)
	)
	(symbol
		(lib_id "Device:Q_NPN_BEC")
		(at 111.76 64.77 0)
		(mirror y)
		(unit 1)
		(exclude_from_sim no)
		(in_bom yes)
		(on_board yes)
		(dnp no)
		(uuid "e73bfea9-a573-4ab8-8ae6-fd0db826584f")
		(property "Reference" "Q702"
			(at 114.3 72.39 0)
			(effects
				(font
					(size 1.27 1.27)
				)
				(justify left)
			)
		)
		(property "Value" "2SCR523M"
			(at 119.38 74.93 0)
			(effects
				(font
					(size 1.27 1.27)
				)
				(justify left)
			)
		)
		(property "Footprint" "Package_TO_SOT_SMD:SOT-723"
			(at 106.68 62.23 0)
			(effects
				(font
					(size 1.27 1.27)
				)
				(hide yes)
			)
		)
		(property "Datasheet" "~"
			(at 111.76 64.77 0)
			(effects
				(font
					(size 1.27 1.27)
				)
				(hide yes)
			)
		)
		(property "Description" ""
			(at 111.76 64.77 0)
			(effects
				(font
					(size 1.27 1.27)
				)
				(hide yes)
			)
		)
		(property "PartNumber" "2SCR523MT2L"
			(at 111.76 64.77 0)
			(effects
				(font
					(size 1.27 1.27)
				)
				(hide yes)
			)
		)
		(property "Mnf." "ROHM"
			(at 111.76 64.77 0)
			(effects
				(font
					(size 1.27 1.27)
				)
				(hide yes)
			)
		)
		(pin "1"
			(uuid "ca0480ef-7d72-458d-a44d-5cf25d8b5101")
		)
		(pin "2"
			(uuid "15eba1e3-ee21-4edb-98ac-a02ea2f188bd")
		)
		(pin "3"
			(uuid "d9139db3-efb9-4cbb-94ca-7794b59bbceb")
		)
		(instances
			(project "satnogs-comms"
				(path "/e315fb88-f764-4ec7-a92b-006692d5e26f/00000000-0000-0000-0000-00005e8bb47c"
					(reference "Q702")
					(unit 1)
				)
			)
		)
	)
)
