<Qucs Schematic 2.1.0>
<Properties>
  <View=-468,-39,1502,1118,1.3698,558,0>
  <Grid=10,10,1>
  <DataSet=rf-mixer-artifacts.dat>
  <DataDisplay=rf-mixer-artifacts.dpl>
  <OpenDisplay=0>
  <Script=rf-mixer-artifacts.m>
  <RunScript=0>
  <showFrame=0>
  <FrameText0=Title>
  <FrameText1=Drawn By:>
  <FrameText2=Date:>
  <FrameText3=Revision:>
</Properties>
<Symbol>
</Symbol>
<Components>
  <GND * 1 290 250 0 0 0 0>
  <R R3 1 290 140 -92 -26 0 3 "50 Ohm" 1 "26.85" 0 "0.0" 0 "0.0" 0 "26.85" 0 "european" 0>
  <Vrect V5 1 290 210 18 -26 0 1 "0.25 V" 1 "2315 ps" 1 "2315 ps" 1 "0.001 ns" 0 "0.001 ns" 0 "0 ns" 0 "0 V" 1>
  <GND * 1 110 400 0 0 0 0>
  <R R2 1 150 40 -26 -59 0 2 "50 Ohm" 1 "26.85" 0 "0.0" 0 "0.0" 0 "26.85" 0 "european" 0>
  <R R1 1 750 120 15 -26 0 1 "50 Ohm" 1 "26.85" 0 "0.0" 0 "0.0" 0 "26.85" 0 "european" 0>
  <GND * 1 750 190 0 0 0 0>
  <.CUSTOMSIM CUSTOM1 0 920 50 0 56 0 0 "tran 80p 1000n 0\nlinearize v(rf)\nfft V(rf)\nlet S = db(v(rf))" 1 "V(RF);S" 0 "" 0>
  <.TR TR1 1 920 260 0 98 0 0 "lin" 1 "0" 1 "100 ns" 1 "10000" 0 "Trapezoidal" 0 "2" 0 "1 ns" 0 "1e-16" 0 "150" 0 "0.001" 0 "1 pA" 0 "1 uV" 0 "26.85" 0 "1e-3" 0 "1e-6" 0 "1" 0 "CroutLU" 0 "no" 0 "yes" 0 "0" 0>
  <src_eqndef B1 1 610 120 18 -26 0 1 "V(IF)*V(LO)" 1 "" 0 "" 0 "" 0 "" 0>
  <GND * 1 610 190 0 0 0 0>
  <.FFT FFT1 1 1090 270 0 82 0 0 "15000 MHz" 1 "10 MHz" 1 "none" 1 "2" 0 "0" 0>
  <NutmegEq NutmegEq1 1 690 270 -30 18 0 0 "fft" 1 "rf_dB=19+db(v(rf))" 1>
  <Vac V7 2 110 150 -92 -26 1 1 "0.015 V" 1 "4932 MHz" 0 "0" 0 "0" 0>
  <Vac V8 2 110 230 -83 -26 1 1 "0.14 V" 1 "7398 MHz" 0 "0" 0 "0" 0>
  <Vac V9 2 110 290 -92 -26 1 1 "0.004 V" 1 "9864 MHz" 0 "0" 0 "0" 0>
  <Vac V10 2 110 360 -92 -26 1 1 "0.015 V" 1 "12330 MHz" 0 "0" 0 "0" 0>
  <Vac V6 1 110 80 -83 -26 1 1 "0.42 V" 1 "2466 MHz" 0 "0" 0 "0" 0>
</Components>
<Wires>
  <290 240 290 250 "" 0 0 0 "">
  <290 170 290 180 "" 0 0 0 "">
  <290 80 290 110 "" 0 0 0 "">
  <180 40 240 40 "IF" 240 10 50 "">
  <110 40 110 50 "" 0 0 0 "">
  <110 40 120 40 "" 0 0 0 "">
  <750 150 750 190 "" 0 0 0 "">
  <750 60 750 90 "" 0 0 0 "">
  <610 60 750 60 "RF" 750 20 130 "">
  <610 60 610 90 "" 0 0 0 "">
  <610 150 610 190 "" 0 0 0 "">
  <110 180 110 200 "" 0 0 0 "">
  <110 110 110 120 "" 0 0 0 "">
  <110 390 110 400 "" 0 0 0 "">
  <110 320 110 330 "" 0 0 0 "">
  <290 80 290 80 "LO" 300 50 0 "">
</Wires>
<Diagrams>
  <Rect 104 1036 1154 556 3 #c0c0c0 3 00 1 0 1e+09 1.5305e+10 0 -60 5 2 1 -1 0.2 1 315 0 225 1 0 0 "" "" "">
	<"ngspice/ac.rf_db" #aa5500 2 3 0 0 0>
	  <Mkr 2.46909e+09 356 -491 3 0 0>
	  <Mkr 2.68156e+09 362 -371 3 0 0>
	  <Mkr 2.24929e+09 -200 -609 3 0 0>
	  <Mkr 1.81701e+09 -183 -512 3 0 0>
	  <Mkr 3.11383e+09 355 -276 3 0 0>
	  <Mkr 1.38474e+09 -246 -421 3 0 0>
	  <Mkr 9.52467e+08 -248 -273 3 0 0>
	  <Mkr 3.54611e+09 357 -207 3 0 0>
  </Rect>
</Diagrams>
<Paintings>
  <Text 400 20 12 #000000 0 "+14dBm, 1.585V\n-28dBm, 0.015V\n-7dBm, 0.14V\n-38dBm, 0.004V\n-27dBm, 0.015V">
  <Text 400 160 12 #000000 0 "-13dBm, 0.07V ">
</Paintings>
