(footprint "bottom-emi-shield"
	(version 20240108)
	(generator "pcbnew")
	(generator_version "8.0")
	(layer "F.Cu")
	(descr "SatNOGS COMMS EMI Shield, https://gitlab.com/librespacefoundation/satnogs-comms")
	(tags "Shield Aluminium")
	(property "Reference" "REF**"
		(at 0 1 0)
		(layer "F.SilkS")
		(uuid "a1b6b5e7-13ed-44fe-b5a6-02d07bc427c4")
		(effects
			(font
				(size 1 1)
				(thickness 0.15)
			)
		)
	)
	(property "Value" "bottom-emi-shield"
		(at 0 -1 0)
		(layer "F.Fab")
		(uuid "984b7710-e1ef-448c-8e0b-5954ddf7ba09")
		(effects
			(font
				(size 1 1)
				(thickness 0.15)
			)
		)
	)
	(property "Footprint" ""
		(at 0 0 0)
		(layer "F.Fab")
		(hide yes)
		(uuid "29368d48-c7b1-4c9d-bea5-e029fd298927")
		(effects
			(font
				(size 1.27 1.27)
				(thickness 0.15)
			)
		)
	)
	(property "Datasheet" ""
		(at 0 0 0)
		(layer "F.Fab")
		(hide yes)
		(uuid "19fbfaba-eba9-4809-b51b-f05224ed73c7")
		(effects
			(font
				(size 1.27 1.27)
				(thickness 0.15)
			)
		)
	)
	(property "Description" ""
		(at 0 0 0)
		(layer "F.Fab")
		(hide yes)
		(uuid "0f90873c-721e-41a8-a4f4-327eb7f3b73c")
		(effects
			(font
				(size 1.27 1.27)
				(thickness 0.15)
			)
		)
	)
	(fp_rect
		(start -1 -91)
		(end 89 1)
		(stroke
			(width 0.1)
			(type default)
		)
		(fill none)
		(layer "F.Fab")
		(uuid "130fbeba-2364-47bd-b3e7-006fdb16f9e4")
	)
	(fp_text user "${REFERENCE}"
		(at 0 1 0)
		(layer "F.Fab")
		(uuid "f700d6eb-9550-4c98-a291-049a1515e5b1")
		(effects
			(font
				(size 1 1)
				(thickness 0.15)
			)
		)
	)
	(pad "1" smd custom
		(at 62.114 -88.01)
		(size 1.432 1.432)
		(property pad_prop_heatsink)
		(layers "F.Cu" "F.Mask")
		(thermal_bridge_angle 90)
		(options
			(clearance outline)
			(anchor circle)
		)
		(primitives
			(gr_poly
				(pts
					(xy -53.788 79.536) (xy -53.556 79.712) (xy -53.343 79.909) (xy -53.149 80.126) (xy -52.978 80.361)
					(xy -52.83 80.612) (xy -52.707 80.875) (xy -52.61 81.15) (xy -52.54 81.432) (xy -52.498 81.72)
					(xy -52.484 82.01) (xy -52.484 85.01) (xy -52.467 85.271) (xy -52.416 85.528) (xy -52.332 85.776)
					(xy -52.216 86.01) (xy -52.071 86.228) (xy -51.898 86.424) (xy -51.701 86.597) (xy -51.484 86.742)
					(xy -51.249 86.858) (xy -51.002 86.942) (xy -50.745 86.993) (xy -50.484 87.01) (xy -48.984 87.01)
					(xy -48.742 86.996) (xy -48.503 86.952) (xy -48.272 86.879) (xy -48.051 86.779) (xy -47.844 86.653)
					(xy -47.653 86.503) (xy -47.482 86.331) (xy -47.333 86.14) (xy -47.209 85.932) (xy -47.11 85.71)
					(xy -47.012 85.489) (xy -46.887 85.281) (xy -46.738 85.089) (xy -46.568 84.917) (xy -46.377 84.767)
					(xy -46.17 84.641) (xy -45.949 84.541) (xy -45.717 84.469) (xy -45.479 84.425) (xy -45.237 84.41)
					(xy -38.879 84.41) (xy -38.65 84.397) (xy -38.423 84.358) (xy -38.203 84.293) (xy -37.991 84.203)
					(xy -37.792 84.089) (xy -37.606 83.953) (xy -37.438 83.797) (xy -37.288 83.623) (xy -37.139 83.448)
					(xy -36.97 83.292) (xy -36.785 83.156) (xy -36.585 83.043) (xy -36.374 82.953) (xy -36.153 82.888)
					(xy -35.927 82.848) (xy -35.698 82.835) (xy -35.429 82.853) (xy -35.166 82.907) (xy -34.912 82.996)
					(xy -34.672 83.118) (xy -34.451 83.271) (xy -34.253 83.452) (xy -34.08 83.658) (xy -33.937 83.886)
					(xy -33.826 84.131) (xy -33.748 84.388) (xy -33.706 84.654) (xy -33.7 84.923) (xy -33.693 85.191)
					(xy -33.651 85.457) (xy -33.573 85.715) (xy -33.462 85.959) (xy -33.319 86.187) (xy -33.146 86.393)
					(xy -32.948 86.574) (xy -32.727 86.728) (xy -32.487 86.85) (xy -32.233 86.938) (xy -31.97 86.992)
					(xy -31.702 87.01) (xy -27.076 87.01) (xy -26.839 86.996) (xy -26.606 86.954) (xy -26.379 86.885)
					(xy -26.161 86.789) (xy -25.957 86.668) (xy -25.769 86.524) (xy -25.599 86.358) (xy -25.449 86.173)
					(xy -25.323 85.972) (xy -25.221 85.758) (xy -25.12 85.543) (xy -24.993 85.342) (xy -24.844 85.158)
					(xy -24.674 84.992) (xy -24.485 84.848) (xy -24.281 84.727) (xy -24.064 84.631) (xy -23.837 84.561)
					(xy -23.603 84.519) (xy -23.366 84.505) (xy -6.114 84.505) (xy -6.114 86.105) (xy -23.366 86.105)
					(xy -23.552 86.124) (xy -23.731 86.178) (xy -23.895 86.266) (xy -24.04 86.384) (xy -24.158 86.529)
					(xy -24.246 86.693) (xy -24.3 86.872) (xy -24.319 87.058) (xy -24.337 87.244) (xy -24.391 87.422)
					(xy -24.479 87.587) (xy -24.598 87.731) (xy -24.742 87.85) (xy -24.907 87.938) (xy -25.085 87.992)
					(xy -25.271 88.01) (xy -39.762 88.01) (xy -39.762 87.009) (xy -39.781 86.824) (xy -39.835 86.645)
					(xy -39.923 86.48) (xy -40.041 86.336) (xy -40.186 86.217) (xy -40.35 86.129) (xy -40.529 86.075)
					(xy -40.715 86.057) (xy -41.212 86.057) (xy -44.712 86.057) (xy -45.21 86.057) (xy -45.396 86.075)
					(xy -45.574 86.129) (xy -45.739 86.217) (xy -45.883 86.336) (xy -46.002 86.48) (xy -46.09 86.645)
					(xy -46.144 86.824) (xy -46.162 87.009) (xy -46.163 88.01) (xy -53.984 88.01) (xy -53.984 82.93)
					(xy -53.999 82.624) (xy -54.045 82.321) (xy -54.122 82.023) (xy -54.228 81.736) (xy -54.362 81.46)
					(xy -54.523 81.199) (xy -54.71 80.955) (xy -54.92 80.732) (xy -55.151 80.531) (xy -55.402 80.354)
					(xy -55.669 80.203) (xy -55.95 80.079) (xy -56.242 79.985) (xy -56.542 79.92) (xy -56.847 79.886)
					(xy -57.153 79.883) (xy -60.034 79.995) (xy -62.114 79.995) (xy -62.114 52.895) (xy -62.096 52.709)
					(xy -62.041 52.53) (xy -61.953 52.366) (xy -61.835 52.221) (xy -61.691 52.103) (xy -61.526 52.015)
					(xy -61.347 51.961) (xy -61.161 51.942) (xy -60.976 51.924) (xy -60.797 51.87) (xy -60.632 51.782)
					(xy -60.488 51.663) (xy -60.369 51.519) (xy -60.281 51.354) (xy -60.227 51.176) (xy -60.209 50.99)
					(xy -60.209 32.575) (xy -60.227 32.389) (xy -60.281 32.21) (xy -60.369 32.046) (xy -60.488 31.901)
					(xy -60.632 31.783) (xy -60.797 31.695) (xy -60.976 31.641) (xy -61.161 31.622) (xy -61.347 31.604)
					(xy -61.526 31.55) (xy -61.691 31.462) (xy -61.835 31.343) (xy -61.953 31.199) (xy -62.041 31.034)
					(xy -62.096 30.856) (xy -62.114 30.67) (xy -62.114 5.855) (xy -60.034 5.855) (xy -57.154 5.968)
					(xy -56.847 5.965) (xy -56.542 5.93) (xy -56.242 5.866) (xy -55.95 5.771) (xy -55.669 5.648) (xy -55.402 5.497)
					(xy -55.152 5.32) (xy -54.92 5.119) (xy -54.71 4.895) (xy -54.523 4.652) (xy -54.362 4.391) (xy -54.228 4.115)
					(xy -54.122 3.827) (xy -54.045 3.53) (xy -53.999 3.227) (xy -53.984 2.92) (xy -53.984 -2.16) (xy -46.163 -2.16)
					(xy -46.163 -1.147) (xy -46.144 -0.961) (xy -46.09 -0.783) (xy -46.002 -0.618) (xy -45.884 -0.474)
					(xy -45.739 -0.355) (xy -45.575 -0.267) (xy -45.396 -0.213) (xy -45.21 -0.195) (xy -44.712 -0.195)
					(xy -41.212 -0.195) (xy -40.715 -0.195) (xy -40.529 -0.213) (xy -40.35 -0.267) (xy -40.186 -0.355)
					(xy -40.041 -0.474) (xy -39.923 -0.618) (xy -39.835 -0.783) (xy -39.781 -0.961) (xy -39.762 -1.147)
					(xy -39.762 -2.16) (xy -25.271 -2.16) (xy -25.085 -2.141) (xy -24.907 -2.087) (xy -24.742 -1.999)
					(xy -24.598 -1.881) (xy -24.479 -1.736) (xy -24.391 -1.572) (xy -24.337 -1.393) (xy -24.319 -1.207)
					(xy -24.3 -1.021) (xy -24.246 -0.843) (xy -24.158 -0.678) (xy -24.04 -0.534) (xy -23.895 -0.415)
					(xy -23.731 -0.327) (xy -23.552 -0.273) (xy -23.366 -0.255) (xy -4.977 -0.255) (xy -4.791 -0.273)
					(xy -4.612 -0.327) (xy -4.447 -0.415) (xy -4.303 -0.534) (xy -4.185 -0.678) (xy -4.097 -0.843)
					(xy -4.042 -1.021) (xy -4.024 -1.207) (xy -4.006 -1.393) (xy -3.952 -1.572) (xy -3.864 -1.736)
					(xy -3.745 -1.881) (xy -3.601 -1.999) (xy -3.436 -2.087) (xy -3.257 -2.141) (xy -3.072 -2.16) (xy 1.786 -2.16)
					(xy 1.786 1.745) (xy -0.53 1.745) (xy -0.75 1.757) (xy -0.967 1.793) (xy -1.178 1.853) (xy -1.382 1.936)
					(xy -1.586 2.018) (xy -1.797 2.078) (xy -2.014 2.114) (xy -2.234 2.126) (xy -2.453 2.114) (xy -2.67 2.078)
					(xy -2.882 2.018) (xy -3.085 1.936) (xy -3.289 1.853) (xy -3.501 1.793) (xy -3.718 1.757) (xy -3.937 1.745)
					(xy -24.286 1.745) (xy -24.54 1.761) (xy -24.79 1.81) (xy -25.032 1.889) (xy -25.261 1.999) (xy -25.491 2.109)
					(xy -25.733 2.189) (xy -25.983 2.237) (xy -26.237 2.253) (xy -26.491 2.237) (xy -26.741 2.189)
					(xy -26.982 2.109) (xy -27.212 1.999) (xy -27.442 1.889) (xy -27.683 1.81) (xy -27.933 1.761) (xy -28.187 1.745)
					(xy -50.484 1.745) (xy -50.745 1.762) (xy -51.002 1.813) (xy -51.249 1.898) (xy -51.484 2.013)
					(xy -51.701 2.159) (xy -51.898 2.331) (xy -52.071 2.528) (xy -52.216 2.745) (xy -52.332 2.98) (xy -52.416 3.228)
					(xy -52.467 3.484) (xy -52.484 3.745) (xy -52.484 4.745) (xy -52.503 5.079) (xy -52.558 5.409)
					(xy -52.65 5.73) (xy -52.777 6.039) (xy -52.938 6.332) (xy -53.13 6.606) (xy -53.352 6.856) (xy -53.6 7.08)
					(xy -53.872 7.275) (xy -54.163 7.439) (xy -57.489 9.07) (xy -57.73 9.21) (xy -57.95 9.382) (xy -58.143 9.582)
					(xy -58.306 9.808) (xy -58.437 10.054) (xy -58.532 10.316) (xy -58.589 10.588) (xy -58.609 10.866)
					(xy -58.609 75.177) (xy -58.594 75.419) (xy -58.55 75.657) (xy -58.478 75.889) (xy -58.378 76.11)
					(xy -58.253 76.317) (xy -58.103 76.507) (xy -57.931 76.678) (xy -57.74 76.827)
				)
				(width 0)
				(fill yes)
			)
		)
		(uuid "63d956b9-fc3b-478a-b4a0-09d5b0b92693")
	)
	(pad "1" smd custom
		(at 85.112 -2.247)
		(size 1.772 1.772)
		(property pad_prop_heatsink)
		(layers "F.Cu" "F.Mask")
		(thermal_bridge_angle 90)
		(options
			(clearance outline)
			(anchor circle)
		)
		(primitives
			(gr_poly
				(pts
					(xy -8.112 -1.258) (xy -2.6 -1.258) (xy -2.339 -1.275) (xy -2.082 -1.326) (xy -1.835 -1.41) (xy -1.6 -1.525)
					(xy -1.383 -1.671) (xy -1.186 -1.843) (xy -1.013 -2.04) (xy -0.868 -2.258) (xy -0.752 -2.492) (xy -0.668 -2.74)
					(xy -0.617 -2.996) (xy -0.6 -3.258) (xy -0.6 -9.693) (xy 2.084 -9.693) (xy 2.685 -6.134) (xy 3.242 -2.843)
					(xy 3.242 2.247) (xy -8.112 2.247)
				)
				(width 0)
				(fill yes)
			)
		)
		(uuid "21ff1e7a-7b5b-47b3-9101-b4c5e9653959")
	)
	(pad "1" smd custom
		(at 86.097 -87.884)
		(size 1.266 1.266)
		(property pad_prop_heatsink)
		(layers "F.Cu" "F.Mask")
		(thermal_bridge_angle 90)
		(options
			(clearance outline)
			(anchor circle)
		)
		(primitives
			(gr_poly
				(pts
					(xy 2.257 1.534) (xy 2.257 -2.286) (xy -3.197 -2.286) (xy -3.197 1.657) (xy -2.932 1.728) (xy -2.679 1.836)
					(xy -2.443 1.977) (xy -2.229 2.149) (xy -2.04 2.349) (xy -1.881 2.573) (xy -1.753 2.817) (xy -1.661 3.075)
					(xy -1.604 3.344) (xy -1.585 3.619) (xy -1.585 8.384) (xy 1.099 8.384) (xy 1.7 4.825)
				)
				(width 0)
				(fill yes)
			)
		)
		(uuid "f2ea3554-732e-41dc-9716-2f6f2a7bc3c1")
	)
	(model "${KIPRJMOD}/satnogs-comms-lib.3dshapes/bottom-emi-shield.wrl"
		(offset
			(xyz 0 0 0)
		)
		(scale
			(xyz 1 1 1)
		)
		(rotate
			(xyz 0 0 0)
		)
	)
)
