%TF.GenerationSoftware,KiCad,Pcbnew,4.0.6*%
%TF.CreationDate,2017-03-18T02:14:10+02:00*%
%TF.ProjectId,hpr-telem-board,6870722D74656C656D2D626F6172642E,rev?*%
%TF.FileFunction,Legend,Bot*%
%FSLAX46Y46*%
G04 Gerber Fmt 4.6, Leading zero omitted, Abs format (unit mm)*
G04 Created by KiCad (PCBNEW 4.0.6) date Sat Mar 18 02:14:10 2017*
%MOMM*%
%LPD*%
G01*
G04 APERTURE LIST*
%ADD10C,0.100000*%
%ADD11C,0.150000*%
%ADD12C,0.120000*%
%ADD13C,0.010000*%
G04 APERTURE END LIST*
D10*
D11*
X-22339550Y4596900D02*
X-21868145Y3654092D01*
X-22810955Y4125496D01*
X-22945642Y3317374D02*
X-23012986Y3182687D01*
X-23012985Y3115343D01*
X-22979313Y3014328D01*
X-22878298Y2913312D01*
X-22777283Y2879641D01*
X-22709939Y2879641D01*
X-22608924Y2913312D01*
X-22339550Y3182687D01*
X-23046657Y3889794D01*
X-23282359Y3654091D01*
X-23316031Y3553076D01*
X-23316031Y3485732D01*
X-23282359Y3384717D01*
X-23215016Y3317374D01*
X-23114001Y3283702D01*
X-23046657Y3283702D01*
X-22945642Y3317374D01*
X-22709939Y3553076D01*
X-23215015Y2711282D02*
X-23551733Y2374564D01*
X-22945641Y2576595D02*
X-23888450Y3048000D01*
X-23417046Y2105190D01*
X-24258840Y2677610D02*
X-24662901Y2273549D01*
X-23753763Y1768473D02*
X-24460870Y2475580D01*
X-21404806Y1908301D02*
X-21371134Y2009316D01*
X-21270119Y2110331D01*
X-21135431Y2177675D01*
X-21000745Y2177675D01*
X-20899729Y2144004D01*
X-20731371Y2042988D01*
X-20630355Y1941973D01*
X-20529340Y1773614D01*
X-20495668Y1672599D01*
X-20495668Y1537912D01*
X-20563012Y1403224D01*
X-20630356Y1335881D01*
X-20765043Y1268538D01*
X-20832386Y1268538D01*
X-21068088Y1504240D01*
X-20933401Y1638926D01*
X-21068088Y898149D02*
X-21775195Y1605255D01*
X-21472149Y494087D01*
X-22179256Y1201194D01*
X-21808867Y157370D02*
X-22515973Y864477D01*
X-22684332Y696118D01*
X-22751676Y561431D01*
X-22751676Y426744D01*
X-22718004Y325729D01*
X-22616989Y157370D01*
X-22515973Y56354D01*
X-22347615Y-44661D01*
X-22246600Y-78333D01*
X-22111913Y-78333D01*
X-21977225Y-10988D01*
X-21808867Y157370D01*
X0Y6858000D02*
X24130000Y6858000D01*
X24130000Y6858000D02*
X24130000Y37338000D01*
X24130000Y37338000D02*
X-24130000Y37338000D01*
X-24130000Y37338000D02*
X-24130000Y6858000D01*
X-24130000Y6858000D02*
X0Y6858000D01*
D12*
X-24454711Y1262559D02*
X-25091107Y1050427D01*
X-24878975Y1686823D02*
X-24454711Y1262559D01*
X-25091107Y1050427D02*
X-24878975Y1686823D01*
X-25925493Y-3772041D02*
X-26151767Y-3545767D01*
X-28343798Y-6190346D02*
X-25925493Y-3772041D01*
X-28626641Y-6020641D02*
X-28343798Y-6190346D01*
X-28796346Y-5737798D02*
X-28626641Y-6020641D01*
X-26378041Y-3319493D02*
X-28796346Y-5737798D01*
X-26151767Y-3545767D02*
X-26378041Y-3319493D01*
X-27693260Y-2004274D02*
X-27919534Y-1778000D01*
X-30111565Y-4422579D02*
X-27693260Y-2004274D01*
X-30394408Y-4252874D02*
X-30111565Y-4422579D01*
X-30564113Y-3970031D02*
X-30394408Y-4252874D01*
X-28145808Y-1551726D02*
X-30564113Y-3970031D01*
X-27919534Y-1778000D02*
X-28145808Y-1551726D01*
X-28025600Y-257720D02*
X-24631487Y-3651833D01*
X-28732707Y-964827D02*
X-25338594Y-4358940D01*
X-23959736Y-2980081D02*
X-22899076Y-4040742D01*
X-27353849Y-6374194D02*
X-23959736Y-2980081D01*
X-26293188Y-7434854D02*
X-27353849Y-6374194D01*
X-27353849Y414031D02*
X-28414509Y1474691D01*
X-30747961Y-2980081D02*
X-27353849Y414031D01*
X-31808621Y-1919421D02*
X-30747961Y-2980081D01*
X-22404101Y-1424447D02*
X-23959736Y-2980081D01*
X-21343441Y-2485107D02*
X-22404101Y-1424447D01*
X-27353849Y-8495514D02*
X-21343441Y-2485107D01*
X-32869281Y-2980081D02*
X-27353849Y-8495514D01*
X-26858874Y3030326D02*
X-32869281Y-2980081D01*
X-25798214Y1969666D02*
X-26858874Y3030326D01*
X-27353849Y414031D02*
X-25798214Y1969666D01*
D11*
X21626102Y3518615D02*
X21626102Y3518615D01*
X39586615Y-14441898D02*
X21626102Y3518615D01*
X14441898Y-39586615D02*
X39586615Y-14441898D01*
X-3518615Y-21626102D02*
X14441898Y-39586615D01*
X21626102Y3518615D02*
X-3518615Y-21626102D01*
D13*
G36*
X-5226442Y-38766298D02*
X-5281908Y-38747514D01*
X-5359653Y-38733694D01*
X-5427874Y-38735180D01*
X-5494492Y-38756093D01*
X-5567425Y-38800555D01*
X-5654594Y-38872687D01*
X-5763915Y-38976610D01*
X-5809911Y-39022290D01*
X-5909910Y-39123211D01*
X-5979793Y-39196921D01*
X-6025310Y-39250765D01*
X-6052211Y-39292087D01*
X-6066246Y-39328230D01*
X-6071860Y-39356848D01*
X-6071261Y-39503091D01*
X-6028602Y-39633353D01*
X-5948504Y-39739800D01*
X-5835589Y-39814593D01*
X-5792375Y-39830848D01*
X-5684090Y-39864928D01*
X-6265504Y-40446342D01*
X-6290590Y-40367527D01*
X-6338257Y-40278290D01*
X-6417069Y-40188829D01*
X-6510916Y-40114643D01*
X-6596447Y-40073280D01*
X-6691131Y-40062710D01*
X-6796280Y-40077928D01*
X-6805840Y-40080726D01*
X-6849205Y-40095572D01*
X-6888956Y-40114494D01*
X-6931663Y-40142864D01*
X-6983895Y-40186051D01*
X-7052220Y-40249424D01*
X-7143210Y-40338353D01*
X-7244633Y-40439403D01*
X-7567618Y-40762389D01*
X-7373926Y-40956080D01*
X-6778373Y-40360526D01*
X-6678611Y-40369117D01*
X-6585867Y-40388931D01*
X-6525942Y-40435596D01*
X-6489413Y-40506249D01*
X-6477558Y-40551517D01*
X-6480097Y-40596571D01*
X-6500941Y-40647653D01*
X-6544004Y-40711006D01*
X-6613196Y-40792869D01*
X-6712430Y-40899485D01*
X-6779637Y-40969293D01*
X-7056976Y-41255422D01*
X-6969854Y-41353188D01*
X-6882732Y-41450954D01*
X-5134417Y-39702638D01*
X-5328109Y-39508947D01*
X-5430515Y-39601477D01*
X-5514814Y-39652496D01*
X-5587990Y-39663514D01*
X-5657029Y-39636036D01*
X-5709937Y-39591433D01*
X-5760357Y-39531470D01*
X-5778207Y-39476059D01*
X-5776297Y-39428337D01*
X-5767638Y-39383614D01*
X-5748637Y-39343144D01*
X-5711750Y-39296705D01*
X-5649433Y-39234074D01*
X-5595514Y-39183370D01*
X-5513018Y-39108254D01*
X-5455787Y-39062012D01*
X-5413717Y-39038446D01*
X-5376707Y-39031364D01*
X-5349842Y-39032744D01*
X-5263049Y-39063961D01*
X-5188725Y-39129310D01*
X-5158197Y-39178982D01*
X-5152518Y-39252709D01*
X-5192404Y-39345194D01*
X-5277535Y-39455819D01*
X-5328109Y-39508947D01*
X-5134417Y-39702638D01*
X-4697458Y-39265679D01*
X-4794303Y-39168834D01*
X-4854747Y-39112987D01*
X-4892911Y-39091153D01*
X-4917538Y-39098383D01*
X-4918014Y-39098852D01*
X-4937649Y-39110415D01*
X-4953678Y-39090844D01*
X-4971928Y-39038312D01*
X-5028170Y-38929626D01*
X-5118193Y-38834090D01*
X-5226442Y-38766298D01*
X-5226442Y-38766298D01*
G37*
X-5226442Y-38766298D02*
X-5281908Y-38747514D01*
X-5359653Y-38733694D01*
X-5427874Y-38735180D01*
X-5494492Y-38756093D01*
X-5567425Y-38800555D01*
X-5654594Y-38872687D01*
X-5763915Y-38976610D01*
X-5809911Y-39022290D01*
X-5909910Y-39123211D01*
X-5979793Y-39196921D01*
X-6025310Y-39250765D01*
X-6052211Y-39292087D01*
X-6066246Y-39328230D01*
X-6071860Y-39356848D01*
X-6071261Y-39503091D01*
X-6028602Y-39633353D01*
X-5948504Y-39739800D01*
X-5835589Y-39814593D01*
X-5792375Y-39830848D01*
X-5684090Y-39864928D01*
X-6265504Y-40446342D01*
X-6290590Y-40367527D01*
X-6338257Y-40278290D01*
X-6417069Y-40188829D01*
X-6510916Y-40114643D01*
X-6596447Y-40073280D01*
X-6691131Y-40062710D01*
X-6796280Y-40077928D01*
X-6805840Y-40080726D01*
X-6849205Y-40095572D01*
X-6888956Y-40114494D01*
X-6931663Y-40142864D01*
X-6983895Y-40186051D01*
X-7052220Y-40249424D01*
X-7143210Y-40338353D01*
X-7244633Y-40439403D01*
X-7567618Y-40762389D01*
X-7373926Y-40956080D01*
X-6778373Y-40360526D01*
X-6678611Y-40369117D01*
X-6585867Y-40388931D01*
X-6525942Y-40435596D01*
X-6489413Y-40506249D01*
X-6477558Y-40551517D01*
X-6480097Y-40596571D01*
X-6500941Y-40647653D01*
X-6544004Y-40711006D01*
X-6613196Y-40792869D01*
X-6712430Y-40899485D01*
X-6779637Y-40969293D01*
X-7056976Y-41255422D01*
X-6969854Y-41353188D01*
X-6882732Y-41450954D01*
X-5134417Y-39702638D01*
X-5328109Y-39508947D01*
X-5430515Y-39601477D01*
X-5514814Y-39652496D01*
X-5587990Y-39663514D01*
X-5657029Y-39636036D01*
X-5709937Y-39591433D01*
X-5760357Y-39531470D01*
X-5778207Y-39476059D01*
X-5776297Y-39428337D01*
X-5767638Y-39383614D01*
X-5748637Y-39343144D01*
X-5711750Y-39296705D01*
X-5649433Y-39234074D01*
X-5595514Y-39183370D01*
X-5513018Y-39108254D01*
X-5455787Y-39062012D01*
X-5413717Y-39038446D01*
X-5376707Y-39031364D01*
X-5349842Y-39032744D01*
X-5263049Y-39063961D01*
X-5188725Y-39129310D01*
X-5158197Y-39178982D01*
X-5152518Y-39252709D01*
X-5192404Y-39345194D01*
X-5277535Y-39455819D01*
X-5328109Y-39508947D01*
X-5134417Y-39702638D01*
X-4697458Y-39265679D01*
X-4794303Y-39168834D01*
X-4854747Y-39112987D01*
X-4892911Y-39091153D01*
X-4917538Y-39098383D01*
X-4918014Y-39098852D01*
X-4937649Y-39110415D01*
X-4953678Y-39090844D01*
X-4971928Y-39038312D01*
X-5028170Y-38929626D01*
X-5118193Y-38834090D01*
X-5226442Y-38766298D01*
G36*
X-7273638Y-39344393D02*
X-7378578Y-39283659D01*
X-7481701Y-39260661D01*
X-7578675Y-39268633D01*
X-7614903Y-39277194D01*
X-7648575Y-39290439D01*
X-7685723Y-39313308D01*
X-7732381Y-39350737D01*
X-7794584Y-39407669D01*
X-7878366Y-39489041D01*
X-7989759Y-39599792D01*
X-8019234Y-39629254D01*
X-8359993Y-39970013D01*
X-8275473Y-40054533D01*
X-8217787Y-40104668D01*
X-8168360Y-40134964D01*
X-8152474Y-40139053D01*
X-8114991Y-40156175D01*
X-8097285Y-40194242D01*
X-8064082Y-40252865D01*
X-8002506Y-40324673D01*
X-7926367Y-40396373D01*
X-7849474Y-40454673D01*
X-7798082Y-40482210D01*
X-7672688Y-40509554D01*
X-7556928Y-40489247D01*
X-7445013Y-40420244D01*
X-7442491Y-40418121D01*
X-7404245Y-40376109D01*
X-7574525Y-40205828D01*
X-7635055Y-40236586D01*
X-7684991Y-40238026D01*
X-7753093Y-40208781D01*
X-7825094Y-40152289D01*
X-7886792Y-40082957D01*
X-7923981Y-40015192D01*
X-7928876Y-39990681D01*
X-7909244Y-39919667D01*
X-7864231Y-39861634D01*
X-7796527Y-39793930D01*
X-7699115Y-39891341D01*
X-7613697Y-39991007D01*
X-7563727Y-40081344D01*
X-7551545Y-40156445D01*
X-7574525Y-40205828D01*
X-7404245Y-40376109D01*
X-7348297Y-40314651D01*
X-7302753Y-40203914D01*
X-7304942Y-40083539D01*
X-7308037Y-40069693D01*
X-7326933Y-40015791D01*
X-7361386Y-39960141D01*
X-7419214Y-39892009D01*
X-7492848Y-39816005D01*
X-7655660Y-39653063D01*
X-7587382Y-39584785D01*
X-7527497Y-39538718D01*
X-7474376Y-39520858D01*
X-7470422Y-39521032D01*
X-7415663Y-39544739D01*
X-7350423Y-39597945D01*
X-7287930Y-39666352D01*
X-7241420Y-39735662D01*
X-7224155Y-39787124D01*
X-7219232Y-39819439D01*
X-7202185Y-39841716D01*
X-7163829Y-39857629D01*
X-7094979Y-39870854D01*
X-6986449Y-39885069D01*
X-6976398Y-39886284D01*
X-6962939Y-39867052D01*
X-6959832Y-39815785D01*
X-6966220Y-39748975D01*
X-6981244Y-39683113D01*
X-6987949Y-39664405D01*
X-7022320Y-39606078D01*
X-7081693Y-39529619D01*
X-7154144Y-39450312D01*
X-7157685Y-39446757D01*
X-7273638Y-39344393D01*
X-7273638Y-39344393D01*
G37*
X-7273638Y-39344393D02*
X-7378578Y-39283659D01*
X-7481701Y-39260661D01*
X-7578675Y-39268633D01*
X-7614903Y-39277194D01*
X-7648575Y-39290439D01*
X-7685723Y-39313308D01*
X-7732381Y-39350737D01*
X-7794584Y-39407669D01*
X-7878366Y-39489041D01*
X-7989759Y-39599792D01*
X-8019234Y-39629254D01*
X-8359993Y-39970013D01*
X-8275473Y-40054533D01*
X-8217787Y-40104668D01*
X-8168360Y-40134964D01*
X-8152474Y-40139053D01*
X-8114991Y-40156175D01*
X-8097285Y-40194242D01*
X-8064082Y-40252865D01*
X-8002506Y-40324673D01*
X-7926367Y-40396373D01*
X-7849474Y-40454673D01*
X-7798082Y-40482210D01*
X-7672688Y-40509554D01*
X-7556928Y-40489247D01*
X-7445013Y-40420244D01*
X-7442491Y-40418121D01*
X-7404245Y-40376109D01*
X-7574525Y-40205828D01*
X-7635055Y-40236586D01*
X-7684991Y-40238026D01*
X-7753093Y-40208781D01*
X-7825094Y-40152289D01*
X-7886792Y-40082957D01*
X-7923981Y-40015192D01*
X-7928876Y-39990681D01*
X-7909244Y-39919667D01*
X-7864231Y-39861634D01*
X-7796527Y-39793930D01*
X-7699115Y-39891341D01*
X-7613697Y-39991007D01*
X-7563727Y-40081344D01*
X-7551545Y-40156445D01*
X-7574525Y-40205828D01*
X-7404245Y-40376109D01*
X-7348297Y-40314651D01*
X-7302753Y-40203914D01*
X-7304942Y-40083539D01*
X-7308037Y-40069693D01*
X-7326933Y-40015791D01*
X-7361386Y-39960141D01*
X-7419214Y-39892009D01*
X-7492848Y-39816005D01*
X-7655660Y-39653063D01*
X-7587382Y-39584785D01*
X-7527497Y-39538718D01*
X-7474376Y-39520858D01*
X-7470422Y-39521032D01*
X-7415663Y-39544739D01*
X-7350423Y-39597945D01*
X-7287930Y-39666352D01*
X-7241420Y-39735662D01*
X-7224155Y-39787124D01*
X-7219232Y-39819439D01*
X-7202185Y-39841716D01*
X-7163829Y-39857629D01*
X-7094979Y-39870854D01*
X-6986449Y-39885069D01*
X-6976398Y-39886284D01*
X-6962939Y-39867052D01*
X-6959832Y-39815785D01*
X-6966220Y-39748975D01*
X-6981244Y-39683113D01*
X-6987949Y-39664405D01*
X-7022320Y-39606078D01*
X-7081693Y-39529619D01*
X-7154144Y-39450312D01*
X-7157685Y-39446757D01*
X-7273638Y-39344393D01*
G36*
X-7816019Y-38792111D02*
X-7850269Y-38773659D01*
X-7876117Y-38782518D01*
X-7884309Y-38789994D01*
X-7907654Y-38810292D01*
X-7921578Y-38803219D01*
X-7934977Y-38759900D01*
X-7941602Y-38732834D01*
X-7972858Y-38657800D01*
X-8025510Y-38583501D01*
X-8091233Y-38516114D01*
X-8161701Y-38461813D01*
X-8228589Y-38426775D01*
X-8283570Y-38417175D01*
X-8318318Y-38439187D01*
X-8322791Y-38450087D01*
X-8331267Y-38505419D01*
X-8334177Y-38580986D01*
X-8333949Y-38593900D01*
X-8328489Y-38657694D01*
X-8308037Y-38696994D01*
X-8259677Y-38732200D01*
X-8238568Y-38744568D01*
X-8175983Y-38786161D01*
X-8144079Y-38827505D01*
X-8129797Y-38875082D01*
X-8123807Y-38925756D01*
X-8131039Y-38974721D01*
X-8155750Y-39028434D01*
X-8202200Y-39093354D01*
X-8274649Y-39175940D01*
X-8377353Y-39282649D01*
X-8440377Y-39346062D01*
X-8712161Y-39617846D01*
X-8536077Y-39793930D01*
X-7673268Y-38931121D01*
X-7761310Y-38843079D01*
X-7816019Y-38792111D01*
X-7816019Y-38792111D01*
G37*
X-7816019Y-38792111D02*
X-7850269Y-38773659D01*
X-7876117Y-38782518D01*
X-7884309Y-38789994D01*
X-7907654Y-38810292D01*
X-7921578Y-38803219D01*
X-7934977Y-38759900D01*
X-7941602Y-38732834D01*
X-7972858Y-38657800D01*
X-8025510Y-38583501D01*
X-8091233Y-38516114D01*
X-8161701Y-38461813D01*
X-8228589Y-38426775D01*
X-8283570Y-38417175D01*
X-8318318Y-38439187D01*
X-8322791Y-38450087D01*
X-8331267Y-38505419D01*
X-8334177Y-38580986D01*
X-8333949Y-38593900D01*
X-8328489Y-38657694D01*
X-8308037Y-38696994D01*
X-8259677Y-38732200D01*
X-8238568Y-38744568D01*
X-8175983Y-38786161D01*
X-8144079Y-38827505D01*
X-8129797Y-38875082D01*
X-8123807Y-38925756D01*
X-8131039Y-38974721D01*
X-8155750Y-39028434D01*
X-8202200Y-39093354D01*
X-8274649Y-39175940D01*
X-8377353Y-39282649D01*
X-8440377Y-39346062D01*
X-8712161Y-39617846D01*
X-8536077Y-39793930D01*
X-7673268Y-38931121D01*
X-7761310Y-38843079D01*
X-7816019Y-38792111D01*
G36*
X-9786269Y-38543737D02*
X-9689423Y-38640583D01*
X-9631563Y-38695147D01*
X-9595461Y-38717598D01*
X-9570097Y-38713316D01*
X-9559259Y-38704110D01*
X-9537382Y-38685789D01*
X-9522318Y-38693143D01*
X-9505251Y-38734991D01*
X-9493906Y-38769463D01*
X-9433361Y-38884811D01*
X-9339344Y-38982000D01*
X-9241183Y-39039288D01*
X-9119429Y-39062294D01*
X-8991379Y-39044589D01*
X-8875207Y-38988841D01*
X-8869632Y-38984804D01*
X-8812704Y-38936854D01*
X-8735192Y-38863806D01*
X-8678437Y-38806692D01*
X-8870779Y-38614349D01*
X-8950908Y-38685566D01*
X-9023417Y-38737803D01*
X-9072361Y-38759303D01*
X-9172408Y-38755525D01*
X-9251300Y-38711143D01*
X-9300908Y-38633627D01*
X-9313601Y-38537690D01*
X-9306178Y-38489126D01*
X-9284800Y-38443694D01*
X-9241674Y-38389301D01*
X-9169824Y-38314675D01*
X-9094814Y-38244632D01*
X-9024531Y-38187469D01*
X-8972587Y-38154124D01*
X-8967215Y-38151852D01*
X-8884269Y-38143910D01*
X-8804582Y-38173698D01*
X-8739309Y-38230915D01*
X-8699602Y-38305260D01*
X-8696618Y-38386436D01*
X-8700032Y-38398579D01*
X-8733804Y-38459678D01*
X-8794565Y-38535328D01*
X-8870779Y-38614349D01*
X-8678437Y-38806692D01*
X-8649659Y-38777732D01*
X-8604745Y-38730287D01*
X-8499115Y-38607433D01*
X-8431240Y-38503761D01*
X-8397606Y-38410577D01*
X-8394696Y-38319186D01*
X-8409969Y-38248558D01*
X-8450520Y-38169093D01*
X-8518483Y-38087784D01*
X-8600344Y-38016793D01*
X-8682592Y-37968283D01*
X-8737316Y-37953920D01*
X-8805660Y-37950511D01*
X-8395210Y-37540061D01*
X-8588901Y-37346369D01*
X-9786269Y-38543737D01*
X-9786269Y-38543737D01*
G37*
X-9786269Y-38543737D02*
X-9689423Y-38640583D01*
X-9631563Y-38695147D01*
X-9595461Y-38717598D01*
X-9570097Y-38713316D01*
X-9559259Y-38704110D01*
X-9537382Y-38685789D01*
X-9522318Y-38693143D01*
X-9505251Y-38734991D01*
X-9493906Y-38769463D01*
X-9433361Y-38884811D01*
X-9339344Y-38982000D01*
X-9241183Y-39039288D01*
X-9119429Y-39062294D01*
X-8991379Y-39044589D01*
X-8875207Y-38988841D01*
X-8869632Y-38984804D01*
X-8812704Y-38936854D01*
X-8735192Y-38863806D01*
X-8678437Y-38806692D01*
X-8870779Y-38614349D01*
X-8950908Y-38685566D01*
X-9023417Y-38737803D01*
X-9072361Y-38759303D01*
X-9172408Y-38755525D01*
X-9251300Y-38711143D01*
X-9300908Y-38633627D01*
X-9313601Y-38537690D01*
X-9306178Y-38489126D01*
X-9284800Y-38443694D01*
X-9241674Y-38389301D01*
X-9169824Y-38314675D01*
X-9094814Y-38244632D01*
X-9024531Y-38187469D01*
X-8972587Y-38154124D01*
X-8967215Y-38151852D01*
X-8884269Y-38143910D01*
X-8804582Y-38173698D01*
X-8739309Y-38230915D01*
X-8699602Y-38305260D01*
X-8696618Y-38386436D01*
X-8700032Y-38398579D01*
X-8733804Y-38459678D01*
X-8794565Y-38535328D01*
X-8870779Y-38614349D01*
X-8678437Y-38806692D01*
X-8649659Y-38777732D01*
X-8604745Y-38730287D01*
X-8499115Y-38607433D01*
X-8431240Y-38503761D01*
X-8397606Y-38410577D01*
X-8394696Y-38319186D01*
X-8409969Y-38248558D01*
X-8450520Y-38169093D01*
X-8518483Y-38087784D01*
X-8600344Y-38016793D01*
X-8682592Y-37968283D01*
X-8737316Y-37953920D01*
X-8805660Y-37950511D01*
X-8395210Y-37540061D01*
X-8588901Y-37346369D01*
X-9786269Y-38543737D01*
G36*
X-9603002Y-37008538D02*
X-9677870Y-36944127D01*
X-10041848Y-37126007D01*
X-10405825Y-37307888D01*
X-10337528Y-37182494D01*
X-10294856Y-37105463D01*
X-10236572Y-37001981D01*
X-10172069Y-36888670D01*
X-10137283Y-36828076D01*
X-10005336Y-36599053D01*
X-10205590Y-36398799D01*
X-10335022Y-36647946D01*
X-10398648Y-36770525D01*
X-10475340Y-36918439D01*
X-10555297Y-37072774D01*
X-10626548Y-37210424D01*
X-10788643Y-37523755D01*
X-10635975Y-37697670D01*
X-10445524Y-37595764D01*
X-10327414Y-37532260D01*
X-10197510Y-37461948D01*
X-10083055Y-37399575D01*
X-10078508Y-37397084D01*
X-9999149Y-37356626D01*
X-9941112Y-37332911D01*
X-9913635Y-37329474D01*
X-9912952Y-37333731D01*
X-9928247Y-37366364D01*
X-9963107Y-37434168D01*
X-10013082Y-37528684D01*
X-10073724Y-37641451D01*
X-10107315Y-37703245D01*
X-10290668Y-38039339D01*
X-10128587Y-38201419D01*
X-9589623Y-37921595D01*
X-9438383Y-37843153D01*
X-9300934Y-37772021D01*
X-9183742Y-37711529D01*
X-9093271Y-37665012D01*
X-9035986Y-37635802D01*
X-9019085Y-37627434D01*
X-9009524Y-37611118D01*
X-9030381Y-37578929D01*
X-9086144Y-37524301D01*
X-9095212Y-37516089D01*
X-9202915Y-37419082D01*
X-9516468Y-37598562D01*
X-9631013Y-37663825D01*
X-9732065Y-37720838D01*
X-9810822Y-37764676D01*
X-9858485Y-37790415D01*
X-9866494Y-37794373D01*
X-9868007Y-37779099D01*
X-9849284Y-37726524D01*
X-9813235Y-37643444D01*
X-9762769Y-37536657D01*
X-9715550Y-37441827D01*
X-9528134Y-37072952D01*
X-9603002Y-37008538D01*
X-9603002Y-37008538D01*
G37*
X-9603002Y-37008538D02*
X-9677870Y-36944127D01*
X-10041848Y-37126007D01*
X-10405825Y-37307888D01*
X-10337528Y-37182494D01*
X-10294856Y-37105463D01*
X-10236572Y-37001981D01*
X-10172069Y-36888670D01*
X-10137283Y-36828076D01*
X-10005336Y-36599053D01*
X-10205590Y-36398799D01*
X-10335022Y-36647946D01*
X-10398648Y-36770525D01*
X-10475340Y-36918439D01*
X-10555297Y-37072774D01*
X-10626548Y-37210424D01*
X-10788643Y-37523755D01*
X-10635975Y-37697670D01*
X-10445524Y-37595764D01*
X-10327414Y-37532260D01*
X-10197510Y-37461948D01*
X-10083055Y-37399575D01*
X-10078508Y-37397084D01*
X-9999149Y-37356626D01*
X-9941112Y-37332911D01*
X-9913635Y-37329474D01*
X-9912952Y-37333731D01*
X-9928247Y-37366364D01*
X-9963107Y-37434168D01*
X-10013082Y-37528684D01*
X-10073724Y-37641451D01*
X-10107315Y-37703245D01*
X-10290668Y-38039339D01*
X-10128587Y-38201419D01*
X-9589623Y-37921595D01*
X-9438383Y-37843153D01*
X-9300934Y-37772021D01*
X-9183742Y-37711529D01*
X-9093271Y-37665012D01*
X-9035986Y-37635802D01*
X-9019085Y-37627434D01*
X-9009524Y-37611118D01*
X-9030381Y-37578929D01*
X-9086144Y-37524301D01*
X-9095212Y-37516089D01*
X-9202915Y-37419082D01*
X-9516468Y-37598562D01*
X-9631013Y-37663825D01*
X-9732065Y-37720838D01*
X-9810822Y-37764676D01*
X-9858485Y-37790415D01*
X-9866494Y-37794373D01*
X-9868007Y-37779099D01*
X-9849284Y-37726524D01*
X-9813235Y-37643444D01*
X-9762769Y-37536657D01*
X-9715550Y-37441827D01*
X-9528134Y-37072952D01*
X-9603002Y-37008538D01*
G36*
X-10664559Y-35950287D02*
X-10756804Y-35894095D01*
X-10787809Y-35882191D01*
X-10854411Y-35865620D01*
X-10914500Y-35861878D01*
X-10974341Y-35874488D01*
X-11040193Y-35906971D01*
X-11118319Y-35962849D01*
X-11214982Y-36045644D01*
X-11336442Y-36158877D01*
X-11416387Y-36235697D01*
X-11761097Y-36568910D01*
X-11662904Y-36667102D01*
X-11600837Y-36724173D01*
X-11561610Y-36746328D01*
X-11539343Y-36739925D01*
X-11519656Y-36728613D01*
X-11503897Y-36750299D01*
X-11490812Y-36788240D01*
X-11445994Y-36871159D01*
X-11369043Y-36958377D01*
X-11274310Y-37036316D01*
X-11176149Y-37091397D01*
X-11166287Y-37095280D01*
X-11047065Y-37116113D01*
X-10932511Y-37093889D01*
X-10831330Y-37035192D01*
X-10804233Y-37004849D01*
X-10977543Y-36831539D01*
X-11031464Y-36854919D01*
X-11104438Y-36837340D01*
X-11192351Y-36779156D01*
X-11233364Y-36742092D01*
X-11293370Y-36671980D01*
X-11316979Y-36609096D01*
X-11318195Y-36589211D01*
X-11295997Y-36509843D01*
X-11256566Y-36457148D01*
X-11194937Y-36395519D01*
X-11109096Y-36481360D01*
X-11014398Y-36586229D01*
X-10960405Y-36672216D01*
X-10944198Y-36744453D01*
X-10946787Y-36766844D01*
X-10977543Y-36831539D01*
X-10804233Y-37004849D01*
X-10752219Y-36946604D01*
X-10703879Y-36834711D01*
X-10693093Y-36737211D01*
X-10695944Y-36687544D01*
X-10706267Y-36646453D01*
X-10730336Y-36603626D01*
X-10774424Y-36548743D01*
X-10844805Y-36471492D01*
X-10873095Y-36441226D01*
X-11050864Y-36251446D01*
X-10994971Y-36196092D01*
X-10929384Y-36144740D01*
X-10868299Y-36135119D01*
X-10793727Y-36164517D01*
X-10791931Y-36165509D01*
X-10709345Y-36230333D01*
X-10648823Y-36314056D01*
X-10623429Y-36395864D01*
X-10615850Y-36431299D01*
X-10590760Y-36452535D01*
X-10534935Y-36468002D01*
X-10499761Y-36474692D01*
X-10428391Y-36485206D01*
X-10380221Y-36487758D01*
X-10369622Y-36485298D01*
X-10352585Y-36434747D01*
X-10361738Y-36344880D01*
X-10369626Y-36309758D01*
X-10407997Y-36224485D01*
X-10478028Y-36127881D01*
X-10567591Y-36032348D01*
X-10664559Y-35950287D01*
X-10664559Y-35950287D01*
G37*
X-10664559Y-35950287D02*
X-10756804Y-35894095D01*
X-10787809Y-35882191D01*
X-10854411Y-35865620D01*
X-10914500Y-35861878D01*
X-10974341Y-35874488D01*
X-11040193Y-35906971D01*
X-11118319Y-35962849D01*
X-11214982Y-36045644D01*
X-11336442Y-36158877D01*
X-11416387Y-36235697D01*
X-11761097Y-36568910D01*
X-11662904Y-36667102D01*
X-11600837Y-36724173D01*
X-11561610Y-36746328D01*
X-11539343Y-36739925D01*
X-11519656Y-36728613D01*
X-11503897Y-36750299D01*
X-11490812Y-36788240D01*
X-11445994Y-36871159D01*
X-11369043Y-36958377D01*
X-11274310Y-37036316D01*
X-11176149Y-37091397D01*
X-11166287Y-37095280D01*
X-11047065Y-37116113D01*
X-10932511Y-37093889D01*
X-10831330Y-37035192D01*
X-10804233Y-37004849D01*
X-10977543Y-36831539D01*
X-11031464Y-36854919D01*
X-11104438Y-36837340D01*
X-11192351Y-36779156D01*
X-11233364Y-36742092D01*
X-11293370Y-36671980D01*
X-11316979Y-36609096D01*
X-11318195Y-36589211D01*
X-11295997Y-36509843D01*
X-11256566Y-36457148D01*
X-11194937Y-36395519D01*
X-11109096Y-36481360D01*
X-11014398Y-36586229D01*
X-10960405Y-36672216D01*
X-10944198Y-36744453D01*
X-10946787Y-36766844D01*
X-10977543Y-36831539D01*
X-10804233Y-37004849D01*
X-10752219Y-36946604D01*
X-10703879Y-36834711D01*
X-10693093Y-36737211D01*
X-10695944Y-36687544D01*
X-10706267Y-36646453D01*
X-10730336Y-36603626D01*
X-10774424Y-36548743D01*
X-10844805Y-36471492D01*
X-10873095Y-36441226D01*
X-11050864Y-36251446D01*
X-10994971Y-36196092D01*
X-10929384Y-36144740D01*
X-10868299Y-36135119D01*
X-10793727Y-36164517D01*
X-10791931Y-36165509D01*
X-10709345Y-36230333D01*
X-10648823Y-36314056D01*
X-10623429Y-36395864D01*
X-10615850Y-36431299D01*
X-10590760Y-36452535D01*
X-10534935Y-36468002D01*
X-10499761Y-36474692D01*
X-10428391Y-36485206D01*
X-10380221Y-36487758D01*
X-10369622Y-36485298D01*
X-10352585Y-36434747D01*
X-10361738Y-36344880D01*
X-10369626Y-36309758D01*
X-10407997Y-36224485D01*
X-10478028Y-36127881D01*
X-10567591Y-36032348D01*
X-10664559Y-35950287D01*
G36*
X-11494844Y-35108990D02*
X-11575881Y-35054642D01*
X-11634178Y-35035865D01*
X-11707543Y-35028152D01*
X-11722690Y-35158652D01*
X-11731230Y-35238314D01*
X-11728599Y-35283977D01*
X-11707888Y-35311261D01*
X-11662190Y-35335790D01*
X-11639719Y-35346284D01*
X-11563685Y-35404647D01*
X-11521084Y-35485126D01*
X-11518691Y-35573092D01*
X-11524994Y-35594074D01*
X-11553139Y-35638204D01*
X-11613570Y-35710972D01*
X-11701855Y-35807368D01*
X-11813563Y-35922381D01*
X-11829666Y-35938530D01*
X-12110571Y-36219435D01*
X-11916879Y-36413128D01*
X-11054070Y-35550319D01*
X-11150916Y-35453473D01*
X-11208216Y-35399089D01*
X-11243795Y-35376486D01*
X-11269244Y-35380421D01*
X-11284257Y-35393121D01*
X-11320751Y-35429616D01*
X-11330652Y-35346726D01*
X-11358953Y-35268629D01*
X-11418109Y-35184851D01*
X-11494844Y-35108990D01*
X-11494844Y-35108990D01*
G37*
X-11494844Y-35108990D02*
X-11575881Y-35054642D01*
X-11634178Y-35035865D01*
X-11707543Y-35028152D01*
X-11722690Y-35158652D01*
X-11731230Y-35238314D01*
X-11728599Y-35283977D01*
X-11707888Y-35311261D01*
X-11662190Y-35335790D01*
X-11639719Y-35346284D01*
X-11563685Y-35404647D01*
X-11521084Y-35485126D01*
X-11518691Y-35573092D01*
X-11524994Y-35594074D01*
X-11553139Y-35638204D01*
X-11613570Y-35710972D01*
X-11701855Y-35807368D01*
X-11813563Y-35922381D01*
X-11829666Y-35938530D01*
X-12110571Y-36219435D01*
X-11916879Y-36413128D01*
X-11054070Y-35550319D01*
X-11150916Y-35453473D01*
X-11208216Y-35399089D01*
X-11243795Y-35376486D01*
X-11269244Y-35380421D01*
X-11284257Y-35393121D01*
X-11320751Y-35429616D01*
X-11330652Y-35346726D01*
X-11358953Y-35268629D01*
X-11418109Y-35184851D01*
X-11494844Y-35108990D01*
G36*
X-12056119Y-34557475D02*
X-12162168Y-34495191D01*
X-12277818Y-34469866D01*
X-12345686Y-34469474D01*
X-12481389Y-34493285D01*
X-12605973Y-34553742D01*
X-12730721Y-34656459D01*
X-12739971Y-34665597D01*
X-12832514Y-34757943D01*
X-12300445Y-35290011D01*
X-12360209Y-35327092D01*
X-12424543Y-35350469D01*
X-12506080Y-35360323D01*
X-12520871Y-35360123D01*
X-12624780Y-35335175D01*
X-12704949Y-35268399D01*
X-12763543Y-35157853D01*
X-12770883Y-35136522D01*
X-12793588Y-35071288D01*
X-12810923Y-35029721D01*
X-12814941Y-35023462D01*
X-12843759Y-35016405D01*
X-12904587Y-35008814D01*
X-12936500Y-35005995D01*
X-13005900Y-35003424D01*
X-13039780Y-35013671D01*
X-13051875Y-35042168D01*
X-13053040Y-35052102D01*
X-13047639Y-35106083D01*
X-13028164Y-35184595D01*
X-13011226Y-35235998D01*
X-12944593Y-35363354D01*
X-12847047Y-35480576D01*
X-12733692Y-35570617D01*
X-12696864Y-35590752D01*
X-12561471Y-35631665D01*
X-12423441Y-35624318D01*
X-12281689Y-35568382D01*
X-12135129Y-35463530D01*
X-12067109Y-35400089D01*
X-11978094Y-35297704D01*
X-12146934Y-35128864D01*
X-12170338Y-35119609D01*
X-12219785Y-35081264D01*
X-12286879Y-35020722D01*
X-12330675Y-34978047D01*
X-12407903Y-34899737D01*
X-12454457Y-34848121D01*
X-12475501Y-34815310D01*
X-12476197Y-34793412D01*
X-12463016Y-34775829D01*
X-12400536Y-34743541D01*
X-12315699Y-34734717D01*
X-12229758Y-34748771D01*
X-12165039Y-34784083D01*
X-12110148Y-34865060D01*
X-12089048Y-34961576D01*
X-12102627Y-35056702D01*
X-12146934Y-35128864D01*
X-11978094Y-35297704D01*
X-11937486Y-35250995D01*
X-11856502Y-35109919D01*
X-11823914Y-34975345D01*
X-11839477Y-34845755D01*
X-11902945Y-34719636D01*
X-11948266Y-34662249D01*
X-12056119Y-34557475D01*
X-12056119Y-34557475D01*
G37*
X-12056119Y-34557475D02*
X-12162168Y-34495191D01*
X-12277818Y-34469866D01*
X-12345686Y-34469474D01*
X-12481389Y-34493285D01*
X-12605973Y-34553742D01*
X-12730721Y-34656459D01*
X-12739971Y-34665597D01*
X-12832514Y-34757943D01*
X-12300445Y-35290011D01*
X-12360209Y-35327092D01*
X-12424543Y-35350469D01*
X-12506080Y-35360323D01*
X-12520871Y-35360123D01*
X-12624780Y-35335175D01*
X-12704949Y-35268399D01*
X-12763543Y-35157853D01*
X-12770883Y-35136522D01*
X-12793588Y-35071288D01*
X-12810923Y-35029721D01*
X-12814941Y-35023462D01*
X-12843759Y-35016405D01*
X-12904587Y-35008814D01*
X-12936500Y-35005995D01*
X-13005900Y-35003424D01*
X-13039780Y-35013671D01*
X-13051875Y-35042168D01*
X-13053040Y-35052102D01*
X-13047639Y-35106083D01*
X-13028164Y-35184595D01*
X-13011226Y-35235998D01*
X-12944593Y-35363354D01*
X-12847047Y-35480576D01*
X-12733692Y-35570617D01*
X-12696864Y-35590752D01*
X-12561471Y-35631665D01*
X-12423441Y-35624318D01*
X-12281689Y-35568382D01*
X-12135129Y-35463530D01*
X-12067109Y-35400089D01*
X-11978094Y-35297704D01*
X-12146934Y-35128864D01*
X-12170338Y-35119609D01*
X-12219785Y-35081264D01*
X-12286879Y-35020722D01*
X-12330675Y-34978047D01*
X-12407903Y-34899737D01*
X-12454457Y-34848121D01*
X-12475501Y-34815310D01*
X-12476197Y-34793412D01*
X-12463016Y-34775829D01*
X-12400536Y-34743541D01*
X-12315699Y-34734717D01*
X-12229758Y-34748771D01*
X-12165039Y-34784083D01*
X-12110148Y-34865060D01*
X-12089048Y-34961576D01*
X-12102627Y-35056702D01*
X-12146934Y-35128864D01*
X-11978094Y-35297704D01*
X-11937486Y-35250995D01*
X-11856502Y-35109919D01*
X-11823914Y-34975345D01*
X-11839477Y-34845755D01*
X-11902945Y-34719636D01*
X-11948266Y-34662249D01*
X-12056119Y-34557475D01*
G36*
X-4339267Y-39642170D02*
X-4472111Y-39590777D01*
X-4610045Y-39588849D01*
X-4753275Y-39636390D01*
X-4902008Y-39733400D01*
X-4923045Y-39750731D01*
X-5059755Y-39884535D01*
X-5159481Y-40021923D01*
X-5217602Y-40155985D01*
X-5228180Y-40207228D01*
X-5222779Y-40343468D01*
X-5174955Y-40476033D01*
X-5091634Y-40594520D01*
X-4979739Y-40688531D01*
X-4873938Y-40739251D01*
X-4760225Y-40760141D01*
X-4644368Y-40754296D01*
X-4641993Y-40753823D01*
X-4582096Y-40738604D01*
X-4529813Y-40715354D01*
X-4473359Y-40676482D01*
X-4400952Y-40614395D01*
X-4343533Y-40561524D01*
X-4292579Y-40512462D01*
X-4468628Y-40336413D01*
X-4520131Y-40384476D01*
X-4592647Y-40444500D01*
X-4646196Y-40476010D01*
X-4696326Y-40486398D01*
X-4732612Y-40485462D01*
X-4835596Y-40456491D01*
X-4909576Y-40392404D01*
X-4947240Y-40301485D01*
X-4949547Y-40239502D01*
X-4942644Y-40186269D01*
X-4927421Y-40143949D01*
X-4895924Y-40100559D01*
X-4840195Y-40044117D01*
X-4786710Y-39994297D01*
X-4708983Y-39924453D01*
X-4654877Y-39882844D01*
X-4612399Y-39862890D01*
X-4569556Y-39858012D01*
X-4540878Y-39859418D01*
X-4442135Y-39886517D01*
X-4372470Y-39952609D01*
X-4336772Y-40030744D01*
X-4332528Y-40123608D01*
X-4376388Y-40225323D01*
X-4468628Y-40336413D01*
X-4292579Y-40512462D01*
X-4231796Y-40453939D01*
X-4153330Y-40368382D01*
X-4102270Y-40296076D01*
X-4072752Y-40228243D01*
X-4058915Y-40156106D01*
X-4056959Y-40132534D01*
X-4060939Y-40001359D01*
X-4096275Y-39891728D01*
X-4169354Y-39787522D01*
X-4211307Y-39743025D01*
X-4339267Y-39642170D01*
X-4339267Y-39642170D01*
G37*
X-4339267Y-39642170D02*
X-4472111Y-39590777D01*
X-4610045Y-39588849D01*
X-4753275Y-39636390D01*
X-4902008Y-39733400D01*
X-4923045Y-39750731D01*
X-5059755Y-39884535D01*
X-5159481Y-40021923D01*
X-5217602Y-40155985D01*
X-5228180Y-40207228D01*
X-5222779Y-40343468D01*
X-5174955Y-40476033D01*
X-5091634Y-40594520D01*
X-4979739Y-40688531D01*
X-4873938Y-40739251D01*
X-4760225Y-40760141D01*
X-4644368Y-40754296D01*
X-4641993Y-40753823D01*
X-4582096Y-40738604D01*
X-4529813Y-40715354D01*
X-4473359Y-40676482D01*
X-4400952Y-40614395D01*
X-4343533Y-40561524D01*
X-4292579Y-40512462D01*
X-4468628Y-40336413D01*
X-4520131Y-40384476D01*
X-4592647Y-40444500D01*
X-4646196Y-40476010D01*
X-4696326Y-40486398D01*
X-4732612Y-40485462D01*
X-4835596Y-40456491D01*
X-4909576Y-40392404D01*
X-4947240Y-40301485D01*
X-4949547Y-40239502D01*
X-4942644Y-40186269D01*
X-4927421Y-40143949D01*
X-4895924Y-40100559D01*
X-4840195Y-40044117D01*
X-4786710Y-39994297D01*
X-4708983Y-39924453D01*
X-4654877Y-39882844D01*
X-4612399Y-39862890D01*
X-4569556Y-39858012D01*
X-4540878Y-39859418D01*
X-4442135Y-39886517D01*
X-4372470Y-39952609D01*
X-4336772Y-40030744D01*
X-4332528Y-40123608D01*
X-4376388Y-40225323D01*
X-4468628Y-40336413D01*
X-4292579Y-40512462D01*
X-4231796Y-40453939D01*
X-4153330Y-40368382D01*
X-4102270Y-40296076D01*
X-4072752Y-40228243D01*
X-4058915Y-40156106D01*
X-4056959Y-40132534D01*
X-4060939Y-40001359D01*
X-4096275Y-39891728D01*
X-4169354Y-39787522D01*
X-4211307Y-39743025D01*
X-4339267Y-39642170D01*
G36*
X-6004322Y-37998025D02*
X-6030130Y-37988740D01*
X-6135348Y-37972495D01*
X-6257701Y-37979993D01*
X-6372070Y-38008599D01*
X-6417133Y-38029270D01*
X-6486970Y-38076852D01*
X-6564554Y-38141165D01*
X-6594658Y-38169658D01*
X-6687200Y-38262003D01*
X-6155132Y-38794071D01*
X-6214897Y-38831153D01*
X-6300006Y-38860584D01*
X-6398171Y-38861408D01*
X-6487958Y-38835388D01*
X-6531476Y-38805111D01*
X-6573481Y-38747037D01*
X-6613031Y-38667184D01*
X-6624041Y-38637631D01*
X-6661584Y-38525173D01*
X-6774412Y-38509987D01*
X-6844365Y-38506072D01*
X-6891271Y-38513674D01*
X-6900264Y-38520678D01*
X-6902094Y-38557620D01*
X-6893078Y-38625558D01*
X-6881139Y-38683466D01*
X-6828216Y-38819023D01*
X-6741266Y-38943375D01*
X-6631690Y-39043227D01*
X-6522803Y-39101282D01*
X-6382314Y-39132884D01*
X-6249483Y-39122352D01*
X-6118487Y-39067863D01*
X-5983503Y-38967598D01*
X-5928141Y-38915315D01*
X-5810966Y-38785819D01*
X-5808135Y-38781474D01*
X-5984438Y-38605171D01*
X-6000860Y-38611882D01*
X-6027195Y-38598303D01*
X-6071089Y-38559876D01*
X-6140192Y-38492039D01*
X-6166568Y-38465686D01*
X-6245826Y-38384516D01*
X-6293224Y-38330177D01*
X-6313692Y-38295927D01*
X-6312158Y-38275030D01*
X-6308899Y-38271085D01*
X-6269226Y-38253512D01*
X-6201475Y-38241071D01*
X-6175546Y-38238920D01*
X-6091701Y-38243350D01*
X-6030080Y-38273747D01*
X-6003986Y-38297230D01*
X-5953245Y-38380611D01*
X-5940844Y-38480684D01*
X-5968840Y-38580027D01*
X-5970282Y-38582733D01*
X-5984438Y-38605171D01*
X-5808135Y-38781474D01*
X-5734337Y-38668217D01*
X-5693544Y-38553614D01*
X-5683525Y-38453324D01*
X-5707165Y-38310071D01*
X-5773300Y-38180019D01*
X-5874746Y-38072795D01*
X-6004322Y-37998025D01*
X-6004322Y-37998025D01*
G37*
X-6004322Y-37998025D02*
X-6030130Y-37988740D01*
X-6135348Y-37972495D01*
X-6257701Y-37979993D01*
X-6372070Y-38008599D01*
X-6417133Y-38029270D01*
X-6486970Y-38076852D01*
X-6564554Y-38141165D01*
X-6594658Y-38169658D01*
X-6687200Y-38262003D01*
X-6155132Y-38794071D01*
X-6214897Y-38831153D01*
X-6300006Y-38860584D01*
X-6398171Y-38861408D01*
X-6487958Y-38835388D01*
X-6531476Y-38805111D01*
X-6573481Y-38747037D01*
X-6613031Y-38667184D01*
X-6624041Y-38637631D01*
X-6661584Y-38525173D01*
X-6774412Y-38509987D01*
X-6844365Y-38506072D01*
X-6891271Y-38513674D01*
X-6900264Y-38520678D01*
X-6902094Y-38557620D01*
X-6893078Y-38625558D01*
X-6881139Y-38683466D01*
X-6828216Y-38819023D01*
X-6741266Y-38943375D01*
X-6631690Y-39043227D01*
X-6522803Y-39101282D01*
X-6382314Y-39132884D01*
X-6249483Y-39122352D01*
X-6118487Y-39067863D01*
X-5983503Y-38967598D01*
X-5928141Y-38915315D01*
X-5810966Y-38785819D01*
X-5808135Y-38781474D01*
X-5984438Y-38605171D01*
X-6000860Y-38611882D01*
X-6027195Y-38598303D01*
X-6071089Y-38559876D01*
X-6140192Y-38492039D01*
X-6166568Y-38465686D01*
X-6245826Y-38384516D01*
X-6293224Y-38330177D01*
X-6313692Y-38295927D01*
X-6312158Y-38275030D01*
X-6308899Y-38271085D01*
X-6269226Y-38253512D01*
X-6201475Y-38241071D01*
X-6175546Y-38238920D01*
X-6091701Y-38243350D01*
X-6030080Y-38273747D01*
X-6003986Y-38297230D01*
X-5953245Y-38380611D01*
X-5940844Y-38480684D01*
X-5968840Y-38580027D01*
X-5970282Y-38582733D01*
X-5984438Y-38605171D01*
X-5808135Y-38781474D01*
X-5734337Y-38668217D01*
X-5693544Y-38553614D01*
X-5683525Y-38453324D01*
X-5707165Y-38310071D01*
X-5773300Y-38180019D01*
X-5874746Y-38072795D01*
X-6004322Y-37998025D01*
G36*
X-7901168Y-36055911D02*
X-7980495Y-36001877D01*
X-8076120Y-35959149D01*
X-8086884Y-35955130D01*
X-8166927Y-35930255D01*
X-8228891Y-35919559D01*
X-8257055Y-35924237D01*
X-8272653Y-35962201D01*
X-8285006Y-36028879D01*
X-8287700Y-36055686D01*
X-8296076Y-36163436D01*
X-8194224Y-36189698D01*
X-8108083Y-36225483D01*
X-8024187Y-36282464D01*
X-7955786Y-36349163D01*
X-7916136Y-36414105D01*
X-7911479Y-36434549D01*
X-7923768Y-36494639D01*
X-7962552Y-36539232D01*
X-8013004Y-36553916D01*
X-8029898Y-36549654D01*
X-8069442Y-36525798D01*
X-8134381Y-36479297D01*
X-8211878Y-36419418D01*
X-8225931Y-36408128D01*
X-8355337Y-36316890D01*
X-8467767Y-36269291D01*
X-8569574Y-36264966D01*
X-8667109Y-36303551D01*
X-8759420Y-36377499D01*
X-8841231Y-36484679D01*
X-8874247Y-36600072D01*
X-8858436Y-36723978D01*
X-8793768Y-36856696D01*
X-8697634Y-36979676D01*
X-8608132Y-37068856D01*
X-8523473Y-37129132D01*
X-8457148Y-37161791D01*
X-8365283Y-37194996D01*
X-8273455Y-37218750D01*
X-8237932Y-37224309D01*
X-8141989Y-37234015D01*
X-8141233Y-37105840D01*
X-8140475Y-36977665D01*
X-8260843Y-36953166D01*
X-8369494Y-36916518D01*
X-8465904Y-36857770D01*
X-8542465Y-36785183D01*
X-8591571Y-36707017D01*
X-8605619Y-36631534D01*
X-8594154Y-36591160D01*
X-8550418Y-36551761D01*
X-8482714Y-36555892D01*
X-8391194Y-36603511D01*
X-8304829Y-36669587D01*
X-8168171Y-36767534D01*
X-8044508Y-36818160D01*
X-7931608Y-36821562D01*
X-7827234Y-36777837D01*
X-7735241Y-36694246D01*
X-7664291Y-36581794D01*
X-7642284Y-36465172D01*
X-7669332Y-36343639D01*
X-7745539Y-36216456D01*
X-7815883Y-36136118D01*
X-7901168Y-36055911D01*
X-7901168Y-36055911D01*
G37*
X-7901168Y-36055911D02*
X-7980495Y-36001877D01*
X-8076120Y-35959149D01*
X-8086884Y-35955130D01*
X-8166927Y-35930255D01*
X-8228891Y-35919559D01*
X-8257055Y-35924237D01*
X-8272653Y-35962201D01*
X-8285006Y-36028879D01*
X-8287700Y-36055686D01*
X-8296076Y-36163436D01*
X-8194224Y-36189698D01*
X-8108083Y-36225483D01*
X-8024187Y-36282464D01*
X-7955786Y-36349163D01*
X-7916136Y-36414105D01*
X-7911479Y-36434549D01*
X-7923768Y-36494639D01*
X-7962552Y-36539232D01*
X-8013004Y-36553916D01*
X-8029898Y-36549654D01*
X-8069442Y-36525798D01*
X-8134381Y-36479297D01*
X-8211878Y-36419418D01*
X-8225931Y-36408128D01*
X-8355337Y-36316890D01*
X-8467767Y-36269291D01*
X-8569574Y-36264966D01*
X-8667109Y-36303551D01*
X-8759420Y-36377499D01*
X-8841231Y-36484679D01*
X-8874247Y-36600072D01*
X-8858436Y-36723978D01*
X-8793768Y-36856696D01*
X-8697634Y-36979676D01*
X-8608132Y-37068856D01*
X-8523473Y-37129132D01*
X-8457148Y-37161791D01*
X-8365283Y-37194996D01*
X-8273455Y-37218750D01*
X-8237932Y-37224309D01*
X-8141989Y-37234015D01*
X-8141233Y-37105840D01*
X-8140475Y-36977665D01*
X-8260843Y-36953166D01*
X-8369494Y-36916518D01*
X-8465904Y-36857770D01*
X-8542465Y-36785183D01*
X-8591571Y-36707017D01*
X-8605619Y-36631534D01*
X-8594154Y-36591160D01*
X-8550418Y-36551761D01*
X-8482714Y-36555892D01*
X-8391194Y-36603511D01*
X-8304829Y-36669587D01*
X-8168171Y-36767534D01*
X-8044508Y-36818160D01*
X-7931608Y-36821562D01*
X-7827234Y-36777837D01*
X-7735241Y-36694246D01*
X-7664291Y-36581794D01*
X-7642284Y-36465172D01*
X-7669332Y-36343639D01*
X-7745539Y-36216456D01*
X-7815883Y-36136118D01*
X-7901168Y-36055911D01*
G36*
X-8750267Y-35233709D02*
X-8887835Y-35193150D01*
X-9034086Y-35200038D01*
X-9129193Y-35229481D01*
X-9198292Y-35270389D01*
X-9285837Y-35339668D01*
X-9380080Y-35426084D01*
X-9469273Y-35518400D01*
X-9541665Y-35605382D01*
X-9575704Y-35656465D01*
X-9605183Y-35743434D01*
X-9617243Y-35855060D01*
X-9611327Y-35969137D01*
X-9586874Y-36063458D01*
X-9585980Y-36065460D01*
X-9527554Y-36154416D01*
X-9440600Y-36242127D01*
X-9343712Y-36311220D01*
X-9300528Y-36332126D01*
X-9171190Y-36367859D01*
X-9050759Y-36365650D01*
X-8930741Y-36323304D01*
X-8802640Y-36238628D01*
X-8742000Y-36187815D01*
X-8672604Y-36117165D01*
X-8861351Y-35928418D01*
X-8969886Y-36024236D01*
X-9066051Y-36083798D01*
X-9144884Y-36104463D01*
X-9179832Y-36097968D01*
X-9242841Y-36054800D01*
X-9303008Y-35988758D01*
X-9343290Y-35919925D01*
X-9349743Y-35897764D01*
X-9341746Y-35814273D01*
X-9296654Y-35719352D01*
X-9222062Y-35623549D01*
X-9125568Y-35537415D01*
X-9059035Y-35494037D01*
X-8962152Y-35463635D01*
X-8869896Y-35476325D01*
X-8792945Y-35525767D01*
X-8741978Y-35605617D01*
X-8727059Y-35691184D01*
X-8729801Y-35746734D01*
X-8743117Y-35790871D01*
X-8774650Y-35837096D01*
X-8832040Y-35898903D01*
X-8861351Y-35928418D01*
X-8672604Y-36117165D01*
X-8594628Y-36037780D01*
X-8496905Y-35891620D01*
X-8448831Y-35749328D01*
X-8450403Y-35610897D01*
X-8501619Y-35476319D01*
X-8516733Y-35451539D01*
X-8625271Y-35320309D01*
X-8750267Y-35233709D01*
X-8750267Y-35233709D01*
G37*
X-8750267Y-35233709D02*
X-8887835Y-35193150D01*
X-9034086Y-35200038D01*
X-9129193Y-35229481D01*
X-9198292Y-35270389D01*
X-9285837Y-35339668D01*
X-9380080Y-35426084D01*
X-9469273Y-35518400D01*
X-9541665Y-35605382D01*
X-9575704Y-35656465D01*
X-9605183Y-35743434D01*
X-9617243Y-35855060D01*
X-9611327Y-35969137D01*
X-9586874Y-36063458D01*
X-9585980Y-36065460D01*
X-9527554Y-36154416D01*
X-9440600Y-36242127D01*
X-9343712Y-36311220D01*
X-9300528Y-36332126D01*
X-9171190Y-36367859D01*
X-9050759Y-36365650D01*
X-8930741Y-36323304D01*
X-8802640Y-36238628D01*
X-8742000Y-36187815D01*
X-8672604Y-36117165D01*
X-8861351Y-35928418D01*
X-8969886Y-36024236D01*
X-9066051Y-36083798D01*
X-9144884Y-36104463D01*
X-9179832Y-36097968D01*
X-9242841Y-36054800D01*
X-9303008Y-35988758D01*
X-9343290Y-35919925D01*
X-9349743Y-35897764D01*
X-9341746Y-35814273D01*
X-9296654Y-35719352D01*
X-9222062Y-35623549D01*
X-9125568Y-35537415D01*
X-9059035Y-35494037D01*
X-8962152Y-35463635D01*
X-8869896Y-35476325D01*
X-8792945Y-35525767D01*
X-8741978Y-35605617D01*
X-8727059Y-35691184D01*
X-8729801Y-35746734D01*
X-8743117Y-35790871D01*
X-8774650Y-35837096D01*
X-8832040Y-35898903D01*
X-8861351Y-35928418D01*
X-8672604Y-36117165D01*
X-8594628Y-36037780D01*
X-8496905Y-35891620D01*
X-8448831Y-35749328D01*
X-8450403Y-35610897D01*
X-8501619Y-35476319D01*
X-8516733Y-35451539D01*
X-8625271Y-35320309D01*
X-8750267Y-35233709D01*
G36*
X-9549714Y-34961596D02*
X-9680520Y-35089074D01*
X-9784691Y-35181084D01*
X-9867917Y-35240052D01*
X-9935885Y-35268402D01*
X-9994284Y-35268559D01*
X-10048800Y-35242946D01*
X-10102099Y-35197031D01*
X-10149918Y-35140939D01*
X-10174266Y-35086362D01*
X-10172723Y-35027610D01*
X-10142860Y-34958998D01*
X-10082256Y-34874836D01*
X-9988483Y-34769436D01*
X-9866664Y-34644646D01*
X-9592578Y-34370559D01*
X-9786269Y-34176868D01*
X-10631470Y-35022068D01*
X-10534624Y-35118914D01*
X-10473875Y-35174931D01*
X-10435503Y-35196686D01*
X-10411331Y-35189312D01*
X-10392225Y-35180324D01*
X-10375065Y-35203428D01*
X-10354364Y-35263887D01*
X-10292026Y-35387562D01*
X-10191207Y-35484036D01*
X-10063384Y-35545255D01*
X-9992066Y-35563961D01*
X-9929250Y-35569812D01*
X-9868529Y-35559256D01*
X-9803497Y-35528741D01*
X-9727748Y-35474716D01*
X-9634876Y-35393626D01*
X-9518475Y-35281920D01*
X-9429975Y-35194024D01*
X-9099544Y-34863593D01*
X-9275627Y-34687510D01*
X-9549714Y-34961596D01*
X-9549714Y-34961596D01*
G37*
X-9549714Y-34961596D02*
X-9680520Y-35089074D01*
X-9784691Y-35181084D01*
X-9867917Y-35240052D01*
X-9935885Y-35268402D01*
X-9994284Y-35268559D01*
X-10048800Y-35242946D01*
X-10102099Y-35197031D01*
X-10149918Y-35140939D01*
X-10174266Y-35086362D01*
X-10172723Y-35027610D01*
X-10142860Y-34958998D01*
X-10082256Y-34874836D01*
X-9988483Y-34769436D01*
X-9866664Y-34644646D01*
X-9592578Y-34370559D01*
X-9786269Y-34176868D01*
X-10631470Y-35022068D01*
X-10534624Y-35118914D01*
X-10473875Y-35174931D01*
X-10435503Y-35196686D01*
X-10411331Y-35189312D01*
X-10392225Y-35180324D01*
X-10375065Y-35203428D01*
X-10354364Y-35263887D01*
X-10292026Y-35387562D01*
X-10191207Y-35484036D01*
X-10063384Y-35545255D01*
X-9992066Y-35563961D01*
X-9929250Y-35569812D01*
X-9868529Y-35559256D01*
X-9803497Y-35528741D01*
X-9727748Y-35474716D01*
X-9634876Y-35393626D01*
X-9518475Y-35281920D01*
X-9429975Y-35194024D01*
X-9099544Y-34863593D01*
X-9275627Y-34687510D01*
X-9549714Y-34961596D01*
G36*
X-10996831Y-32981053D02*
X-11142192Y-32922372D01*
X-11195423Y-32911337D01*
X-11268914Y-32902690D01*
X-11320187Y-32902402D01*
X-11332967Y-32906230D01*
X-11338753Y-32937295D01*
X-11337673Y-33000905D01*
X-11333598Y-33048622D01*
X-11319679Y-33176464D01*
X-11216615Y-33185339D01*
X-11142960Y-33198186D01*
X-11090294Y-33229863D01*
X-11044592Y-33280691D01*
X-10987004Y-33376390D01*
X-10973798Y-33468699D01*
X-11005678Y-33564702D01*
X-11083346Y-33671478D01*
X-11083400Y-33671539D01*
X-11187736Y-33773358D01*
X-11282926Y-33829424D01*
X-11373438Y-33841894D01*
X-11417477Y-33832729D01*
X-11509840Y-33783793D01*
X-11585313Y-33708346D01*
X-11629898Y-33621626D01*
X-11635146Y-33595791D01*
X-11647827Y-33530524D01*
X-11673990Y-33495743D01*
X-11726423Y-33482449D01*
X-11797905Y-33481267D01*
X-11914748Y-33483092D01*
X-11903528Y-33599572D01*
X-11864276Y-33757621D01*
X-11782304Y-33898139D01*
X-11663930Y-34012274D01*
X-11568173Y-34069212D01*
X-11430937Y-34110451D01*
X-11284058Y-34106308D01*
X-11198333Y-34085429D01*
X-11095596Y-34035213D01*
X-10985597Y-33951494D01*
X-10880523Y-33846623D01*
X-10792558Y-33732945D01*
X-10733887Y-33622811D01*
X-10729287Y-33610105D01*
X-10704434Y-33465216D01*
X-10723900Y-33322165D01*
X-10782547Y-33188653D01*
X-10875236Y-33072381D01*
X-10996831Y-32981053D01*
X-10996831Y-32981053D01*
G37*
X-10996831Y-32981053D02*
X-11142192Y-32922372D01*
X-11195423Y-32911337D01*
X-11268914Y-32902690D01*
X-11320187Y-32902402D01*
X-11332967Y-32906230D01*
X-11338753Y-32937295D01*
X-11337673Y-33000905D01*
X-11333598Y-33048622D01*
X-11319679Y-33176464D01*
X-11216615Y-33185339D01*
X-11142960Y-33198186D01*
X-11090294Y-33229863D01*
X-11044592Y-33280691D01*
X-10987004Y-33376390D01*
X-10973798Y-33468699D01*
X-11005678Y-33564702D01*
X-11083346Y-33671478D01*
X-11083400Y-33671539D01*
X-11187736Y-33773358D01*
X-11282926Y-33829424D01*
X-11373438Y-33841894D01*
X-11417477Y-33832729D01*
X-11509840Y-33783793D01*
X-11585313Y-33708346D01*
X-11629898Y-33621626D01*
X-11635146Y-33595791D01*
X-11647827Y-33530524D01*
X-11673990Y-33495743D01*
X-11726423Y-33482449D01*
X-11797905Y-33481267D01*
X-11914748Y-33483092D01*
X-11903528Y-33599572D01*
X-11864276Y-33757621D01*
X-11782304Y-33898139D01*
X-11663930Y-34012274D01*
X-11568173Y-34069212D01*
X-11430937Y-34110451D01*
X-11284058Y-34106308D01*
X-11198333Y-34085429D01*
X-11095596Y-34035213D01*
X-10985597Y-33951494D01*
X-10880523Y-33846623D01*
X-10792558Y-33732945D01*
X-10733887Y-33622811D01*
X-10729287Y-33610105D01*
X-10704434Y-33465216D01*
X-10723900Y-33322165D01*
X-10782547Y-33188653D01*
X-10875236Y-33072381D01*
X-10996831Y-32981053D01*
G36*
X-11631537Y-32325557D02*
X-11687578Y-32291422D01*
X-11814131Y-32245089D01*
X-11949307Y-32232431D01*
X-12073912Y-32254723D01*
X-12097431Y-32264186D01*
X-12150268Y-32297741D01*
X-12220917Y-32354893D01*
X-12287801Y-32417179D01*
X-12409913Y-32539290D01*
X-12154591Y-32794612D01*
X-12049684Y-32900315D01*
X-11977916Y-32976918D01*
X-11937026Y-33030348D01*
X-11924750Y-33066539D01*
X-11938828Y-33091419D01*
X-11976998Y-33110920D01*
X-12027459Y-33127938D01*
X-12130412Y-33137600D01*
X-12223284Y-33100834D01*
X-12301597Y-33020694D01*
X-12360808Y-32900416D01*
X-12400686Y-32785175D01*
X-12515931Y-32771706D01*
X-12631176Y-32758236D01*
X-12626571Y-32874723D01*
X-12598594Y-33008409D01*
X-12531053Y-33139684D01*
X-12433045Y-33255529D01*
X-12313664Y-33342924D01*
X-12291558Y-33354178D01*
X-12153237Y-33397592D01*
X-12014899Y-33394439D01*
X-11873007Y-33344032D01*
X-11724023Y-33245683D01*
X-11721078Y-33243328D01*
X-11584037Y-33110820D01*
X-11545119Y-33053576D01*
X-11724016Y-32874678D01*
X-11747839Y-32865642D01*
X-11798109Y-32826699D01*
X-11867101Y-32764174D01*
X-11909261Y-32722993D01*
X-11986665Y-32644976D01*
X-12033307Y-32594440D01*
X-12053739Y-32563744D01*
X-12052512Y-32545250D01*
X-12034181Y-32531318D01*
X-12026094Y-32526922D01*
X-11935948Y-32499779D01*
X-11839142Y-32502060D01*
X-11774651Y-32525014D01*
X-11717819Y-32584353D01*
X-11684860Y-32669112D01*
X-11678369Y-32761366D01*
X-11700940Y-32843195D01*
X-11724016Y-32874678D01*
X-11545119Y-33053576D01*
X-11488092Y-32969690D01*
X-11433436Y-32825389D01*
X-11420261Y-32683373D01*
X-11448757Y-32549093D01*
X-11519119Y-32428003D01*
X-11631537Y-32325557D01*
X-11631537Y-32325557D01*
G37*
X-11631537Y-32325557D02*
X-11687578Y-32291422D01*
X-11814131Y-32245089D01*
X-11949307Y-32232431D01*
X-12073912Y-32254723D01*
X-12097431Y-32264186D01*
X-12150268Y-32297741D01*
X-12220917Y-32354893D01*
X-12287801Y-32417179D01*
X-12409913Y-32539290D01*
X-12154591Y-32794612D01*
X-12049684Y-32900315D01*
X-11977916Y-32976918D01*
X-11937026Y-33030348D01*
X-11924750Y-33066539D01*
X-11938828Y-33091419D01*
X-11976998Y-33110920D01*
X-12027459Y-33127938D01*
X-12130412Y-33137600D01*
X-12223284Y-33100834D01*
X-12301597Y-33020694D01*
X-12360808Y-32900416D01*
X-12400686Y-32785175D01*
X-12515931Y-32771706D01*
X-12631176Y-32758236D01*
X-12626571Y-32874723D01*
X-12598594Y-33008409D01*
X-12531053Y-33139684D01*
X-12433045Y-33255529D01*
X-12313664Y-33342924D01*
X-12291558Y-33354178D01*
X-12153237Y-33397592D01*
X-12014899Y-33394439D01*
X-11873007Y-33344032D01*
X-11724023Y-33245683D01*
X-11721078Y-33243328D01*
X-11584037Y-33110820D01*
X-11545119Y-33053576D01*
X-11724016Y-32874678D01*
X-11747839Y-32865642D01*
X-11798109Y-32826699D01*
X-11867101Y-32764174D01*
X-11909261Y-32722993D01*
X-11986665Y-32644976D01*
X-12033307Y-32594440D01*
X-12053739Y-32563744D01*
X-12052512Y-32545250D01*
X-12034181Y-32531318D01*
X-12026094Y-32526922D01*
X-11935948Y-32499779D01*
X-11839142Y-32502060D01*
X-11774651Y-32525014D01*
X-11717819Y-32584353D01*
X-11684860Y-32669112D01*
X-11678369Y-32761366D01*
X-11700940Y-32843195D01*
X-11724016Y-32874678D01*
X-11545119Y-33053576D01*
X-11488092Y-32969690D01*
X-11433436Y-32825389D01*
X-11420261Y-32683373D01*
X-11448757Y-32549093D01*
X-11519119Y-32428003D01*
X-11631537Y-32325557D01*
G36*
X-6843234Y-37148994D02*
X-6907990Y-37126103D01*
X-6980668Y-37113896D01*
X-7047802Y-37116361D01*
X-7115738Y-37137194D01*
X-7190825Y-37180091D01*
X-7279411Y-37248748D01*
X-7387842Y-37346863D01*
X-7522468Y-37478129D01*
X-7536417Y-37492025D01*
X-7849352Y-37804186D01*
X-7655660Y-37997878D01*
X-7367523Y-37709741D01*
X-7260637Y-37603132D01*
X-7182315Y-37526717D01*
X-7125909Y-37475470D01*
X-7084771Y-37444362D01*
X-7052254Y-37428367D01*
X-7021710Y-37422457D01*
X-6986542Y-37421605D01*
X-6887815Y-37442937D01*
X-6815104Y-37501286D01*
X-6777142Y-37588182D01*
X-6773641Y-37628102D01*
X-6774823Y-37661162D01*
X-6781715Y-37690940D01*
X-6799335Y-37723944D01*
X-6832700Y-37766679D01*
X-6886827Y-37825653D01*
X-6966733Y-37907371D01*
X-7064979Y-38005881D01*
X-7356318Y-38297220D01*
X-7162626Y-38490912D01*
X-6317425Y-37645712D01*
X-6414271Y-37548865D01*
X-6474716Y-37493019D01*
X-6512879Y-37471186D01*
X-6537505Y-37478416D01*
X-6537982Y-37478884D01*
X-6557617Y-37490448D01*
X-6573646Y-37470877D01*
X-6591897Y-37418346D01*
X-6646946Y-37312858D01*
X-6735960Y-37218235D01*
X-6843234Y-37148994D01*
X-6843234Y-37148994D01*
G37*
X-6843234Y-37148994D02*
X-6907990Y-37126103D01*
X-6980668Y-37113896D01*
X-7047802Y-37116361D01*
X-7115738Y-37137194D01*
X-7190825Y-37180091D01*
X-7279411Y-37248748D01*
X-7387842Y-37346863D01*
X-7522468Y-37478129D01*
X-7536417Y-37492025D01*
X-7849352Y-37804186D01*
X-7655660Y-37997878D01*
X-7367523Y-37709741D01*
X-7260637Y-37603132D01*
X-7182315Y-37526717D01*
X-7125909Y-37475470D01*
X-7084771Y-37444362D01*
X-7052254Y-37428367D01*
X-7021710Y-37422457D01*
X-6986542Y-37421605D01*
X-6887815Y-37442937D01*
X-6815104Y-37501286D01*
X-6777142Y-37588182D01*
X-6773641Y-37628102D01*
X-6774823Y-37661162D01*
X-6781715Y-37690940D01*
X-6799335Y-37723944D01*
X-6832700Y-37766679D01*
X-6886827Y-37825653D01*
X-6966733Y-37907371D01*
X-7064979Y-38005881D01*
X-7356318Y-38297220D01*
X-7162626Y-38490912D01*
X-6317425Y-37645712D01*
X-6414271Y-37548865D01*
X-6474716Y-37493019D01*
X-6512879Y-37471186D01*
X-6537505Y-37478416D01*
X-6537982Y-37478884D01*
X-6557617Y-37490448D01*
X-6573646Y-37470877D01*
X-6591897Y-37418346D01*
X-6646946Y-37312858D01*
X-6735960Y-37218235D01*
X-6843234Y-37148994D01*
G36*
X-10403623Y-33557879D02*
X-10482693Y-33515818D01*
X-10545069Y-33500204D01*
X-10576261Y-33505991D01*
X-10594683Y-33531405D01*
X-10606428Y-33588525D01*
X-10611632Y-33632095D01*
X-10616173Y-33715727D01*
X-10605010Y-33763987D01*
X-10578472Y-33788105D01*
X-10484218Y-33844119D01*
X-10429907Y-33900166D01*
X-10406767Y-33966643D01*
X-10404406Y-33994368D01*
X-10400880Y-34087144D01*
X-10983637Y-34669901D01*
X-10789945Y-34863593D01*
X-9944745Y-34018392D01*
X-10041591Y-33921546D01*
X-10102034Y-33865700D01*
X-10140198Y-33843866D01*
X-10164824Y-33851097D01*
X-10165301Y-33851565D01*
X-10186093Y-33864141D01*
X-10202493Y-33843389D01*
X-10216195Y-33805613D01*
X-10246957Y-33730055D01*
X-10276648Y-33673412D01*
X-10328737Y-33614414D01*
X-10403623Y-33557879D01*
X-10403623Y-33557879D01*
G37*
X-10403623Y-33557879D02*
X-10482693Y-33515818D01*
X-10545069Y-33500204D01*
X-10576261Y-33505991D01*
X-10594683Y-33531405D01*
X-10606428Y-33588525D01*
X-10611632Y-33632095D01*
X-10616173Y-33715727D01*
X-10605010Y-33763987D01*
X-10578472Y-33788105D01*
X-10484218Y-33844119D01*
X-10429907Y-33900166D01*
X-10406767Y-33966643D01*
X-10404406Y-33994368D01*
X-10400880Y-34087144D01*
X-10983637Y-34669901D01*
X-10789945Y-34863593D01*
X-9944745Y-34018392D01*
X-10041591Y-33921546D01*
X-10102034Y-33865700D01*
X-10140198Y-33843866D01*
X-10164824Y-33851097D01*
X-10165301Y-33851565D01*
X-10186093Y-33864141D01*
X-10202493Y-33843389D01*
X-10216195Y-33805613D01*
X-10246957Y-33730055D01*
X-10276648Y-33673412D01*
X-10328737Y-33614414D01*
X-10403623Y-33557879D01*
G36*
X-2574959Y-29713200D02*
X-3076845Y-30055870D01*
X-3491677Y-29883218D01*
X-3906508Y-29710566D01*
X-4019277Y-29118550D01*
X-4051245Y-28953143D01*
X-4080882Y-28804362D01*
X-4106744Y-28679092D01*
X-4127389Y-28584214D01*
X-4141373Y-28526611D01*
X-4146417Y-28512161D01*
X-4176073Y-28506696D01*
X-4247034Y-28502607D01*
X-4350823Y-28499833D01*
X-4478963Y-28498305D01*
X-4622977Y-28497959D01*
X-4774388Y-28498730D01*
X-4924718Y-28500553D01*
X-5065491Y-28503362D01*
X-5188229Y-28507092D01*
X-5284454Y-28511679D01*
X-5345690Y-28517056D01*
X-5363513Y-28521527D01*
X-5374453Y-28551685D01*
X-5392534Y-28623644D01*
X-5416185Y-28730166D01*
X-5443832Y-28864017D01*
X-5473907Y-29017960D01*
X-5490497Y-29106329D01*
X-5520911Y-29267570D01*
X-5549258Y-29412173D01*
X-5574056Y-29533010D01*
X-5593818Y-29622959D01*
X-5607061Y-29674895D01*
X-5611003Y-29684651D01*
X-5637058Y-29697525D01*
X-5700386Y-29724925D01*
X-5791899Y-29763183D01*
X-5902507Y-29808631D01*
X-6023123Y-29857603D01*
X-6144658Y-29906429D01*
X-6258021Y-29951444D01*
X-6354128Y-29988978D01*
X-6423886Y-30015365D01*
X-6458208Y-30026935D01*
X-6459782Y-30027167D01*
X-6482026Y-30013687D01*
X-6539371Y-29975891D01*
X-6625925Y-29917751D01*
X-6735797Y-29843237D01*
X-6863095Y-29756318D01*
X-6937231Y-29705467D01*
X-7073473Y-29612808D01*
X-7197586Y-29530167D01*
X-7303203Y-29461641D01*
X-7383959Y-29411325D01*
X-7433493Y-29383314D01*
X-7444701Y-29378935D01*
X-7475444Y-29394410D01*
X-7533795Y-29440443D01*
X-7613654Y-29510925D01*
X-7708925Y-29599749D01*
X-7813506Y-29700808D01*
X-7921299Y-29807994D01*
X-8026205Y-29915202D01*
X-8122127Y-30016321D01*
X-8202962Y-30105246D01*
X-8262616Y-30175870D01*
X-8294985Y-30222085D01*
X-8299013Y-30234416D01*
X-8284000Y-30269038D01*
X-8245428Y-30335643D01*
X-8188610Y-30425627D01*
X-8118852Y-30530389D01*
X-8094053Y-30566511D01*
X-7974092Y-30740274D01*
X-7879746Y-30877948D01*
X-7808043Y-30984229D01*
X-7756010Y-31063810D01*
X-7720675Y-31121386D01*
X-7699067Y-31161651D01*
X-7688214Y-31189299D01*
X-7685142Y-31209025D01*
X-7685194Y-31212265D01*
X-7695785Y-31254696D01*
X-7723094Y-31330576D01*
X-7763225Y-31431161D01*
X-7812289Y-31547710D01*
X-7866392Y-31671479D01*
X-7921641Y-31793727D01*
X-7974143Y-31905710D01*
X-8020005Y-31998687D01*
X-8055335Y-32063912D01*
X-8076240Y-32092646D01*
X-8077435Y-32093189D01*
X-8110985Y-32100212D01*
X-8185710Y-32114758D01*
X-8293802Y-32135343D01*
X-8427453Y-32160483D01*
X-8578854Y-32188693D01*
X-8621917Y-32196673D01*
X-8776989Y-32226652D01*
X-8916447Y-32256034D01*
X-9032447Y-32282970D01*
X-9117141Y-32305610D01*
X-9162684Y-32322105D01*
X-9167199Y-32325213D01*
X-9175026Y-32357447D01*
X-9180988Y-32430846D01*
X-9185153Y-32536815D01*
X-9187592Y-32666750D01*
X-9188376Y-32812055D01*
X-9187575Y-32964129D01*
X-9185257Y-33114373D01*
X-9181494Y-33254187D01*
X-9176356Y-33374973D01*
X-9169912Y-33468131D01*
X-9162233Y-33525062D01*
X-9157317Y-33538019D01*
X-9127046Y-33549351D01*
X-9058915Y-33566398D01*
X-8964167Y-33586528D01*
X-8889943Y-33600692D01*
X-8754764Y-33625666D01*
X-8595052Y-33655615D01*
X-8435155Y-33685957D01*
X-8349347Y-33702428D01*
X-8059171Y-33758444D01*
X-7992433Y-33982309D01*
X-7960654Y-34082921D01*
X-7931116Y-34165963D01*
X-7908286Y-34219308D01*
X-7900715Y-34231125D01*
X-7873382Y-34227108D01*
X-7806087Y-34205811D01*
X-7704635Y-34169604D01*
X-7574825Y-34120856D01*
X-7422462Y-34061936D01*
X-7253348Y-33995213D01*
X-7073287Y-33923055D01*
X-6888081Y-33847832D01*
X-6703533Y-33771912D01*
X-6525444Y-33697666D01*
X-6359619Y-33627462D01*
X-6211861Y-33563668D01*
X-6087970Y-33508655D01*
X-5993751Y-33464791D01*
X-5935007Y-33434444D01*
X-5917424Y-33421429D01*
X-5916009Y-33383816D01*
X-5923960Y-33312510D01*
X-5939574Y-33222380D01*
X-5941064Y-33214995D01*
X-5968331Y-32968954D01*
X-5950902Y-32731149D01*
X-5891901Y-32506615D01*
X-5794457Y-32300388D01*
X-5661693Y-32117503D01*
X-5496736Y-31962996D01*
X-5302712Y-31841902D01*
X-5082744Y-31759256D01*
X-5029440Y-31746354D01*
X-4790696Y-31717747D01*
X-4559226Y-31734530D01*
X-4339885Y-31792965D01*
X-4137528Y-31889314D01*
X-3957009Y-32019836D01*
X-3803181Y-32180799D01*
X-3680901Y-32368460D01*
X-3595022Y-32579084D01*
X-3550398Y-32808931D01*
X-3545535Y-32888971D01*
X-3555159Y-33114675D01*
X-3600298Y-33317268D01*
X-3685136Y-33510116D01*
X-3792556Y-33677691D01*
X-3939722Y-33839708D01*
X-4119840Y-33970307D01*
X-4325141Y-34066753D01*
X-4547863Y-34126312D01*
X-4780237Y-34146244D01*
X-5014498Y-34123815D01*
X-5042530Y-34118112D01*
X-5132530Y-34101235D01*
X-5204832Y-34092290D01*
X-5244480Y-34093095D01*
X-5245402Y-34093452D01*
X-5263112Y-34119502D01*
X-5296242Y-34185688D01*
X-5342423Y-34286209D01*
X-5399289Y-34415262D01*
X-5464471Y-34567044D01*
X-5535604Y-34735754D01*
X-5610318Y-34915587D01*
X-5686246Y-35100744D01*
X-5761023Y-35285419D01*
X-5832279Y-35463811D01*
X-5897646Y-35630117D01*
X-5954759Y-35778536D01*
X-6001250Y-35903264D01*
X-6034752Y-35998499D01*
X-6052895Y-36058438D01*
X-6054733Y-36077108D01*
X-6021033Y-36094838D01*
X-5951503Y-36121541D01*
X-5858265Y-36152744D01*
X-5805917Y-36168824D01*
X-5582052Y-36235563D01*
X-5526036Y-36525739D01*
X-5497654Y-36674080D01*
X-5466919Y-36836826D01*
X-5438413Y-36989630D01*
X-5424300Y-37066335D01*
X-5403321Y-37173088D01*
X-5383227Y-37261153D01*
X-5366769Y-37319173D01*
X-5359067Y-37335661D01*
X-5329611Y-37341415D01*
X-5257566Y-37347293D01*
X-5150144Y-37352954D01*
X-5014556Y-37358056D01*
X-4858015Y-37362255D01*
X-4758278Y-37364179D01*
X-4581973Y-37365731D01*
X-4426968Y-37364434D01*
X-4299712Y-37360523D01*
X-4206654Y-37354235D01*
X-4154246Y-37345807D01*
X-4145964Y-37341743D01*
X-4132274Y-37308473D01*
X-4111850Y-37233943D01*
X-4086501Y-37125962D01*
X-4058031Y-36992338D01*
X-4028245Y-36840876D01*
X-4020282Y-36798309D01*
X-3991494Y-36643441D01*
X-3965375Y-36504210D01*
X-3943409Y-36388422D01*
X-3927081Y-36303884D01*
X-3917872Y-36258407D01*
X-3916797Y-36253828D01*
X-3892386Y-36234657D01*
X-3830568Y-36200654D01*
X-3740085Y-36155711D01*
X-3629681Y-36103721D01*
X-3508098Y-36048577D01*
X-3384078Y-35994173D01*
X-3266364Y-35944400D01*
X-3163699Y-35903150D01*
X-3084826Y-35874319D01*
X-3038486Y-35861796D01*
X-3035873Y-35861586D01*
X-3017123Y-35863515D01*
X-2991341Y-35872660D01*
X-2953835Y-35891995D01*
X-2899910Y-35924492D01*
X-2824873Y-35973122D01*
X-2724028Y-36040858D01*
X-2592681Y-36130673D01*
X-2426139Y-36245537D01*
X-2390119Y-36270445D01*
X-2282384Y-36343290D01*
X-2186605Y-36404939D01*
X-2111385Y-36450080D01*
X-2065326Y-36473404D01*
X-2058024Y-36475405D01*
X-2026863Y-36459576D01*
X-1968129Y-36413302D01*
X-1887927Y-36342685D01*
X-1792366Y-36253821D01*
X-1687551Y-36152810D01*
X-1579591Y-36045752D01*
X-1474594Y-35938744D01*
X-1378666Y-35837887D01*
X-1297915Y-35749278D01*
X-1238448Y-35679018D01*
X-1206373Y-35633205D01*
X-1202542Y-35621093D01*
X-1217556Y-35590000D01*
X-1256969Y-35524425D01*
X-1316688Y-35430733D01*
X-1392618Y-35315291D01*
X-1480663Y-35184460D01*
X-1529076Y-35113622D01*
X-1621057Y-34979346D01*
X-1702782Y-34859304D01*
X-1770284Y-34759390D01*
X-1819590Y-34685494D01*
X-1846731Y-34643509D01*
X-1850775Y-34636175D01*
X-1841839Y-34608010D01*
X-1817480Y-34543003D01*
X-1781374Y-34450249D01*
X-1737193Y-34338838D01*
X-1688614Y-34217864D01*
X-1639309Y-34096419D01*
X-1592954Y-33983596D01*
X-1553224Y-33888488D01*
X-1523792Y-33820186D01*
X-1508332Y-33787784D01*
X-1507444Y-33786581D01*
X-1478962Y-33777306D01*
X-1408596Y-33760787D01*
X-1303492Y-33738511D01*
X-1170798Y-33711966D01*
X-1017661Y-33682641D01*
X-929272Y-33666225D01*
X-767612Y-33635716D01*
X-622134Y-33606725D01*
X-500093Y-33580822D01*
X-408744Y-33559580D01*
X-355342Y-33544568D01*
X-344901Y-33539672D01*
X-338970Y-33509905D01*
X-333806Y-33438849D01*
X-329471Y-33334981D01*
X-326025Y-33206778D01*
X-323530Y-33062721D01*
X-322047Y-32911284D01*
X-321636Y-32760948D01*
X-322358Y-32620190D01*
X-324274Y-32497489D01*
X-327446Y-32401323D01*
X-331933Y-32340169D01*
X-336151Y-32322427D01*
X-363537Y-32314058D01*
X-433009Y-32298009D01*
X-537689Y-32275720D01*
X-670703Y-32248629D01*
X-825172Y-32218174D01*
X-942159Y-32195668D01*
X-1534174Y-32082900D01*
X-1706826Y-31668068D01*
X-1879478Y-31253237D01*
X-1536807Y-30751352D01*
X-1194137Y-30249465D01*
X-2073073Y-29370529D01*
X-2574959Y-29713200D01*
X-2574959Y-29713200D01*
G37*
X-2574959Y-29713200D02*
X-3076845Y-30055870D01*
X-3491677Y-29883218D01*
X-3906508Y-29710566D01*
X-4019277Y-29118550D01*
X-4051245Y-28953143D01*
X-4080882Y-28804362D01*
X-4106744Y-28679092D01*
X-4127389Y-28584214D01*
X-4141373Y-28526611D01*
X-4146417Y-28512161D01*
X-4176073Y-28506696D01*
X-4247034Y-28502607D01*
X-4350823Y-28499833D01*
X-4478963Y-28498305D01*
X-4622977Y-28497959D01*
X-4774388Y-28498730D01*
X-4924718Y-28500553D01*
X-5065491Y-28503362D01*
X-5188229Y-28507092D01*
X-5284454Y-28511679D01*
X-5345690Y-28517056D01*
X-5363513Y-28521527D01*
X-5374453Y-28551685D01*
X-5392534Y-28623644D01*
X-5416185Y-28730166D01*
X-5443832Y-28864017D01*
X-5473907Y-29017960D01*
X-5490497Y-29106329D01*
X-5520911Y-29267570D01*
X-5549258Y-29412173D01*
X-5574056Y-29533010D01*
X-5593818Y-29622959D01*
X-5607061Y-29674895D01*
X-5611003Y-29684651D01*
X-5637058Y-29697525D01*
X-5700386Y-29724925D01*
X-5791899Y-29763183D01*
X-5902507Y-29808631D01*
X-6023123Y-29857603D01*
X-6144658Y-29906429D01*
X-6258021Y-29951444D01*
X-6354128Y-29988978D01*
X-6423886Y-30015365D01*
X-6458208Y-30026935D01*
X-6459782Y-30027167D01*
X-6482026Y-30013687D01*
X-6539371Y-29975891D01*
X-6625925Y-29917751D01*
X-6735797Y-29843237D01*
X-6863095Y-29756318D01*
X-6937231Y-29705467D01*
X-7073473Y-29612808D01*
X-7197586Y-29530167D01*
X-7303203Y-29461641D01*
X-7383959Y-29411325D01*
X-7433493Y-29383314D01*
X-7444701Y-29378935D01*
X-7475444Y-29394410D01*
X-7533795Y-29440443D01*
X-7613654Y-29510925D01*
X-7708925Y-29599749D01*
X-7813506Y-29700808D01*
X-7921299Y-29807994D01*
X-8026205Y-29915202D01*
X-8122127Y-30016321D01*
X-8202962Y-30105246D01*
X-8262616Y-30175870D01*
X-8294985Y-30222085D01*
X-8299013Y-30234416D01*
X-8284000Y-30269038D01*
X-8245428Y-30335643D01*
X-8188610Y-30425627D01*
X-8118852Y-30530389D01*
X-8094053Y-30566511D01*
X-7974092Y-30740274D01*
X-7879746Y-30877948D01*
X-7808043Y-30984229D01*
X-7756010Y-31063810D01*
X-7720675Y-31121386D01*
X-7699067Y-31161651D01*
X-7688214Y-31189299D01*
X-7685142Y-31209025D01*
X-7685194Y-31212265D01*
X-7695785Y-31254696D01*
X-7723094Y-31330576D01*
X-7763225Y-31431161D01*
X-7812289Y-31547710D01*
X-7866392Y-31671479D01*
X-7921641Y-31793727D01*
X-7974143Y-31905710D01*
X-8020005Y-31998687D01*
X-8055335Y-32063912D01*
X-8076240Y-32092646D01*
X-8077435Y-32093189D01*
X-8110985Y-32100212D01*
X-8185710Y-32114758D01*
X-8293802Y-32135343D01*
X-8427453Y-32160483D01*
X-8578854Y-32188693D01*
X-8621917Y-32196673D01*
X-8776989Y-32226652D01*
X-8916447Y-32256034D01*
X-9032447Y-32282970D01*
X-9117141Y-32305610D01*
X-9162684Y-32322105D01*
X-9167199Y-32325213D01*
X-9175026Y-32357447D01*
X-9180988Y-32430846D01*
X-9185153Y-32536815D01*
X-9187592Y-32666750D01*
X-9188376Y-32812055D01*
X-9187575Y-32964129D01*
X-9185257Y-33114373D01*
X-9181494Y-33254187D01*
X-9176356Y-33374973D01*
X-9169912Y-33468131D01*
X-9162233Y-33525062D01*
X-9157317Y-33538019D01*
X-9127046Y-33549351D01*
X-9058915Y-33566398D01*
X-8964167Y-33586528D01*
X-8889943Y-33600692D01*
X-8754764Y-33625666D01*
X-8595052Y-33655615D01*
X-8435155Y-33685957D01*
X-8349347Y-33702428D01*
X-8059171Y-33758444D01*
X-7992433Y-33982309D01*
X-7960654Y-34082921D01*
X-7931116Y-34165963D01*
X-7908286Y-34219308D01*
X-7900715Y-34231125D01*
X-7873382Y-34227108D01*
X-7806087Y-34205811D01*
X-7704635Y-34169604D01*
X-7574825Y-34120856D01*
X-7422462Y-34061936D01*
X-7253348Y-33995213D01*
X-7073287Y-33923055D01*
X-6888081Y-33847832D01*
X-6703533Y-33771912D01*
X-6525444Y-33697666D01*
X-6359619Y-33627462D01*
X-6211861Y-33563668D01*
X-6087970Y-33508655D01*
X-5993751Y-33464791D01*
X-5935007Y-33434444D01*
X-5917424Y-33421429D01*
X-5916009Y-33383816D01*
X-5923960Y-33312510D01*
X-5939574Y-33222380D01*
X-5941064Y-33214995D01*
X-5968331Y-32968954D01*
X-5950902Y-32731149D01*
X-5891901Y-32506615D01*
X-5794457Y-32300388D01*
X-5661693Y-32117503D01*
X-5496736Y-31962996D01*
X-5302712Y-31841902D01*
X-5082744Y-31759256D01*
X-5029440Y-31746354D01*
X-4790696Y-31717747D01*
X-4559226Y-31734530D01*
X-4339885Y-31792965D01*
X-4137528Y-31889314D01*
X-3957009Y-32019836D01*
X-3803181Y-32180799D01*
X-3680901Y-32368460D01*
X-3595022Y-32579084D01*
X-3550398Y-32808931D01*
X-3545535Y-32888971D01*
X-3555159Y-33114675D01*
X-3600298Y-33317268D01*
X-3685136Y-33510116D01*
X-3792556Y-33677691D01*
X-3939722Y-33839708D01*
X-4119840Y-33970307D01*
X-4325141Y-34066753D01*
X-4547863Y-34126312D01*
X-4780237Y-34146244D01*
X-5014498Y-34123815D01*
X-5042530Y-34118112D01*
X-5132530Y-34101235D01*
X-5204832Y-34092290D01*
X-5244480Y-34093095D01*
X-5245402Y-34093452D01*
X-5263112Y-34119502D01*
X-5296242Y-34185688D01*
X-5342423Y-34286209D01*
X-5399289Y-34415262D01*
X-5464471Y-34567044D01*
X-5535604Y-34735754D01*
X-5610318Y-34915587D01*
X-5686246Y-35100744D01*
X-5761023Y-35285419D01*
X-5832279Y-35463811D01*
X-5897646Y-35630117D01*
X-5954759Y-35778536D01*
X-6001250Y-35903264D01*
X-6034752Y-35998499D01*
X-6052895Y-36058438D01*
X-6054733Y-36077108D01*
X-6021033Y-36094838D01*
X-5951503Y-36121541D01*
X-5858265Y-36152744D01*
X-5805917Y-36168824D01*
X-5582052Y-36235563D01*
X-5526036Y-36525739D01*
X-5497654Y-36674080D01*
X-5466919Y-36836826D01*
X-5438413Y-36989630D01*
X-5424300Y-37066335D01*
X-5403321Y-37173088D01*
X-5383227Y-37261153D01*
X-5366769Y-37319173D01*
X-5359067Y-37335661D01*
X-5329611Y-37341415D01*
X-5257566Y-37347293D01*
X-5150144Y-37352954D01*
X-5014556Y-37358056D01*
X-4858015Y-37362255D01*
X-4758278Y-37364179D01*
X-4581973Y-37365731D01*
X-4426968Y-37364434D01*
X-4299712Y-37360523D01*
X-4206654Y-37354235D01*
X-4154246Y-37345807D01*
X-4145964Y-37341743D01*
X-4132274Y-37308473D01*
X-4111850Y-37233943D01*
X-4086501Y-37125962D01*
X-4058031Y-36992338D01*
X-4028245Y-36840876D01*
X-4020282Y-36798309D01*
X-3991494Y-36643441D01*
X-3965375Y-36504210D01*
X-3943409Y-36388422D01*
X-3927081Y-36303884D01*
X-3917872Y-36258407D01*
X-3916797Y-36253828D01*
X-3892386Y-36234657D01*
X-3830568Y-36200654D01*
X-3740085Y-36155711D01*
X-3629681Y-36103721D01*
X-3508098Y-36048577D01*
X-3384078Y-35994173D01*
X-3266364Y-35944400D01*
X-3163699Y-35903150D01*
X-3084826Y-35874319D01*
X-3038486Y-35861796D01*
X-3035873Y-35861586D01*
X-3017123Y-35863515D01*
X-2991341Y-35872660D01*
X-2953835Y-35891995D01*
X-2899910Y-35924492D01*
X-2824873Y-35973122D01*
X-2724028Y-36040858D01*
X-2592681Y-36130673D01*
X-2426139Y-36245537D01*
X-2390119Y-36270445D01*
X-2282384Y-36343290D01*
X-2186605Y-36404939D01*
X-2111385Y-36450080D01*
X-2065326Y-36473404D01*
X-2058024Y-36475405D01*
X-2026863Y-36459576D01*
X-1968129Y-36413302D01*
X-1887927Y-36342685D01*
X-1792366Y-36253821D01*
X-1687551Y-36152810D01*
X-1579591Y-36045752D01*
X-1474594Y-35938744D01*
X-1378666Y-35837887D01*
X-1297915Y-35749278D01*
X-1238448Y-35679018D01*
X-1206373Y-35633205D01*
X-1202542Y-35621093D01*
X-1217556Y-35590000D01*
X-1256969Y-35524425D01*
X-1316688Y-35430733D01*
X-1392618Y-35315291D01*
X-1480663Y-35184460D01*
X-1529076Y-35113622D01*
X-1621057Y-34979346D01*
X-1702782Y-34859304D01*
X-1770284Y-34759390D01*
X-1819590Y-34685494D01*
X-1846731Y-34643509D01*
X-1850775Y-34636175D01*
X-1841839Y-34608010D01*
X-1817480Y-34543003D01*
X-1781374Y-34450249D01*
X-1737193Y-34338838D01*
X-1688614Y-34217864D01*
X-1639309Y-34096419D01*
X-1592954Y-33983596D01*
X-1553224Y-33888488D01*
X-1523792Y-33820186D01*
X-1508332Y-33787784D01*
X-1507444Y-33786581D01*
X-1478962Y-33777306D01*
X-1408596Y-33760787D01*
X-1303492Y-33738511D01*
X-1170798Y-33711966D01*
X-1017661Y-33682641D01*
X-929272Y-33666225D01*
X-767612Y-33635716D01*
X-622134Y-33606725D01*
X-500093Y-33580822D01*
X-408744Y-33559580D01*
X-355342Y-33544568D01*
X-344901Y-33539672D01*
X-338970Y-33509905D01*
X-333806Y-33438849D01*
X-329471Y-33334981D01*
X-326025Y-33206778D01*
X-323530Y-33062721D01*
X-322047Y-32911284D01*
X-321636Y-32760948D01*
X-322358Y-32620190D01*
X-324274Y-32497489D01*
X-327446Y-32401323D01*
X-331933Y-32340169D01*
X-336151Y-32322427D01*
X-363537Y-32314058D01*
X-433009Y-32298009D01*
X-537689Y-32275720D01*
X-670703Y-32248629D01*
X-825172Y-32218174D01*
X-942159Y-32195668D01*
X-1534174Y-32082900D01*
X-1706826Y-31668068D01*
X-1879478Y-31253237D01*
X-1536807Y-30751352D01*
X-1194137Y-30249465D01*
X-2073073Y-29370529D01*
X-2574959Y-29713200D01*
D11*
X2571428Y22145619D02*
X3047619Y22145619D01*
X3047619Y23145619D01*
X2238095Y22145619D02*
X2238095Y22812286D01*
X2238095Y23145619D02*
X2285714Y23098000D01*
X2238095Y23050381D01*
X2190476Y23098000D01*
X2238095Y23145619D01*
X2238095Y23050381D01*
X1761905Y22145619D02*
X1761905Y23145619D01*
X1380952Y23145619D01*
X1285714Y23098000D01*
X1238095Y23050381D01*
X1190476Y22955143D01*
X1190476Y22812286D01*
X1238095Y22717048D01*
X1285714Y22669429D01*
X1380952Y22621810D01*
X1761905Y22621810D01*
X619048Y22145619D02*
X714286Y22193238D01*
X761905Y22240857D01*
X809524Y22336095D01*
X809524Y22621810D01*
X761905Y22717048D01*
X714286Y22764667D01*
X619048Y22812286D01*
X476190Y22812286D01*
X380952Y22764667D01*
X333333Y22717048D01*
X285714Y22621810D01*
X285714Y22336095D01*
X333333Y22240857D01*
X380952Y22193238D01*
X476190Y22145619D01*
X619048Y22145619D01*
X-1238096Y22669429D02*
X-1380953Y22621810D01*
X-1428572Y22574190D01*
X-1476191Y22478952D01*
X-1476191Y22336095D01*
X-1428572Y22240857D01*
X-1380953Y22193238D01*
X-1285715Y22145619D01*
X-904762Y22145619D01*
X-904762Y23145619D01*
X-1238096Y23145619D01*
X-1333334Y23098000D01*
X-1380953Y23050381D01*
X-1428572Y22955143D01*
X-1428572Y22859905D01*
X-1380953Y22764667D01*
X-1333334Y22717048D01*
X-1238096Y22669429D01*
X-904762Y22669429D01*
X-1857143Y22431333D02*
X-2333334Y22431333D01*
X-1761905Y22145619D02*
X-2095238Y23145619D01*
X-2428572Y22145619D01*
X-2619048Y23145619D02*
X-3190477Y23145619D01*
X-2904762Y22145619D02*
X-2904762Y23145619D01*
X18185523Y-17108027D02*
X18757943Y-17680447D01*
X18791615Y-17781462D01*
X18791615Y-17848805D01*
X18757943Y-17949820D01*
X18623255Y-18084508D01*
X18522240Y-18118180D01*
X18454897Y-18118180D01*
X18353882Y-18084508D01*
X17781462Y-17512088D01*
X17377400Y-18387553D02*
X17848805Y-18858958D01*
X17276386Y-17949820D02*
X17949821Y-18286538D01*
X17512088Y-18724271D01*
M02*
