(module RFM69HCW (layer F.Cu) (tedit 58DA86C5)
  (attr smd)
  (fp_text reference U3 (at 0 1.27) (layer F.SilkS)
    (effects (font (size 1 1) (thickness 0.15)))
  )
  (fp_text value RFM69HCW (at 0 -1.143) (layer F.SilkS)
    (effects (font (size 1 1) (thickness 0.15)))
  )
  (fp_line (start -10.033 8.001) (end -10.033 8.382) (layer F.SilkS) (width 0.15))
  (fp_line (start -10.033 8.382) (end 10.033 8.382) (layer F.SilkS) (width 0.15))
  (fp_line (start 10.033 8.382) (end 10.033 8.001) (layer F.SilkS) (width 0.15))
  (fp_line (start -9.525 -8.636) (end -9.525 -8.001) (layer F.SilkS) (width 0.15))
  (fp_line (start -10.033 -8.001) (end -10.033 -8.636) (layer F.SilkS) (width 0.15))
  (fp_line (start -10.033 -8.636) (end 10.033 -8.636) (layer F.SilkS) (width 0.15))
  (fp_line (start 10.033 -8.636) (end 10.033 -8.001) (layer F.SilkS) (width 0.15))
  (fp_line (start -10.033 -8.001) (end 10.033 -8.001) (layer F.Fab) (width 0.15))
  (fp_line (start 10.033 -8.001) (end 10.033 8.001) (layer F.Fab) (width 0.15))
  (fp_line (start 10.033 8.001) (end -10.033 8.001) (layer F.Fab) (width 0.15))
  (fp_line (start -10.033 8.001) (end -10.033 -8.001) (layer F.Fab) (width 0.15))
  (fp_line (start -7.474268 -8.273308) (end 7.525732 -8.273308) (layer F.CrtYd) (width 0.05))
  (fp_line (start -7.474268 8.026692) (end -7.474268 -8.273308) (layer F.CrtYd) (width 0.05))
  (fp_line (start 7.525732 8.026692) (end -7.474268 8.026692) (layer F.CrtYd) (width 0.05))
  (fp_line (start 7.525732 -8.273308) (end 7.525732 8.026692) (layer F.CrtYd) (width 0.05))
  (pad 8 smd rect (at -9.441268 6.876692 270) (size 1.5 3) (layers F.Cu F.Paste F.Mask))
  (pad 9 smd rect (at 9.492732 6.876692 270) (size 1.5 3) (layers F.Cu F.Paste F.Mask))
  (pad 7 smd rect (at -9.441268 4.876692 270) (size 1.5 3) (layers F.Cu F.Paste F.Mask))
  (pad 10 smd rect (at 9.492732 4.876692 270) (size 1.5 3) (layers F.Cu F.Paste F.Mask))
  (pad 6 smd rect (at -9.441268 2.876692 270) (size 1.5 3) (layers F.Cu F.Paste F.Mask))
  (pad 11 smd rect (at 9.492732 2.876692 270) (size 1.5 3) (layers F.Cu F.Paste F.Mask))
  (pad 5 smd rect (at -9.441268 0.876692 270) (size 1.5 3) (layers F.Cu F.Paste F.Mask))
  (pad 12 smd rect (at 9.492732 0.876692 270) (size 1.5 3) (layers F.Cu F.Paste F.Mask))
  (pad 4 smd rect (at -9.441268 -1.123308 270) (size 1.5 3) (layers F.Cu F.Paste F.Mask))
  (pad 13 smd rect (at 9.492732 -1.123308 270) (size 1.5 3) (layers F.Cu F.Paste F.Mask))
  (pad 3 smd rect (at -9.441268 -3.123308 270) (size 1.5 3) (layers F.Cu F.Paste F.Mask))
  (pad 14 smd rect (at 9.492732 -3.123308 270) (size 1.5 3) (layers F.Cu F.Paste F.Mask))
  (pad 2 smd rect (at -9.441268 -5.123308 270) (size 1.5 3) (layers F.Cu F.Paste F.Mask))
  (pad 15 smd rect (at 9.492732 -5.123308 270) (size 1.5 3) (layers F.Cu F.Paste F.Mask))
  (pad 1 smd rect (at -9.441268 -7.123308 270) (size 1.5 3) (layers F.Cu F.Paste F.Mask))
  (pad 16 smd rect (at 9.492732 -7.123308 270) (size 1.5 3) (layers F.Cu F.Paste F.Mask))
)
