EESchema Schematic File Version 4
LIBS:power
LIBS:74xx
LIBS:pqws-sensor-hw-cache
EELAYER 26 0
EELAYER END
$Descr A4 11693 8268
encoding utf-8
Sheet 1 1
Title ""
Date ""
Rev ""
Comp ""
Comment1 ""
Comment2 ""
Comment3 ""
Comment4 ""
$EndDescr
$Comp
L lsd-kicad:PQ9-Connector PQ9
U 1 1 59C29771
P 1100 2400
F 0 "PQ9" H 1100 2900 50  0000 C CNN
F 1 "PQ9-Connector" V 1400 2400 50  0000 C CNN
F 2 "lsf-kicad-lib:PQ9" H 1100 2400 50  0001 C CNN
F 3 "" H 1100 2400 50  0001 C CNN
	1    1100 2400
	1    0    0    -1  
$EndComp
$Comp
L bme280:BME280 U1
U 1 1 5AEBD0A1
P 6400 1900
F 0 "U1" H 6400 2337 60  0000 C CNN
F 1 "BME280" H 6400 2231 60  0000 C CNN
F 2 "libraries:BME280" H 6400 1900 60  0001 C CNN
F 3 "" H 6400 1900 60  0001 C CNN
	1    6400 1900
	1    0    0    -1  
$EndComp
$Comp
L lsd-kicad:MQ-7 S2
U 1 1 5AECDDEA
P 4550 5000
F 0 "S2" H 5041 5046 50  0000 L CNN
F 1 "MQ-7" H 5041 4955 50  0000 L CNN
F 2 "lsf-kicad-lib:MQ-7A" H 4500 5500 50  0001 C CNN
F 3 "https://www.sparkfun.com/datasheets/Sensors/Biometric/MQ-7.pdf" H 4850 5600 50  0001 C CNN
	1    4550 5000
	1    0    0    -1  
$EndComp
NoConn ~ 900  2000
NoConn ~ 900  2100
NoConn ~ 900  2200
NoConn ~ 900  2300
NoConn ~ 900  2400
NoConn ~ 900  2500
NoConn ~ 900  2600
NoConn ~ 900  2700
$Comp
L MICS-5524:MICS-5524 U2
U 1 1 5AEC6FB6
P 7800 4450
F 0 "U2" H 7800 4825 50  0000 C CNN
F 1 "MICS-5524" H 7800 4450 50  0001 L BNN
F 2 "MICS-SMD10" H 7800 4450 50  0001 L BNN
F 3 "5.10 USD" H 7800 4450 50  0001 L BNN
F 4 "None" H 7800 4450 50  0001 L BNN "Field4"
F 5 "SMD CO/Hydrocarbons" H 7800 4450 50  0001 L BNN "Field5"
F 6 "SGX Sensortech" H 7800 4450 50  0001 L BNN "Field6"
F 7 "Warning" H 7800 4450 50  0001 L BNN "Field7"
F 8 "MICS-5524" H 7800 4450 50  0001 L BNN "Field8"
	1    7800 4450
	1    0    0    -1  
$EndComp
NoConn ~ 900  2800
$Comp
L pq-atmo-connectors:PQ-I2C J5
U 1 1 5AEE1C09
P 4900 1950
F 0 "J5" H 4895 2275 50  0000 C CNN
F 1 "PQ-I2C" H 4895 2184 50  0000 C CNN
F 2 "Connector_PinHeader_2.00mm:PinHeader_1x04_P2.00mm_Vertical" H 4900 1950 50  0001 C CNN
F 3 "" H 4900 1950 50  0001 C CNN
	1    4900 1950
	-1   0    0    -1  
$EndComp
$Comp
L pq-atmo-connectors:PQ-Sensor J1
U 1 1 5AEE1C8F
P 3350 5100
F 0 "J1" H 3345 4683 50  0000 C CNN
F 1 "PQ-Sensor-PWM" H 3600 4800 50  0000 C CNN
F 2 "Connector_PinHeader_2.00mm:PinHeader_1x04_P2.00mm_Vertical" H 3350 5100 50  0001 C CNN
F 3 "" H 3350 5100 50  0001 C CNN
	1    3350 5100
	-1   0    0    1   
$EndComp
$Comp
L pq-atmo-connectors:PQ-Sensor J4
U 1 1 5AEE1CE7
P 3350 3800
F 0 "J4" H 3350 3400 50  0000 C CNN
F 1 "PQ-Sensor" H 3500 3500 50  0000 C CNN
F 2 "Connector_PinHeader_2.00mm:PinHeader_1x04_P2.00mm_Vertical" H 3350 3800 50  0001 C CNN
F 3 "" H 3350 3800 50  0001 C CNN
	1    3350 3800
	-1   0    0    1   
$EndComp
Wire Wire Line
	5100 1950 5250 1950
Wire Wire Line
	5900 2050 5550 2050
$Comp
L Device:C C1
U 1 1 5AEE2037
P 7000 2250
F 0 "C1" H 6800 2300 50  0000 L CNN
F 1 "100nF" H 6650 2200 50  0000 L CNN
F 2 "Capacitor_SMD:C_0603_1608Metric_Pad0.99x1.00mm_HandSolder" H 7038 2100 50  0001 C CNN
F 3 "~" H 7000 2250 50  0001 C CNN
	1    7000 2250
	1    0    0    -1  
$EndComp
$Comp
L Device:C C2
U 1 1 5AEE20FD
P 7300 2250
F 0 "C2" H 7415 2296 50  0000 L CNN
F 1 "100nF" H 7415 2205 50  0000 L CNN
F 2 "Capacitor_SMD:C_0603_1608Metric_Pad0.99x1.00mm_HandSolder" H 7338 2100 50  0001 C CNN
F 3 "~" H 7300 2250 50  0001 C CNN
	1    7300 2250
	1    0    0    -1  
$EndComp
$Comp
L Device:R R2
U 1 1 5AEE2159
P 5550 1500
F 0 "R2" H 5620 1546 50  0000 L CNN
F 1 "4.7K" H 5620 1455 50  0000 L CNN
F 2 "Resistor_SMD:R_0603_1608Metric_Pad0.99x1.00mm_HandSolder" V 5480 1500 50  0001 C CNN
F 3 "~" H 5550 1500 50  0001 C CNN
	1    5550 1500
	1    0    0    -1  
$EndComp
$Comp
L Device:R R1
U 1 1 5AEE21E7
P 5250 1500
F 0 "R1" H 5320 1546 50  0000 L CNN
F 1 "4.7K" H 5320 1455 50  0000 L CNN
F 2 "Resistor_SMD:R_0603_1608Metric_Pad0.99x1.00mm_HandSolder" V 5180 1500 50  0001 C CNN
F 3 "~" H 5250 1500 50  0001 C CNN
	1    5250 1500
	1    0    0    -1  
$EndComp
Wire Wire Line
	6900 1750 7300 1750
Wire Wire Line
	5250 1650 5250 1950
Connection ~ 5250 1950
Wire Wire Line
	5250 1950 5900 1950
Wire Wire Line
	5550 1650 5550 2050
Connection ~ 5550 2050
Wire Wire Line
	5550 2050 5100 2050
Wire Wire Line
	5100 1850 5100 1350
Wire Wire Line
	5100 1350 5250 1350
Wire Wire Line
	6900 1950 7000 1950
Wire Wire Line
	7300 1950 7300 1750
Connection ~ 7300 1750
Wire Wire Line
	7300 1350 7300 1750
$Comp
L Device:Jumper_NC_Dual JP1
U 1 1 5AEE2B14
P 7750 2050
F 0 "JP1" V 7704 2152 50  0000 L CNN
F 1 "BME Address" V 7795 2152 50  0000 L CNN
F 2 "Jumper:SolderJumper-3_P1.3mm_Open_RoundedPad1.0x1.5mm_NumberLabels" H 7750 2050 50  0001 C CNN
F 3 "~" H 7750 2050 50  0001 C CNN
	1    7750 2050
	0    1    1    0   
$EndComp
Wire Wire Line
	7650 2050 6900 2050
Wire Wire Line
	7750 1800 7750 1750
Wire Wire Line
	7750 1750 7300 1750
Wire Wire Line
	7000 2100 7000 1950
Connection ~ 7000 1950
Wire Wire Line
	7000 1950 7300 1950
Wire Wire Line
	7300 2100 7300 1950
Connection ~ 7300 1950
$Comp
L power:GND #PWR04
U 1 1 5AEE35C0
P 7000 2450
F 0 "#PWR04" H 7000 2200 50  0001 C CNN
F 1 "GND" H 7005 2277 50  0000 C CNN
F 2 "" H 7000 2450 50  0001 C CNN
F 3 "" H 7000 2450 50  0001 C CNN
	1    7000 2450
	1    0    0    -1  
$EndComp
$Comp
L power:GND #PWR05
U 1 1 5AEE35EC
P 7300 2450
F 0 "#PWR05" H 7300 2200 50  0001 C CNN
F 1 "GND" H 7305 2277 50  0000 C CNN
F 2 "" H 7300 2450 50  0001 C CNN
F 3 "" H 7300 2450 50  0001 C CNN
	1    7300 2450
	1    0    0    -1  
$EndComp
$Comp
L power:GND #PWR03
U 1 1 5AEE3616
P 6950 1850
F 0 "#PWR03" H 6950 1600 50  0001 C CNN
F 1 "GND" V 6955 1722 50  0000 R CNN
F 2 "" H 6950 1850 50  0001 C CNN
F 3 "" H 6950 1850 50  0001 C CNN
	1    6950 1850
	0    -1   -1   0   
$EndComp
$Comp
L power:GND #PWR02
U 1 1 5AEE3667
P 5850 1750
F 0 "#PWR02" H 5850 1500 50  0001 C CNN
F 1 "GND" V 5855 1622 50  0000 R CNN
F 2 "" H 5850 1750 50  0001 C CNN
F 3 "" H 5850 1750 50  0001 C CNN
	1    5850 1750
	0    1    1    0   
$EndComp
Wire Wire Line
	5550 1350 6250 1350
Connection ~ 5550 1350
Wire Wire Line
	5850 1750 5900 1750
Wire Wire Line
	6900 1850 6950 1850
Wire Wire Line
	7000 2400 7000 2450
Wire Wire Line
	7300 2400 7300 2450
$Comp
L power:GND #PWR06
U 1 1 5AEE5088
P 7750 2450
F 0 "#PWR06" H 7750 2200 50  0001 C CNN
F 1 "GND" H 7755 2277 50  0000 C CNN
F 2 "" H 7750 2450 50  0001 C CNN
F 3 "" H 7750 2450 50  0001 C CNN
	1    7750 2450
	1    0    0    -1  
$EndComp
Wire Wire Line
	7750 2450 7750 2300
$Comp
L power:GND #PWR01
U 1 1 5AEE55E9
P 5100 2200
F 0 "#PWR01" H 5100 1950 50  0001 C CNN
F 1 "GND" H 5105 2027 50  0000 C CNN
F 2 "" H 5100 2200 50  0001 C CNN
F 3 "" H 5100 2200 50  0001 C CNN
	1    5100 2200
	1    0    0    -1  
$EndComp
Wire Wire Line
	5100 2150 5100 2200
Connection ~ 5100 1850
Wire Wire Line
	5100 1850 5900 1850
Connection ~ 5250 1350
Wire Wire Line
	5250 1350 5550 1350
Text Label 5600 1350 0    50   ~ 0
BME_VDD
Text Label 5300 1950 0    50   ~ 0
SDI
Text Label 5300 2050 0    50   ~ 0
SCK
Text Label 7400 2050 0    50   ~ 0
SDO
Text Label 5300 1850 0    50   ~ 0
CSB
$Comp
L Device:R R3
U 1 1 5AEEA719
P 4100 3950
F 0 "R3" H 4170 3996 50  0000 L CNN
F 1 "R" H 4170 3905 50  0000 L CNN
F 2 "Resistor_SMD:R_0603_1608Metric_Pad0.99x1.00mm_HandSolder" V 4030 3950 50  0001 C CNN
F 3 "~" H 4100 3950 50  0001 C CNN
	1    4100 3950
	1    0    0    -1  
$EndComp
$Comp
L power:GND #PWR0101
U 1 1 5AEEB285
P 3550 4000
F 0 "#PWR0101" H 3550 3750 50  0001 C CNN
F 1 "GND" H 3555 3827 50  0000 C CNN
F 2 "" H 3550 4000 50  0001 C CNN
F 3 "" H 3550 4000 50  0001 C CNN
	1    3550 4000
	1    0    0    -1  
$EndComp
$Comp
L power:GND #PWR0102
U 1 1 5AEEB2B3
P 3550 5300
F 0 "#PWR0102" H 3550 5050 50  0001 C CNN
F 1 "GND" H 3555 5127 50  0000 C CNN
F 2 "" H 3550 5300 50  0001 C CNN
F 3 "" H 3550 5300 50  0001 C CNN
	1    3550 5300
	1    0    0    -1  
$EndComp
$Comp
L power:GND #PWR0103
U 1 1 5AEEB2DF
P 4550 5450
F 0 "#PWR0103" H 4550 5200 50  0001 C CNN
F 1 "GND" H 4555 5277 50  0000 C CNN
F 2 "" H 4550 5450 50  0001 C CNN
F 3 "" H 4550 5450 50  0001 C CNN
	1    4550 5450
	1    0    0    -1  
$EndComp
$Comp
L power:GND #PWR0104
U 1 1 5AEEB30B
P 4550 4150
F 0 "#PWR0104" H 4550 3900 50  0001 C CNN
F 1 "GND" H 4555 3977 50  0000 C CNN
F 2 "" H 4550 4150 50  0001 C CNN
F 3 "" H 4550 4150 50  0001 C CNN
	1    4550 4150
	1    0    0    -1  
$EndComp
$Comp
L power:GND #PWR0105
U 1 1 5AEEB337
P 4100 4150
F 0 "#PWR0105" H 4100 3900 50  0001 C CNN
F 1 "GND" H 4105 3977 50  0000 C CNN
F 2 "" H 4100 4150 50  0001 C CNN
F 3 "" H 4100 4150 50  0001 C CNN
	1    4100 4150
	1    0    0    -1  
$EndComp
$Comp
L Device:R R4
U 1 1 5AEEB494
P 4100 5250
F 0 "R4" H 4170 5296 50  0000 L CNN
F 1 "R" H 4170 5205 50  0000 L CNN
F 2 "Resistor_SMD:R_0603_1608Metric_Pad0.99x1.00mm_HandSolder" V 4030 5250 50  0001 C CNN
F 3 "~" H 4100 5250 50  0001 C CNN
	1    4100 5250
	1    0    0    -1  
$EndComp
$Comp
L power:GND #PWR0106
U 1 1 5AEEB49A
P 4100 5450
F 0 "#PWR0106" H 4100 5200 50  0001 C CNN
F 1 "GND" H 4105 5277 50  0000 C CNN
F 2 "" H 4100 5450 50  0001 C CNN
F 3 "" H 4100 5450 50  0001 C CNN
	1    4100 5450
	1    0    0    -1  
$EndComp
Wire Wire Line
	3550 3900 3550 4000
Wire Wire Line
	4100 4100 4100 4150
Wire Wire Line
	4100 3700 4100 3800
Wire Wire Line
	4100 3700 3550 3700
Wire Wire Line
	4550 4050 4550 4150
Wire Wire Line
	3600 3350 3600 3800
Wire Wire Line
	3600 3800 3550 3800
Wire Wire Line
	4550 3350 3600 3350
Wire Wire Line
	3550 5200 3550 5300
Wire Wire Line
	4100 5000 4100 5100
Wire Wire Line
	4100 5400 4100 5450
Wire Wire Line
	4550 5350 4550 5450
Connection ~ 4100 5000
Wire Wire Line
	3550 5100 3600 5100
Wire Wire Line
	3600 4650 4550 4650
Connection ~ 4100 3700
$Comp
L lsd-kicad:MQ-131 S1
U 1 1 5AECB8AB
P 4550 3700
F 0 "S1" H 5041 3746 50  0000 L CNN
F 1 "MQ-131" H 5041 3655 50  0000 L CNN
F 2 "lsf-kicad-lib:MQ-131" H 4500 4200 50  0001 C CNN
F 3 "https://www.sparkfun.com/datasheets/Sensors/Biometric/MQ-7.pdf" H 4850 4300 50  0001 C CNN
	1    4550 3700
	1    0    0    -1  
$EndComp
Wire Wire Line
	3550 3600 3550 3300
Wire Wire Line
	3550 3300 5000 3300
Wire Wire Line
	5000 3300 5000 3700
Text Label 4200 3300 0    50   ~ 0
MQ-131_Vc
Text Label 4250 4600 0    50   ~ 0
MQ-7_Vc
Wire Wire Line
	3550 4900 3550 4600
Wire Wire Line
	3550 4600 5000 4600
Wire Wire Line
	5000 4600 5000 5000
Text Label 4100 5100 2    50   ~ 0
MQ-7_VRL
Text Label 4100 3800 2    50   ~ 0
MQ-131_VRL
Wire Wire Line
	3550 5000 3600 5000
Text Label 3600 4800 0    50   ~ 0
MQ-7_VH
Text Label 3600 3500 0    50   ~ 0
MQ-131_VH
$Comp
L pq-atmo-connectors:PQ-Sensor J3
U 1 1 5AEFF5CF
P 6400 4350
F 0 "J3" H 6400 3950 50  0000 C CNN
F 1 "PQ-Sensor" H 6550 4050 50  0000 C CNN
F 2 "Connector_PinHeader_2.00mm:PinHeader_1x04_P2.00mm_Vertical" H 6400 4350 50  0001 C CNN
F 3 "" H 6400 4350 50  0001 C CNN
	1    6400 4350
	-1   0    0    1   
$EndComp
$Comp
L Device:R R5
U 1 1 5AEFF94E
P 6850 4950
F 0 "R5" H 6920 4996 50  0000 L CNN
F 1 "82" H 6920 4905 50  0000 L CNN
F 2 "Resistor_SMD:R_0603_1608Metric_Pad0.99x1.00mm_HandSolder" V 6780 4950 50  0001 C CNN
F 3 "~" H 6850 4950 50  0001 C CNN
	1    6850 4950
	1    0    0    -1  
$EndComp
$Comp
L Device:R R6
U 1 1 5AEFFB25
P 7100 4950
F 0 "R6" H 7170 4996 50  0000 L CNN
F 1 "1K" H 7170 4905 50  0000 L CNN
F 2 "Resistor_SMD:R_0603_1608Metric_Pad0.99x1.00mm_HandSolder" V 7030 4950 50  0001 C CNN
F 3 "~" H 7100 4950 50  0001 C CNN
	1    7100 4950
	1    0    0    -1  
$EndComp
Wire Wire Line
	7300 4550 6850 4550
Wire Wire Line
	6850 4550 6850 4800
Wire Wire Line
	7300 4650 7100 4650
Wire Wire Line
	7100 4650 7100 4800
Wire Wire Line
	6600 4350 6950 4350
Wire Wire Line
	6950 4350 6950 4000
Wire Wire Line
	6950 4000 8400 4000
Wire Wire Line
	8400 4000 8400 4450
Wire Wire Line
	8400 4450 8300 4450
Wire Wire Line
	8300 4450 8300 4550
Connection ~ 8300 4450
$Comp
L power:GND #PWR08
U 1 1 5AF03628
P 6850 5150
F 0 "#PWR08" H 6850 4900 50  0001 C CNN
F 1 "GND" H 6855 4977 50  0000 C CNN
F 2 "" H 6850 5150 50  0001 C CNN
F 3 "" H 6850 5150 50  0001 C CNN
	1    6850 5150
	1    0    0    -1  
$EndComp
$Comp
L power:GND #PWR09
U 1 1 5AF0365E
P 7100 5150
F 0 "#PWR09" H 7100 4900 50  0001 C CNN
F 1 "GND" H 7105 4977 50  0000 C CNN
F 2 "" H 7100 5150 50  0001 C CNN
F 3 "" H 7100 5150 50  0001 C CNN
	1    7100 5150
	1    0    0    -1  
$EndComp
Wire Wire Line
	7100 5150 7100 5100
Wire Wire Line
	6850 5150 6850 5100
$Comp
L power:GND #PWR07
U 1 1 5AF068A6
P 6600 4550
F 0 "#PWR07" H 6600 4300 50  0001 C CNN
F 1 "GND" H 6605 4377 50  0000 C CNN
F 2 "" H 6600 4550 50  0001 C CNN
F 3 "" H 6600 4550 50  0001 C CNN
	1    6600 4550
	1    0    0    -1  
$EndComp
Wire Wire Line
	6600 4450 6600 4550
Wire Wire Line
	6600 4150 7100 4150
Wire Wire Line
	7100 4150 7100 4650
Connection ~ 7100 4650
$Comp
L power:PWR_FLAG #FLG0101
U 1 1 5AF09850
P 6250 1350
F 0 "#FLG0101" H 6250 1425 50  0001 C CNN
F 1 "PWR_FLAG" H 6250 1524 50  0000 C CNN
F 2 "" H 6250 1350 50  0001 C CNN
F 3 "~" H 6250 1350 50  0001 C CNN
	1    6250 1350
	1    0    0    -1  
$EndComp
Connection ~ 6250 1350
Wire Wire Line
	6250 1350 7300 1350
NoConn ~ 8300 4250
NoConn ~ 8300 4350
NoConn ~ 8300 4650
NoConn ~ 7300 4250
NoConn ~ 7300 4350
NoConn ~ 7300 4450
NoConn ~ 6600 4250
$Comp
L power:PWR_FLAG #FLG0102
U 1 1 5AF11FC2
P 1100 1300
F 0 "#FLG0102" H 1100 1375 50  0001 C CNN
F 1 "PWR_FLAG" H 1100 1474 50  0000 C CNN
F 2 "" H 1100 1300 50  0001 C CNN
F 3 "~" H 1100 1300 50  0001 C CNN
	1    1100 1300
	1    0    0    -1  
$EndComp
$Comp
L power:GND #PWR0107
U 1 1 5AF12045
P 1100 1300
F 0 "#PWR0107" H 1100 1050 50  0001 C CNN
F 1 "GND" H 1105 1127 50  0000 C CNN
F 2 "" H 1100 1300 50  0001 C CNN
F 3 "" H 1100 1300 50  0001 C CNN
	1    1100 1300
	1    0    0    -1  
$EndComp
Wire Wire Line
	3600 5000 4100 5000
Wire Wire Line
	3600 4650 3600 5100
$EndSCHEMATC
