(export (version D)
  (design
    (source /home/liknus/git/pqws-main-hw/pqws-main-hw.sch)
    (date "Wed 28 Feb 2018 11:12:22 AM EET")
    (tool "Eeschema (5.0.0-rc2-dev-30-geb94d2fcd)")
    (sheet (number 1) (name /) (tstamps /)
      (title_block
        (title "PQWS Main board")
        (company "Libre Space Foundation")
        (rev)
        (date 2017-12-05)
        (source pqws-main-hw.sch)
        (comment (number 1) (value ""))
        (comment (number 2) (value ""))
        (comment (number 3) (value ""))
        (comment (number 4) (value ""))))
    (sheet (number 2) (name /Radio/) (tstamps /5A285DD6/)
      (title_block
        (title "PQWS Main board - COMMS")
        (company "Libre Space Foundation")
        (rev)
        (date 2017-12-05)
        (source Radio.sch)
        (comment (number 1) (value ""))
        (comment (number 2) (value ""))
        (comment (number 3) (value ""))
        (comment (number 4) (value ""))))
    (sheet (number 3) (name "/Radio/Power Amplifier/") (tstamps /5A285DD6/5A7D0D5C/)
      (title_block
        (title)
        (company)
        (rev)
        (date)
        (source Power_Amplifier.sch)
        (comment (number 1) (value ""))
        (comment (number 2) (value ""))
        (comment (number 3) (value ""))
        (comment (number 4) (value ""))))
    (sheet (number 4) (name "/Data Logging/") (tstamps /5A285E0E/)
      (title_block
        (title "PQWS Main board - Data logging")
        (company "Libre Space Foundation")
        (rev)
        (date 2017-12-05)
        (source Data_logging.sch)
        (comment (number 1) (value ""))
        (comment (number 2) (value ""))
        (comment (number 3) (value ""))
        (comment (number 4) (value ""))))
    (sheet (number 5) (name /MCU/) (tstamps /5A285DD1/)
      (title_block
        (title "PQWS Main board - MCU")
        (company "Libre Space Foundation")
        (rev)
        (date 2017-12-05)
        (source MCU.sch)
        (comment (number 1) (value ""))
        (comment (number 2) (value ""))
        (comment (number 3) (value ""))
        (comment (number 4) (value ""))))
    (sheet (number 6) (name "/PQ Bus/") (tstamps /5A289551/)
      (title_block
        (title "PQWS Main board - PQ9 Interface")
        (company "Libre Space Foundation")
        (rev)
        (date 2017-12-05)
        (source PQ_Bus.sch)
        (comment (number 1) (value ""))
        (comment (number 2) (value ""))
        (comment (number 3) (value ""))
        (comment (number 4) (value "")))))
  (components
    (comp (ref J3)
      (value RS485)
      (footprint Connector_PinHeader_2.00mm:PinHeader_1x03_P2.00mm_Vertical_SMD_Pin1Left)
      (libsource (lib Connector_Generic) (part Conn_01x03))
      (sheetpath (names /) (tstamps /))
      (tstamp 5A8765CF))
    (comp (ref J4)
      (value SWD)
      (footprint Connector_JST:JST_SH_SM04B-SRSS-TB_1x04_P1.00mm_Horizontal)
      (libsource (lib Connector_Generic) (part Conn_01x04))
      (sheetpath (names /) (tstamps /))
      (tstamp 5A943331))
    (comp (ref C21)
      (value C)
      (footprint Capacitor_SMD:C_0603_1608Metric_Pad0.84x1.00mm_HandSolder)
      (libsource (lib Device) (part C))
      (sheetpath (names /Radio/) (tstamps /5A285DD6/))
      (tstamp 5A7C4720))
    (comp (ref L8)
      (value 100nH)
      (footprint Inductor_SMD:L_0603_1608Metric_Pad0.84x1.00mm_HandSolder)
      (libsource (lib Device) (part L))
      (sheetpath (names /Radio/) (tstamps /5A285DD6/))
      (tstamp 5A7C4DB2))
    (comp (ref L11)
      (value L)
      (footprint Inductor_SMD:L_0603_1608Metric_Pad0.84x1.00mm_HandSolder)
      (libsource (lib Device) (part L))
      (sheetpath (names /Radio/) (tstamps /5A285DD6/))
      (tstamp 5A7C4DE9))
    (comp (ref L10)
      (value 27nH)
      (footprint Inductor_SMD:L_0603_1608Metric_Pad0.84x1.00mm_HandSolder)
      (libsource (lib Device) (part L))
      (sheetpath (names /Radio/) (tstamps /5A285DD6/))
      (tstamp 5A7C4E06))
    (comp (ref L6)
      (value 27nH)
      (footprint Inductor_SMD:L_0603_1608Metric_Pad0.84x1.00mm_HandSolder)
      (libsource (lib Device) (part L))
      (sheetpath (names /Radio/) (tstamps /5A285DD6/))
      (tstamp 5A7C4E83))
    (comp (ref L9)
      (value L)
      (footprint Inductor_SMD:L_0603_1608Metric_Pad0.84x1.00mm_HandSolder)
      (libsource (lib Device) (part L))
      (sheetpath (names /Radio/) (tstamps /5A285DD6/))
      (tstamp 5A7C4EE4))
    (comp (ref L7)
      (value L)
      (footprint Inductor_SMD:L_0603_1608Metric_Pad0.84x1.00mm_HandSolder)
      (libsource (lib Device) (part L))
      (sheetpath (names /Radio/) (tstamps /5A285DD6/))
      (tstamp 5A7C4F29))
    (comp (ref C19)
      (value C)
      (footprint Capacitor_SMD:C_0603_1608Metric_Pad0.84x1.00mm_HandSolder)
      (libsource (lib Device) (part C))
      (sheetpath (names /Radio/) (tstamps /5A285DD6/))
      (tstamp 5A7C4F4E))
    (comp (ref C20)
      (value C)
      (footprint Capacitor_SMD:C_0603_1608Metric_Pad0.84x1.00mm_HandSolder)
      (libsource (lib Device) (part C))
      (sheetpath (names /Radio/) (tstamps /5A285DD6/))
      (tstamp 5A7C4FC3))
    (comp (ref C15)
      (value 11pF)
      (footprint Capacitor_SMD:C_0603_1608Metric_Pad0.84x1.00mm_HandSolder)
      (libsource (lib Device) (part C))
      (sheetpath (names /Radio/) (tstamps /5A285DD6/))
      (tstamp 5A7C5024))
    (comp (ref C16)
      (value 5.1pF)
      (footprint Capacitor_SMD:C_0603_1608Metric_Pad0.84x1.00mm_HandSolder)
      (libsource (lib Device) (part C))
      (sheetpath (names /Radio/) (tstamps /5A285DD6/))
      (tstamp 5A7C5091))
    (comp (ref C13)
      (value 220pF)
      (footprint Capacitor_SMD:C_0603_1608Metric_Pad0.84x1.00mm_HandSolder)
      (libsource (lib Device) (part C))
      (sheetpath (names /Radio/) (tstamps /5A285DD6/))
      (tstamp 5A7C50D8))
    (comp (ref C18)
      (value C)
      (footprint Capacitor_SMD:C_0603_1608Metric_Pad0.84x1.00mm_HandSolder)
      (libsource (lib Device) (part C))
      (sheetpath (names /Radio/) (tstamps /5A285DD6/))
      (tstamp 5A7C5113))
    (comp (ref C17)
      (value C)
      (footprint Capacitor_SMD:C_0603_1608Metric_Pad0.84x1.00mm_HandSolder)
      (libsource (lib Device) (part C))
      (sheetpath (names /Radio/) (tstamps /5A285DD6/))
      (tstamp 5A7C515E))
    (comp (ref C14)
      (value C)
      (footprint Capacitor_SMD:C_0603_1608Metric_Pad0.84x1.00mm_HandSolder)
      (libsource (lib Device) (part C))
      (sheetpath (names /Radio/) (tstamps /5A285DD6/))
      (tstamp 5A7C51C3))
    (comp (ref U3)
      (value SKY13351)
      (footprint gsg-modules:SKY13351-378LF)
      (datasheet http://www.skyworksinc.com/uploads/documents/SKY13351_378LF_201132I.pdf)
      (libsource (lib lsd-kicad) (part SKY13351))
      (sheetpath (names /Radio/) (tstamps /5A285DD6/))
      (tstamp 5A7C6BBC))
    (comp (ref J2)
      (value Conn_Coaxial)
      (footprint Connector_Coaxial:U.FL_Hirose_U.FL-R-SMT-1_Vertical)
      (libsource (lib Connector_Specialized) (part Conn_Coaxial))
      (sheetpath (names /Radio/) (tstamps /5A285DD6/))
      (tstamp 5A7C6E33))
    (comp (ref U4)
      (value AX5043)
      (footprint Package_DFN_QFN:QFN-28-1EP_5x5mm_P0.5mm_EP3.35x3.35mm)
      (datasheet https://www.onsemi.com/pub/Collateral/AX5043-D.PDF)
      (libsource (lib lsd-kicad) (part AX5043))
      (sheetpath (names /Radio/) (tstamps /5A285DD6/))
      (tstamp 5A7DC5A0))
    (comp (ref U2)
      (value KT1612A)
      (footprint lsf-kicad-lib:KT1612A)
      (datasheet https://www.mouser.com/ds/2/40/kt1612_e-1140390.pdf)
      (libsource (lib lsd-kicad) (part KT1612A))
      (sheetpath (names /Radio/) (tstamps /5A285DD6/))
      (tstamp 5A8A39F7))
    (comp (ref C30)
      (value 1nF)
      (footprint Capacitor_SMD:C_0603_1608Metric_Pad0.84x1.00mm_HandSolder)
      (libsource (lib Device) (part C))
      (sheetpath (names /Radio/) (tstamps /5A285DD6/))
      (tstamp 5A85FC99))
    (comp (ref C29)
      (value 10pF)
      (footprint Capacitor_SMD:C_0603_1608Metric_Pad0.84x1.00mm_HandSolder)
      (libsource (lib Device) (part C))
      (sheetpath (names /Radio/) (tstamps /5A285DD6/))
      (tstamp 5A85FF47))
    (comp (ref C28)
      (value 10nF)
      (footprint Capacitor_SMD:C_0603_1608Metric_Pad0.84x1.00mm_HandSolder)
      (libsource (lib Device) (part C))
      (sheetpath (names /Radio/) (tstamps /5A285DD6/))
      (tstamp 5A85FFB0))
    (comp (ref L12)
      (value 43nH)
      (footprint Inductor_SMD:L_0603_1608Metric_Pad0.84x1.00mm_HandSolder)
      (libsource (lib Device) (part L))
      (sheetpath (names /Radio/) (tstamps /5A285DD6/))
      (tstamp 5A8E1013))
    (comp (ref C2)
      (value 4.3pF)
      (footprint Capacitor_SMD:C_0603_1608Metric_Pad0.84x1.00mm_HandSolder)
      (libsource (lib Device) (part C))
      (sheetpath (names /Radio/) (tstamps /5A285DD6/))
      (tstamp 5A8E1069))
    (comp (ref C1)
      (value 5.6pF)
      (footprint Capacitor_SMD:C_0603_1608Metric_Pad0.84x1.00mm_HandSolder)
      (libsource (lib Device) (part C))
      (sheetpath (names /Radio/) (tstamps /5A285DD6/))
      (tstamp 5A8EFBDB))
    (comp (ref L13)
      (value 43nH)
      (footprint Inductor_SMD:L_0603_1608Metric_Pad0.84x1.00mm_HandSolder)
      (libsource (lib Device) (part L))
      (sheetpath (names /Radio/) (tstamps /5A285DD6/))
      (tstamp 5A8F88B6))
    (comp (ref C31)
      (value 4.3pF)
      (footprint Capacitor_SMD:C_0603_1608Metric_Pad0.84x1.00mm_HandSolder)
      (libsource (lib Device) (part C))
      (sheetpath (names /Radio/) (tstamps /5A285DD6/))
      (tstamp 5A8F88BC))
    (comp (ref L14)
      (value 100nH)
      (footprint Inductor_SMD:L_0603_1608Metric_Pad0.84x1.00mm_HandSolder)
      (libsource (lib Device) (part L))
      (sheetpath (names /Radio/) (tstamps /5A285DD6/))
      (tstamp 5A8FF8A8))
    (comp (ref C34)
      (value 33pF)
      (footprint Capacitor_SMD:C_0603_1608Metric_Pad0.84x1.00mm_HandSolder)
      (libsource (lib Device) (part C))
      (sheetpath (names /Radio/) (tstamps /5A285DD6/))
      (tstamp 5A939CBE))
    (comp (ref L3)
      (value 33nH)
      (footprint Inductor_SMD:L_0603_1608Metric_Pad0.84x1.00mm_HandSolder)
      (fields
        (field (name "Part Number") LL1608--FH33NK))
      (libsource (lib Device) (part L))
      (sheetpath (names "/Radio/Power Amplifier/") (tstamps /5A285DD6/5A7D0D5C/))
      (tstamp 5A7D1DA8))
    (comp (ref L4)
      (value 33nH)
      (footprint Inductor_SMD:L_0603_1608Metric_Pad0.84x1.00mm_HandSolder)
      (fields
        (field (name "Part Number") LL1608--FSL33NJ))
      (libsource (lib Device) (part L))
      (sheetpath (names "/Radio/Power Amplifier/") (tstamps /5A285DD6/5A7D0D5C/))
      (tstamp 5A7D1DAF))
    (comp (ref L5)
      (value 33nH)
      (footprint Inductor_SMD:L_0603_1608Metric_Pad0.84x1.00mm_HandSolder)
      (fields
        (field (name "Part Number") LL1005--FH33NK))
      (libsource (lib Device) (part L))
      (sheetpath (names "/Radio/Power Amplifier/") (tstamps /5A285DD6/5A7D0D5C/))
      (tstamp 5A7D1DB6))
    (comp (ref L1)
      (value 22nH)
      (footprint Inductor_SMD:L_0603_1608Metric_Pad0.84x1.00mm_HandSolder)
      (libsource (lib Device) (part L))
      (sheetpath (names "/Radio/Power Amplifier/") (tstamps /5A285DD6/5A7D0D5C/))
      (tstamp 5A7D1DBD))
    (comp (ref L2)
      (value 33nH)
      (footprint Inductor_SMD:L_0603_1608Metric_Pad0.84x1.00mm_HandSolder)
      (fields
        (field (name "Part Number") LL1608--FH33NK))
      (libsource (lib Device) (part L))
      (sheetpath (names "/Radio/Power Amplifier/") (tstamps /5A285DD6/5A7D0D5C/))
      (tstamp 5A7D1DC4))
    (comp (ref C3)
      (value 220pF)
      (footprint Capacitor_SMD:C_0603_1608Metric_Pad0.84x1.00mm_HandSolder)
      (libsource (lib Device) (part C))
      (sheetpath (names "/Radio/Power Amplifier/") (tstamps /5A285DD6/5A7D0D5C/))
      (tstamp 5A7D1DCB))
    (comp (ref C11)
      (value 4.7uF)
      (footprint Capacitor_SMD:C_0603_1608Metric_Pad0.84x1.00mm_HandSolder)
      (libsource (lib Device) (part C))
      (sheetpath (names "/Radio/Power Amplifier/") (tstamps /5A285DD6/5A7D0D5C/))
      (tstamp 5A7D1DD2))
    (comp (ref C12)
      (value 1000pF)
      (footprint Capacitor_SMD:C_0603_1608Metric_Pad0.84x1.00mm_HandSolder)
      (libsource (lib Device) (part C))
      (sheetpath (names "/Radio/Power Amplifier/") (tstamps /5A285DD6/5A7D0D5C/))
      (tstamp 5A7D1DD9))
    (comp (ref C8)
      (value 1uF)
      (footprint Capacitor_SMD:C_0603_1608Metric_Pad0.84x1.00mm_HandSolder)
      (fields
        (field (name PartNumber) GRM188R61A105KA61ND))
      (libsource (lib Device) (part C))
      (sheetpath (names "/Radio/Power Amplifier/") (tstamps /5A285DD6/5A7D0D5C/))
      (tstamp 5A7D1DE0))
    (comp (ref C10)
      (value 3.3pF)
      (footprint Capacitor_SMD:C_0603_1608Metric_Pad0.84x1.00mm_HandSolder)
      (libsource (lib Device) (part C))
      (sheetpath (names "/Radio/Power Amplifier/") (tstamps /5A285DD6/5A7D0D5C/))
      (tstamp 5A7D1DE7))
    (comp (ref C7)
      (value 100pF)
      (footprint Capacitor_SMD:C_0603_1608Metric_Pad0.84x1.00mm_HandSolder)
      (libsource (lib Device) (part C))
      (sheetpath (names "/Radio/Power Amplifier/") (tstamps /5A285DD6/5A7D0D5C/))
      (tstamp 5A7D1DEE))
    (comp (ref C5)
      (value 100pF)
      (footprint Capacitor_SMD:C_0603_1608Metric_Pad0.84x1.00mm_HandSolder)
      (libsource (lib Device) (part C))
      (sheetpath (names "/Radio/Power Amplifier/") (tstamps /5A285DD6/5A7D0D5C/))
      (tstamp 5A7D1DF5))
    (comp (ref C4)
      (value 33pF)
      (footprint Capacitor_SMD:C_0603_1608Metric_Pad0.84x1.00mm_HandSolder)
      (libsource (lib Device) (part C))
      (sheetpath (names "/Radio/Power Amplifier/") (tstamps /5A285DD6/5A7D0D5C/))
      (tstamp 5A7D1E2C))
    (comp (ref R2)
      (value 1.8K)
      (footprint Resistor_SMD:R_0603_1608Metric_Pad0.84x1.00mm_HandSolder)
      (libsource (lib Device) (part R))
      (sheetpath (names "/Radio/Power Amplifier/") (tstamps /5A285DD6/5A7D0D5C/))
      (tstamp 5A7D1E45))
    (comp (ref R1)
      (value 2.2K)
      (footprint Resistor_SMD:R_0603_1608Metric_Pad0.84x1.00mm_HandSolder)
      (libsource (lib Device) (part R))
      (sheetpath (names "/Radio/Power Amplifier/") (tstamps /5A285DD6/5A7D0D5C/))
      (tstamp 5A7D1E4C))
    (comp (ref C6)
      (value 100pF)
      (footprint Capacitor_SMD:C_0603_1608Metric_Pad0.84x1.00mm_HandSolder)
      (libsource (lib Device) (part C))
      (sheetpath (names "/Radio/Power Amplifier/") (tstamps /5A285DD6/5A7D0D5C/))
      (tstamp 5A7D1E53))
    (comp (ref C9)
      (value 1uF)
      (footprint Capacitor_SMD:C_0603_1608Metric_Pad0.84x1.00mm_HandSolder)
      (fields
        (field (name PartNumber) GRM188R61A105KA61ND))
      (libsource (lib Device) (part C))
      (sheetpath (names "/Radio/Power Amplifier/") (tstamps /5A285DD6/5A7D0D5C/))
      (tstamp 5A7D87E7))
    (comp (ref U5)
      (value MMZ09332B)
      (footprint lsf-kicad-lib:MMZ09332B)
      (datasheet https://www.nxp.com/docs/en/data-sheet/MMZ09332B.pdf)
      (libsource (lib lsd-kicad) (part MMZ09332B))
      (sheetpath (names "/Radio/Power Amplifier/") (tstamps /5A285DD6/5A7D0D5C/))
      (tstamp 5A7DBC7A))
    (comp (ref J1)
      (value Micro_SD_Card_Det_Hirose_DM3AT)
      (footprint Connector_Card:microSD_HC_Hirose_DM3D-SF)
      (libsource (lib Connector_Specialized) (part Micro_SD_Card_Det))
      (sheetpath (names "/Data Logging/") (tstamps /5A285E0E/))
      (tstamp 5A286C02))
    (comp (ref R3)
      (value 47K)
      (footprint Resistor_SMD:R_0603_1608Metric_Pad0.84x1.00mm_HandSolder)
      (libsource (lib Device) (part R))
      (sheetpath (names "/Data Logging/") (tstamps /5A285E0E/))
      (tstamp 5A90169A))
    (comp (ref R4)
      (value 47K)
      (footprint Resistor_SMD:R_0603_1608Metric_Pad0.84x1.00mm_HandSolder)
      (libsource (lib Device) (part R))
      (sheetpath (names "/Data Logging/") (tstamps /5A285E0E/))
      (tstamp 5A901EA7))
    (comp (ref R5)
      (value 47K)
      (footprint Resistor_SMD:R_0603_1608Metric_Pad0.84x1.00mm_HandSolder)
      (libsource (lib Device) (part R))
      (sheetpath (names "/Data Logging/") (tstamps /5A285E0E/))
      (tstamp 5A901FC1))
    (comp (ref R11)
      (value 47K)
      (footprint Resistor_SMD:R_0603_1608Metric_Pad0.84x1.00mm_HandSolder)
      (libsource (lib Device) (part R))
      (sheetpath (names "/Data Logging/") (tstamps /5A285E0E/))
      (tstamp 5A9020CE))
    (comp (ref R12)
      (value 47K)
      (footprint Resistor_SMD:R_0603_1608Metric_Pad0.84x1.00mm_HandSolder)
      (libsource (lib Device) (part R))
      (sheetpath (names "/Data Logging/") (tstamps /5A285E0E/))
      (tstamp 5A9021F7))
    (comp (ref L15)
      (value 470nH)
      (footprint Inductor_SMD:L_0603_1608Metric_Pad0.84x1.00mm_HandSolder)
      (libsource (lib Device) (part L))
      (sheetpath (names "/Data Logging/") (tstamps /5A285E0E/))
      (tstamp 5A91484A))
    (comp (ref C33)
      (value 22uF)
      (footprint Capacitor_SMD:C_0603_1608Metric_Pad0.84x1.00mm_HandSolder)
      (libsource (lib Device) (part C))
      (sheetpath (names "/Data Logging/") (tstamps /5A285E0E/))
      (tstamp 5A914A42))
    (comp (ref C32)
      (value 22uF)
      (footprint Capacitor_SMD:C_0603_1608Metric_Pad0.84x1.00mm_HandSolder)
      (libsource (lib Device) (part C))
      (sheetpath (names "/Data Logging/") (tstamps /5A285E0E/))
      (tstamp 5A914A66))
    (comp (ref R13)
      (value 47K)
      (footprint Resistor_SMD:R_0603_1608Metric_Pad0.84x1.00mm_HandSolder)
      (libsource (lib Device) (part R))
      (sheetpath (names "/Data Logging/") (tstamps /5A285E0E/))
      (tstamp 5A91E733))
    (comp (ref U1)
      (value STM32L476RGTx)
      (footprint Package_QFP:LQFP-64_10x10mm_P0.5mm)
      (datasheet http://www.st.com/content/ccc/resource/technical/document/datasheet/c5/ed/2f/60/aa/79/42/0b/DM00108832.pdf/files/DM00108832.pdf/jcr:content/translations/en.DM00108832.pdf)
      (libsource (lib MCU_ST_STM32) (part STM32L476RGTx))
      (sheetpath (names /MCU/) (tstamps /5A285DD1/))
      (tstamp 5A286040))
    (comp (ref C25)
      (value 100nF)
      (footprint Capacitor_SMD:C_0603_1608Metric_Pad0.84x1.00mm_HandSolder)
      (libsource (lib Device) (part C_Small))
      (sheetpath (names /MCU/) (tstamps /5A285DD1/))
      (tstamp 5A7DE7BC))
    (comp (ref C22)
      (value 4.7uF)
      (footprint Capacitor_SMD:C_0603_1608Metric_Pad0.84x1.00mm_HandSolder)
      (libsource (lib Device) (part CP1_Small))
      (sheetpath (names /MCU/) (tstamps /5A285DD1/))
      (tstamp 5A7DE85A))
    (comp (ref C27)
      (value 1uF)
      (footprint Capacitor_SMD:C_0603_1608Metric_Pad0.84x1.00mm_HandSolder)
      (libsource (lib Device) (part CP1_Small))
      (sheetpath (names /MCU/) (tstamps /5A285DD1/))
      (tstamp 5A7DE885))
    (comp (ref C26)
      (value 10nF)
      (footprint Capacitor_SMD:C_0603_1608Metric_Pad0.84x1.00mm_HandSolder)
      (libsource (lib Device) (part C_Small))
      (sheetpath (names /MCU/) (tstamps /5A285DD1/))
      (tstamp 5A7DE90E))
    (comp (ref C24)
      (value 100nF)
      (footprint Capacitor_SMD:C_0603_1608Metric_Pad0.84x1.00mm_HandSolder)
      (libsource (lib Device) (part C_Small))
      (sheetpath (names /MCU/) (tstamps /5A285DD1/))
      (tstamp 5A7DE939))
    (comp (ref C23)
      (value 100nF)
      (footprint Capacitor_SMD:C_0603_1608Metric_Pad0.84x1.00mm_HandSolder)
      (libsource (lib Device) (part C_Small))
      (sheetpath (names /MCU/) (tstamps /5A285DD1/))
      (tstamp 5A7DE985))
    (comp (ref BT1)
      (value Battery_Cell)
      (footprint lsf-kicad-lib:KEYSTONE_3098)
      (libsource (lib Device) (part Battery_Cell))
      (sheetpath (names /MCU/) (tstamps /5A285DD1/))
      (tstamp 5A7DF13D))
    (comp (ref PQ1)
      (value PQ9-Connector)
      (footprint lsf-kicad-lib:PQ9)
      (libsource (lib lsd-kicad) (part PQ9-Connector))
      (sheetpath (names "/PQ Bus/") (tstamps /5A289551/))
      (tstamp 5A2897BB))
    (comp (ref D1)
      (value BAR42FILM)
      (footprint Package_TO_SOT_SMD:SOT-23)
      (libsource (lib Diode) (part BAR42FILM))
      (sheetpath (names "/PQ Bus/") (tstamps /5A289551/))
      (tstamp 5A7BB63E))
    (comp (ref R8)
      (value 1K)
      (footprint Resistor_SMD:R_0603_1608Metric_Pad0.84x1.00mm_HandSolder)
      (libsource (lib Device) (part R))
      (sheetpath (names "/PQ Bus/") (tstamps /5A289551/))
      (tstamp 5A7BB786))
    (comp (ref R7)
      (value 0)
      (footprint Resistor_SMD:R_0603_1608Metric_Pad0.84x1.00mm_HandSolder)
      (libsource (lib Device) (part R))
      (sheetpath (names "/PQ Bus/") (tstamps /5A289551/))
      (tstamp 5A7BB9DD))
    (comp (ref R6)
      (value 0)
      (footprint Resistor_SMD:R_0603_1608Metric_Pad0.84x1.00mm_HandSolder)
      (libsource (lib Device) (part R))
      (sheetpath (names "/PQ Bus/") (tstamps /5A289551/))
      (tstamp 5A7BBA5A))
    (comp (ref R10)
      (value 3K3)
      (footprint Resistor_SMD:R_0603_1608Metric_Pad0.84x1.00mm_HandSolder)
      (libsource (lib Device) (part R))
      (sheetpath (names "/PQ Bus/") (tstamps /5A289551/))
      (tstamp 5A7BE651))
    (comp (ref U6)
      (value LTC2875-S8)
      (footprint Package_SO:SOIC-8_3.9x4.9mm_P1.27mm)
      (datasheet http://cds.linear.com/docs/en/datasheet/2875f.pdf)
      (libsource (lib Interface_CAN_LIN) (part LTC2875-S8))
      (sheetpath (names "/PQ Bus/") (tstamps /5A289551/))
      (tstamp 5A960484)))
  (libparts
    (libpart (lib lsd-kicad) (part AX5043)
      (fields
        (field (name Reference) U)
        (field (name Value) AX5043)
        (field (name Footprint) Housings_DFN_QFN:QFN-28-1EP_5x5mm_Pitch0.5mm)
        (field (name Datasheet) https://www.onsemi.com/pub/Collateral/AX5043-D.PDF))
      (pins
        (pin (num 1) (name VDD_ANA) (type power_out))
        (pin (num 2) (name GND) (type power_in))
        (pin (num 3) (name ANTP) (type input))
        (pin (num 4) (name ANTN) (type input))
        (pin (num 5) (name ANTP1) (type input))
        (pin (num 6) (name GND) (type power_in))
        (pin (num 7) (name VDD_ANA) (type power_out))
        (pin (num 8) (name FILT) (type input))
        (pin (num 9) (name L2) (type passive))
        (pin (num 10) (name L1) (type passive))
        (pin (num 11) (name DATA) (type BiDi))
        (pin (num 12) (name DCLK) (type BiDi))
        (pin (num 13) (name SYSCLK) (type BiDi))
        (pin (num 14) (name SEL) (type input))
        (pin (num 15) (name CLK) (type input))
        (pin (num 16) (name MISO) (type output))
        (pin (num 17) (name MOSI) (type input))
        (pin (num 18) (name NC) (type unspc))
        (pin (num 19) (name IRQ) (type BiDi))
        (pin (num 20) (name PWRAMP) (type BiDi))
        (pin (num 21) (name ANTSEL) (type BiDi))
        (pin (num 22) (name NC) (type unspc))
        (pin (num 23) (name VDD_IO) (type power_in))
        (pin (num 24) (name NC) (type unspc))
        (pin (num 25) (name GPADC1) (type input))
        (pin (num 26) (name GPADC2) (type input))
        (pin (num 27) (name CLK16N) (type input))
        (pin (num 28) (name CLK16P) (type input))
        (pin (num 29) (name GND) (type power_in))))
    (libpart (lib Diode) (part BAR42FILM)
      (aliases
        (alias BAR43FILM))
      (description "30V 0.1A Small signal Schottky diode, SOT-23")
      (docs http://www.st.com/content/ccc/resource/technical/document/datasheet/b3/b4/6e/ab/17/40/40/62/CD00000764.pdf/files/CD00000764.pdf/jcr:content/translations/en.CD00000764.pdf)
      (footprints
        (fp SOT?23*))
      (fields
        (field (name Reference) D)
        (field (name Value) BAR42FILM)
        (field (name Footprint) Package_TO_SOT_SMD:SOT-23))
      (pins
        (pin (num 1) (name A) (type passive))
        (pin (num 2) (name NC) (type NotConnected))
        (pin (num 3) (name K) (type passive))))
    (libpart (lib Device) (part Battery_Cell)
      (description "single battery cell")
      (docs ~)
      (fields
        (field (name Reference) BT)
        (field (name Value) Battery_Cell))
      (pins
        (pin (num 1) (name +) (type passive))
        (pin (num 2) (name -) (type passive))))
    (libpart (lib Device) (part C)
      (description "Unpolarized capacitor")
      (docs ~)
      (footprints
        (fp C_*))
      (fields
        (field (name Reference) C)
        (field (name Value) C))
      (pins
        (pin (num 1) (name ~) (type passive))
        (pin (num 2) (name ~) (type passive))))
    (libpart (lib Device) (part CP1_Small)
      (description "Polarised capacitor")
      (docs ~)
      (footprints
        (fp CP_*))
      (fields
        (field (name Reference) C)
        (field (name Value) CP1_Small))
      (pins
        (pin (num 1) (name ~) (type passive))
        (pin (num 2) (name ~) (type passive))))
    (libpart (lib Device) (part C_Small)
      (description "Unpolarized capacitor")
      (docs ~)
      (footprints
        (fp C_*))
      (fields
        (field (name Reference) C)
        (field (name Value) C_Small))
      (pins
        (pin (num 1) (name ~) (type passive))
        (pin (num 2) (name ~) (type passive))))
    (libpart (lib Connector_Generic) (part Conn_01x03)
      (description "Generic connector, single row, 01x03, script generated (kicad-library-utils/schlib/autogen/connector/)")
      (docs ~)
      (footprints
        (fp Connector*:*_1x??_*))
      (fields
        (field (name Reference) J)
        (field (name Value) Conn_01x03))
      (pins
        (pin (num 1) (name Pin_1) (type passive))
        (pin (num 2) (name Pin_2) (type passive))
        (pin (num 3) (name Pin_3) (type passive))))
    (libpart (lib Connector_Generic) (part Conn_01x04)
      (description "Generic connector, single row, 01x04, script generated (kicad-library-utils/schlib/autogen/connector/)")
      (docs ~)
      (footprints
        (fp Connector*:*_1x??_*))
      (fields
        (field (name Reference) J)
        (field (name Value) Conn_01x04))
      (pins
        (pin (num 1) (name Pin_1) (type passive))
        (pin (num 2) (name Pin_2) (type passive))
        (pin (num 3) (name Pin_3) (type passive))
        (pin (num 4) (name Pin_4) (type passive))))
    (libpart (lib Connector_Specialized) (part Conn_Coaxial)
      (description "coaxial connector (BNC, SMA, SMB, SMC, Cinch/RCA, ...)")
      (footprints
        (fp *BNC*)
        (fp *SMA*)
        (fp *SMB*)
        (fp *SMC*)
        (fp *Cinch*))
      (fields
        (field (name Reference) J)
        (field (name Value) Conn_Coaxial))
      (pins
        (pin (num 1) (name In) (type passive))
        (pin (num 2) (name Ext) (type passive))))
    (libpart (lib lsd-kicad) (part KT1612A)
      (fields
        (field (name Reference) U)
        (field (name Value) KT1612A))
      (pins
        (pin (num 1) (name GND/Vcon) (type power_in))
        (pin (num 2) (name GND) (type power_in))
        (pin (num 3) (name OUT) (type output))
        (pin (num 4) (name Vcc) (type power_in))))
    (libpart (lib Device) (part L)
      (description Inductor)
      (docs ~)
      (footprints
        (fp Choke_*)
        (fp *Coil*)
        (fp Inductor_*)
        (fp L_*))
      (fields
        (field (name Reference) L)
        (field (name Value) L))
      (pins
        (pin (num 1) (name 1) (type passive))
        (pin (num 2) (name 2) (type passive))))
    (libpart (lib Interface_CAN_LIN) (part LTC2875-S8)
      (description "High-Speed CAN Transceiver, 4Mbps, 3.3V or 5V supply, SOIC8 package")
      (docs http://cds.linear.com/docs/en/datasheet/2875f.pdf)
      (footprints
        (fp SOIC*P1.27mm*))
      (fields
        (field (name Reference) U)
        (field (name Value) LTC2875-S8)
        (field (name Footprint) Package_SO:SOIC-8_3.9x4.9mm_P1.27mm))
      (pins
        (pin (num 1) (name TXD) (type input))
        (pin (num 2) (name GND) (type power_in))
        (pin (num 3) (name VCC) (type power_in))
        (pin (num 4) (name RXD) (type output))
        (pin (num 5) (name SPLIT) (type input))
        (pin (num 6) (name CANL) (type BiDi))
        (pin (num 7) (name CANH) (type BiDi))
        (pin (num 8) (name RS) (type input))))
    (libpart (lib lsd-kicad) (part MMZ09332B)
      (description "High Efficiency/Linearity Amplifier")
      (fields
        (field (name Reference) U)
        (field (name Value) MMZ09332B)
        (field (name Footprint) Housings_DFN_QFN:QFN-12-1EP_3x3mm_Pitch0.5mm)
        (field (name Datasheet) https://www.mouser.com/ds/2/302/a-1126961.pdf))
      (pins
        (pin (num 1) (name VBA1) (type input))
        (pin (num 2) (name VBIAS) (type input))
        (pin (num 3) (name RFin) (type input))
        (pin (num 6) (name PDET) (type input))
        (pin (num 7) (name VCC2/RFOUT) (type input))
        (pin (num 8) (name VCC2/RFOUT) (type input))
        (pin (num 9) (name VCC2/RFOUT) (type input))
        (pin (num 10) (name Power_Down) (type input))
        (pin (num 11) (name VCC1) (type input))
        (pin (num 12) (name VBA2) (type input))
        (pin (num 13) (name GND) (type power_in))))
    (libpart (lib Connector_Specialized) (part Micro_SD_Card_Det)
      (aliases
        (alias Micro_SD_Card_Det_Hirose_DM3AT))
      (description "Micro SD Card Socket with card detection pins")
      (docs https://www.hirose.com/product/en/download_file/key_name/DM3/category/Catalog/doc_file_id/49662/?file_category_id=4&item_id=195&is_series=1)
      (footprints
        (fp microSD*Card*Receptable*))
      (fields
        (field (name Reference) J)
        (field (name Value) Micro_SD_Card_Det))
      (pins
        (pin (num 1) (name DAT2) (type BiDi))
        (pin (num 2) (name DAT3/CD) (type BiDi))
        (pin (num 3) (name CMD) (type input))
        (pin (num 4) (name VDD) (type power_in))
        (pin (num 5) (name CLK) (type input))
        (pin (num 6) (name VSS) (type power_in))
        (pin (num 7) (name DAT0) (type input))
        (pin (num 8) (name DAT1) (type input))
        (pin (num 9) (name DET_B) (type passive))
        (pin (num 10) (name DET_A) (type passive))
        (pin (num 11) (name SHIELD) (type passive))))
    (libpart (lib lsd-kicad) (part PQ9-Connector)
      (footprints
        (fp PQ9:PQ9))
      (fields
        (field (name Reference) PQ)
        (field (name Value) PQ9-Connector))
      (pins
        (pin (num 1) (name RST) (type BiDi))
        (pin (num 2) (name D-) (type BiDi))
        (pin (num 3) (name D+) (type BiDi))
        (pin (num 4) (name GND) (type power_in))
        (pin (num 5) (name V1) (type power_in))
        (pin (num 6) (name V2) (type power_in))
        (pin (num 7) (name V3) (type power_in))
        (pin (num 8) (name V4) (type power_in))
        (pin (num 9) (name GND) (type power_in))))
    (libpart (lib Device) (part R)
      (description Resistor)
      (docs ~)
      (footprints
        (fp R_*)
        (fp R_*))
      (fields
        (field (name Reference) R)
        (field (name Value) R))
      (pins
        (pin (num 1) (name ~) (type passive))
        (pin (num 2) (name ~) (type passive))))
    (libpart (lib lsd-kicad) (part SKY13351)
      (fields
        (field (name Reference) U)
        (field (name Value) SKY13351))
      (pins
        (pin (num 1) (name OUT1) (type BiDi))
        (pin (num 2) (name GND) (type power_in))
        (pin (num 3) (name OUT2) (type BiDi))
        (pin (num 4) (name VCTL2) (type input))
        (pin (num 5) (name INPUT) (type BiDi))
        (pin (num 6) (name VCTL1) (type input))))
    (libpart (lib MCU_ST_STM32) (part STM32L476RCTx)
      (aliases
        (alias STM32L476RETx)
        (alias STM32L476RGTx))
      (description "Core: ARM Cortex-M4, Package: LQFP64, Flash: 256 kB, RAM: 128 kB, Frequency: 80 MHz, Voltage: 1.71..3.6V, I/O pins: 51")
      (docs http://www.st.com/st-web-ui/static/active/en/resource/technical/document/datasheet/DM00108832.pdf)
      (fields
        (field (name Reference) U)
        (field (name Value) STM32L476RCTx)
        (field (name Footprint) LQFP64))
      (pins
        (pin (num 1) (name VBAT) (type power_in))
        (pin (num 2) (name PC13/RTC_OUT_ALARM/RTC_OUT_CALIB/RTC_TAMP1/RTC_TS/SYS_WKUP2) (type BiDi))
        (pin (num 3) (name PC14/RCC_OSC32_IN) (type BiDi))
        (pin (num 4) (name PC15/ADC1_EXTI15/ADC2_EXTI15/ADC3_EXTI15/RCC_OSC32_OUT) (type BiDi))
        (pin (num 5) (name PH0/RCC_OSC_IN) (type input))
        (pin (num 6) (name PH1/RCC_OSC_OUT) (type input))
        (pin (num 7) (name NRST) (type input))
        (pin (num 8) (name PC0/ADC1_IN1/ADC2_IN1/ADC3_IN1/DFSDM_DATIN4/I2C3_SCL/LCD_SEG18/LPTIM1_IN1/LPTIM2_IN1/LPUART1_RX) (type BiDi))
        (pin (num 9) (name PC1/ADC1_IN2/ADC2_IN2/ADC3_IN2/DFSDM_CKIN4/I2C3_SDA/LCD_SEG19/LPTIM1_OUT/LPUART1_TX) (type BiDi))
        (pin (num 10) (name PC2/ADC1_IN3/ADC2_IN3/ADC3_IN3/DFSDM_CKOUT/LCD_SEG20/LPTIM1_IN2/SPI2_MISO) (type BiDi))
        (pin (num 11) (name PC3/ADC1_IN4/ADC2_IN4/ADC3_IN4/LCD_VLCD/LPTIM1_ETR/LPTIM2_ETR/SAI1_SD_A/SPI2_MOSI) (type BiDi))
        (pin (num 12) (name VSSA) (type power_in))
        (pin (num 13) (name VDDA) (type power_in))
        (pin (num 14) (name ADC1_IN5/ADC2_IN5/OPAMP1_VINP/RTC_TAMP2/SAI1_EXTCLK/SYS_WKUP1/TIM2_CH1/TIM2_ETR/TIM5_CH1/TIM8_ETR/UART4_TX/USART2_CTS/PA0) (type BiDi))
        (pin (num 15) (name ADC1_IN6/ADC2_IN6/LCD_SEG0/OPAMP1_VINM/TIM15_CH1N/TIM2_CH2/TIM5_CH2/UART4_RX/USART2_DE/USART2_RTS/PA1) (type BiDi))
        (pin (num 16) (name ADC1_IN7/ADC2_IN7/LCD_SEG1/RCC_LSCO/SAI2_EXTCLK/SYS_WKUP4/TIM15_CH1/TIM2_CH3/TIM5_CH3/USART2_TX/PA2) (type BiDi))
        (pin (num 17) (name ADC1_IN8/ADC2_IN8/LCD_SEG2/OPAMP1_VOUT/TIM15_CH2/TIM2_CH4/TIM5_CH4/USART2_RX/PA3) (type BiDi))
        (pin (num 18) (name VSS) (type power_in))
        (pin (num 19) (name VDD) (type power_in))
        (pin (num 20) (name ADC1_IN9/ADC2_IN9/DAC1_OUT1/LPTIM2_OUT/SAI1_FS_B/SPI1_NSS/SPI3_NSS/USART2_CK/PA4) (type BiDi))
        (pin (num 21) (name ADC1_IN10/ADC2_IN10/DAC1_OUT2/LPTIM2_ETR/SPI1_SCK/TIM2_CH1/TIM2_ETR/TIM8_CH1N/PA5) (type BiDi))
        (pin (num 22) (name ADC1_IN11/ADC2_IN11/LCD_SEG3/OPAMP2_VINP/QUADSPI_BK1_IO3/SPI1_MISO/TIM16_CH1/TIM1_BKIN/TIM1_BKIN_COMP2/TIM3_CH1/TIM8_BKIN/TIM8_BKIN_COMP2/USART3_CTS/PA6) (type BiDi))
        (pin (num 23) (name ADC1_IN12/ADC2_IN12/LCD_SEG4/OPAMP2_VINM/QUADSPI_BK1_IO2/SPI1_MOSI/TIM17_CH1/TIM1_CH1N/TIM3_CH2/TIM8_CH1N/PA7) (type BiDi))
        (pin (num 24) (name PC4/ADC1_IN13/ADC2_IN13/COMP1_INM/LCD_SEG22/USART3_TX) (type BiDi))
        (pin (num 25) (name PC5/ADC1_IN14/ADC2_IN14/COMP1_INP/LCD_SEG23/SYS_WKUP5/USART3_RX) (type BiDi))
        (pin (num 26) (name ADC1_IN15/ADC2_IN15/COMP1_OUT/LCD_SEG5/OPAMP2_VOUT/QUADSPI_BK1_IO1/TIM1_CH2N/TIM3_CH3/TIM8_CH2N/USART3_CK/PB0) (type BiDi))
        (pin (num 27) (name ADC1_IN16/ADC2_IN16/COMP1_INM/DFSDM_DATIN0/LCD_SEG6/LPTIM2_IN1/QUADSPI_BK1_IO0/TIM1_CH3N/TIM3_CH4/TIM8_CH3N/USART3_DE/USART3_RTS/PB1) (type BiDi))
        (pin (num 28) (name COMP1_INP/DFSDM_CKIN0/I2C3_SMBA/LPTIM1_OUT/RTC_OUT_ALARM/RTC_OUT_CALIB/PB2) (type BiDi))
        (pin (num 29) (name COMP1_OUT/DFSDM_DATIN7/I2C2_SCL/LCD_SEG10/LPUART1_RX/QUADSPI_CLK/SAI1_SCK_A/SPI2_SCK/TIM2_CH3/USART3_TX/PB10) (type BiDi))
        (pin (num 30) (name ADC1_EXTI11/ADC2_EXTI11/ADC3_EXTI11/COMP2_OUT/DFSDM_CKIN7/I2C2_SDA/LCD_SEG11/LPUART1_TX/QUADSPI_NCS/TIM2_CH4/USART3_RX/PB11) (type BiDi))
        (pin (num 31) (name VSS) (type power_in))
        (pin (num 32) (name VDD) (type power_in))
        (pin (num 33) (name DFSDM_DATIN1/I2C2_SMBA/LCD_SEG12/LPUART1_DE/LPUART1_RTS/SAI2_FS_A/SPI2_NSS/SWPMI1_IO/TIM15_BKIN/TIM1_BKIN/TIM1_BKIN_COMP2/TSC_G1_IO1/USART3_CK/PB12) (type BiDi))
        (pin (num 34) (name DFSDM_CKIN1/I2C2_SCL/LCD_SEG13/LPUART1_CTS/SAI2_SCK_A/SPI2_SCK/SWPMI1_TX/TIM15_CH1N/TIM1_CH1N/TSC_G1_IO2/USART3_CTS/PB13) (type BiDi))
        (pin (num 35) (name DFSDM_DATIN2/I2C2_SDA/LCD_SEG14/SAI2_MCLK_A/SPI2_MISO/SWPMI1_RX/TIM15_CH1/TIM1_CH2N/TIM8_CH2N/TSC_G1_IO3/USART3_DE/USART3_RTS/PB14) (type BiDi))
        (pin (num 36) (name ADC1_EXTI15/ADC2_EXTI15/ADC3_EXTI15/DFSDM_CKIN2/LCD_SEG15/RTC_REFIN/SAI2_SD_A/SPI2_MOSI/SWPMI1_SUSPEND/TIM15_CH2/TIM1_CH3N/TIM8_CH3N/TSC_G1_IO4/PB15) (type BiDi))
        (pin (num 37) (name PC6/DFSDM_CKIN3/LCD_SEG24/SAI2_MCLK_A/SDMMC1_D6/TIM3_CH1/TIM8_CH1/TSC_G4_IO1) (type BiDi))
        (pin (num 38) (name PC7/DFSDM_DATIN3/LCD_SEG25/SAI2_MCLK_B/SDMMC1_D7/TIM3_CH2/TIM8_CH2/TSC_G4_IO2) (type BiDi))
        (pin (num 39) (name PC8/LCD_SEG26/SDMMC1_D0/TIM3_CH3/TIM8_CH3/TSC_G4_IO3) (type BiDi))
        (pin (num 40) (name PC9/DAC1_EXTI9/LCD_SEG27/SAI2_EXTCLK/SDMMC1_D1/TIM3_CH4/TIM8_BKIN2/TIM8_BKIN2_COMP1/TIM8_CH4/TSC_G4_IO4/USB_OTG_FS_NOE) (type BiDi))
        (pin (num 41) (name LCD_COM0/LPTIM2_OUT/RCC_MCO/TIM1_CH1/USART1_CK/USB_OTG_FS_SOF/PA8) (type BiDi))
        (pin (num 42) (name DAC1_EXTI9/LCD_COM1/TIM15_BKIN/TIM1_CH2/USART1_TX/USB_OTG_FS_VBUS/PA9) (type BiDi))
        (pin (num 43) (name LCD_COM2/TIM17_BKIN/TIM1_CH3/USART1_RX/USB_OTG_FS_ID/PA10) (type BiDi))
        (pin (num 44) (name ADC1_EXTI11/ADC2_EXTI11/ADC3_EXTI11/CAN1_RX/TIM1_BKIN2/TIM1_BKIN2_COMP1/TIM1_CH4/USART1_CTS/USB_OTG_FS_DM/PA11) (type BiDi))
        (pin (num 45) (name CAN1_TX/TIM1_ETR/USART1_DE/USART1_RTS/USB_OTG_FS_DP/PA12) (type BiDi))
        (pin (num 46) (name IR_OUT/SYS_JTMS-SWDIO/USB_OTG_FS_NOE/PA13) (type BiDi))
        (pin (num 47) (name VSS) (type power_in))
        (pin (num 48) (name VDDUSB) (type power_in))
        (pin (num 49) (name SYS_JTCK-SWCLK/PA14) (type BiDi))
        (pin (num 50) (name ADC1_EXTI15/ADC2_EXTI15/ADC3_EXTI15/LCD_SEG17/SAI2_FS_B/SPI1_NSS/SPI3_NSS/SYS_JTDI/TIM2_CH1/TIM2_ETR/TSC_G3_IO1/UART4_DE/UART4_RTS/PA15) (type BiDi))
        (pin (num 51) (name PC10/LCD_COM4/LCD_SEG28/LCD_SEG40/SAI2_SCK_B/SDMMC1_D2/SPI3_SCK/TSC_G3_IO2/UART4_TX/USART3_TX) (type BiDi))
        (pin (num 52) (name PC11/ADC1_EXTI11/ADC2_EXTI11/ADC3_EXTI11/LCD_COM5/LCD_SEG29/LCD_SEG41/SAI2_MCLK_B/SDMMC1_D3/SPI3_MISO/TSC_G3_IO3/UART4_RX/USART3_RX) (type BiDi))
        (pin (num 53) (name PC12/LCD_COM6/LCD_SEG30/LCD_SEG42/SAI2_SD_B/SDMMC1_CK/SPI3_MOSI/TSC_G3_IO4/UART5_TX/USART3_CK) (type BiDi))
        (pin (num 54) (name PD2/LCD_COM7/LCD_SEG31/LCD_SEG43/SDMMC1_CMD/TIM3_ETR/TSC_SYNC/UART5_RX/USART3_DE/USART3_RTS) (type BiDi))
        (pin (num 55) (name COMP2_INM/LCD_SEG7/SAI1_SCK_B/SPI1_SCK/SPI3_SCK/SYS_JTDO-SWO/TIM2_CH2/USART1_DE/USART1_RTS/PB3) (type BiDi))
        (pin (num 56) (name COMP2_INP/LCD_SEG8/SAI1_MCLK_B/SPI1_MISO/SPI3_MISO/SYS_JTRST/TIM17_BKIN/TIM3_CH1/TSC_G2_IO1/UART5_DE/UART5_RTS/USART1_CTS/PB4) (type BiDi))
        (pin (num 57) (name COMP2_OUT/I2C1_SMBA/LCD_SEG9/LPTIM1_IN1/SAI1_SD_B/SPI1_MOSI/SPI3_MOSI/TIM16_BKIN/TIM3_CH2/TSC_G2_IO2/UART5_CTS/USART1_CK/PB5) (type BiDi))
        (pin (num 58) (name COMP2_INP/DFSDM_DATIN5/I2C1_SCL/LPTIM1_ETR/SAI1_FS_B/TIM16_CH1N/TIM4_CH1/TIM8_BKIN2/TIM8_BKIN2_COMP2/TSC_G2_IO3/USART1_TX/PB6) (type BiDi))
        (pin (num 59) (name COMP2_INM/DFSDM_CKIN5/I2C1_SDA/LCD_SEG21/LPTIM1_IN2/SYS_PVD_IN/TIM17_CH1N/TIM4_CH2/TIM8_BKIN/TIM8_BKIN_COMP1/TSC_G2_IO4/UART4_CTS/USART1_RX/PB7) (type BiDi))
        (pin (num 60) (name BOOT0) (type input))
        (pin (num 61) (name CAN1_RX/DFSDM_DATIN6/I2C1_SCL/LCD_SEG16/SAI1_MCLK_A/SDMMC1_D4/TIM16_CH1/TIM4_CH3/PB8) (type BiDi))
        (pin (num 62) (name CAN1_TX/DAC1_EXTI9/DFSDM_CKIN6/I2C1_SDA/IR_OUT/LCD_COM3/SAI1_FS_A/SDMMC1_D5/SPI2_NSS/TIM17_CH1/TIM4_CH4/PB9) (type BiDi))
        (pin (num 63) (name VSS) (type power_in))
        (pin (num 64) (name VDD) (type power_in)))))
  (libraries
    (library (logical Connector_Generic)
      (uri /home/liknus/git/kicad-symbols/Connector_Generic.lib))
    (library (logical Connector_Specialized)
      (uri /home/liknus/git/kicad-symbols/Connector_Specialized.lib))
    (library (logical Device)
      (uri /home/liknus/git/kicad-symbols/Device.lib))
    (library (logical Diode)
      (uri /home/liknus/git/kicad-symbols/Diode.lib))
    (library (logical Interface_CAN_LIN)
      (uri /home/liknus/git/kicad-symbols/Interface_CAN_LIN.lib))
    (library (logical MCU_ST_STM32)
      (uri /home/liknus/git/kicad-symbols/MCU_ST_STM32.lib))
    (library (logical lsd-kicad)
      (uri /home/liknus/git/pqws-main-hw/library/lsf-kicad-lib/lsd-kicad.lib)))
  (nets
    (net (code 1) (name /MCU/RF_IRQ)
      (node (ref U4) (pin 19))
      (node (ref U1) (pin 42)))
    (net (code 2) (name /MCU/DD)
      (node (ref U1) (pin 15))
      (node (ref J3) (pin 3)))
    (net (code 3) (name /MCU/TxD)
      (node (ref J3) (pin 2))
      (node (ref U1) (pin 16)))
    (net (code 4) (name /MCU/RxD)
      (node (ref U1) (pin 17))
      (node (ref J3) (pin 1)))
    (net (code 5) (name /MCU/CAN1_EN)
      (node (ref U1) (pin 41))
      (node (ref U6) (pin 8))
      (node (ref R8) (pin 1)))
    (net (code 6) (name /MCU/CAN1RX)
      (node (ref U6) (pin 4))
      (node (ref U1) (pin 44))
      (node (ref R6) (pin 1)))
    (net (code 7) (name /MCU/CAN1TX)
      (node (ref U1) (pin 45))
      (node (ref R7) (pin 1))
      (node (ref U6) (pin 1)))
    (net (code 8) (name /MCU/RF_SCK)
      (node (ref U1) (pin 29))
      (node (ref U4) (pin 15)))
    (net (code 9) (name /MCU/RF_MOSI)
      (node (ref U1) (pin 11))
      (node (ref U4) (pin 17)))
    (net (code 10) (name /MCU/RF_MISO)
      (node (ref U4) (pin 16))
      (node (ref U1) (pin 10)))
    (net (code 11) (name /MCU/RF_Tx_EN)
      (node (ref U1) (pin 43))
      (node (ref U4) (pin 14)))
    (net (code 12) (name "/PQ Bus/RST")
      (node (ref U1) (pin 22))
      (node (ref PQ1) (pin 1)))
    (net (code 13) (name "/Data Logging/SD_DET")
      (node (ref U1) (pin 20))
      (node (ref J1) (pin 10))
      (node (ref R13) (pin 2)))
    (net (code 14) (name /MCU/SWDIO)
      (node (ref U1) (pin 46))
      (node (ref J4) (pin 3)))
    (net (code 15) (name /MCU/JTDI)
      (node (ref U1) (pin 50)))
    (net (code 16) (name /MCU/JTDO)
      (node (ref U1) (pin 55)))
    (net (code 17) (name /MCU/JTRST)
      (node (ref J4) (pin 4))
      (node (ref U1) (pin 56)))
    (net (code 18) (name /MCU/SWCLK)
      (node (ref J4) (pin 1))
      (node (ref U1) (pin 49)))
    (net (code 19) (name GND)
      (node (ref U4) (pin 25))
      (node (ref C8) (pin 2))
      (node (ref U2) (pin 1))
      (node (ref U2) (pin 2))
      (node (ref U4) (pin 2))
      (node (ref C10) (pin 2))
      (node (ref C34) (pin 1))
      (node (ref R8) (pin 2))
      (node (ref C28) (pin 2))
      (node (ref C29) (pin 2))
      (node (ref C24) (pin 2))
      (node (ref C23) (pin 2))
      (node (ref PQ1) (pin 9))
      (node (ref U4) (pin 29))
      (node (ref U4) (pin 6))
      (node (ref C7) (pin 1))
      (node (ref C5) (pin 2))
      (node (ref U4) (pin 26))
      (node (ref PQ1) (pin 4))
      (node (ref C12) (pin 2))
      (node (ref C6) (pin 2))
      (node (ref L5) (pin 2))
      (node (ref C4) (pin 2))
      (node (ref C15) (pin 2))
      (node (ref C19) (pin 2))
      (node (ref C20) (pin 1))
      (node (ref C17) (pin 1))
      (node (ref C21) (pin 2))
      (node (ref J1) (pin 9))
      (node (ref J1) (pin 6))
      (node (ref J1) (pin 11))
      (node (ref J2) (pin 2))
      (node (ref U3) (pin 2))
      (node (ref C11) (pin 2))
      (node (ref L14) (pin 1))
      (node (ref L8) (pin 2))
      (node (ref L11) (pin 2))
      (node (ref C32) (pin 2))
      (node (ref L10) (pin 1))
      (node (ref C33) (pin 2))
      (node (ref C1) (pin 1))
      (node (ref U6) (pin 2))
      (node (ref BT1) (pin 2))
      (node (ref C9) (pin 2))
      (node (ref C22) (pin 2))
      (node (ref C25) (pin 2))
      (node (ref C26) (pin 2))
      (node (ref U1) (pin 63))
      (node (ref U1) (pin 47))
      (node (ref U1) (pin 31))
      (node (ref U1) (pin 18))
      (node (ref J4) (pin 2))
      (node (ref C27) (pin 2))
      (node (ref U1) (pin 12))
      (node (ref U5) (pin 13)))
    (net (code 20) (name "/Data Logging/D3")
      (node (ref R4) (pin 2))
      (node (ref U1) (pin 52))
      (node (ref J1) (pin 2)))
    (net (code 21) (name "/Data Logging/D2")
      (node (ref J1) (pin 1))
      (node (ref U1) (pin 51))
      (node (ref R3) (pin 2)))
    (net (code 22) (name "/Data Logging/D1")
      (node (ref U1) (pin 40))
      (node (ref J1) (pin 8))
      (node (ref R12) (pin 2)))
    (net (code 23) (name "/Data Logging/D0")
      (node (ref J1) (pin 7))
      (node (ref U1) (pin 39))
      (node (ref R11) (pin 2)))
    (net (code 24) (name "/Data Logging/CLK")
      (node (ref U1) (pin 53))
      (node (ref J1) (pin 5)))
    (net (code 25) (name "/Data Logging/CMD")
      (node (ref J1) (pin 3))
      (node (ref U1) (pin 54))
      (node (ref R5) (pin 2)))
    (net (code 26) (name "Net-(U1-Pad61)")
      (node (ref U1) (pin 61)))
    (net (code 27) (name "Net-(U1-Pad62)")
      (node (ref U1) (pin 62)))
    (net (code 28) (name "Net-(U1-Pad30)")
      (node (ref U1) (pin 30)))
    (net (code 29) (name "Net-(U1-Pad33)")
      (node (ref U1) (pin 33)))
    (net (code 30) (name "Net-(U1-Pad34)")
      (node (ref U1) (pin 34)))
    (net (code 31) (name "Net-(U1-Pad35)")
      (node (ref U1) (pin 35)))
    (net (code 32) (name "Net-(U1-Pad36)")
      (node (ref U1) (pin 36)))
    (net (code 33) (name "Net-(U1-Pad7)")
      (node (ref U1) (pin 7)))
    (net (code 34) (name "Net-(U1-Pad60)")
      (node (ref U1) (pin 60)))
    (net (code 35) (name "Net-(U1-Pad5)")
      (node (ref U1) (pin 5)))
    (net (code 36) (name "Net-(U1-Pad6)")
      (node (ref U1) (pin 6)))
    (net (code 37) (name "Net-(U1-Pad59)")
      (node (ref U1) (pin 59)))
    (net (code 38) (name "Net-(U1-Pad58)")
      (node (ref U1) (pin 58)))
    (net (code 39) (name "Net-(U1-Pad57)")
      (node (ref U1) (pin 57)))
    (net (code 40) (name "Net-(U1-Pad28)")
      (node (ref U1) (pin 28)))
    (net (code 41) (name "Net-(U1-Pad27)")
      (node (ref U1) (pin 27)))
    (net (code 42) (name "Net-(U1-Pad26)")
      (node (ref U1) (pin 26)))
    (net (code 43) (name "Net-(U1-Pad4)")
      (node (ref U1) (pin 4)))
    (net (code 44) (name "Net-(U1-Pad3)")
      (node (ref U1) (pin 3)))
    (net (code 45) (name "Net-(U1-Pad2)")
      (node (ref U1) (pin 2)))
    (net (code 46) (name "Net-(U1-Pad38)")
      (node (ref U1) (pin 38)))
    (net (code 47) (name "Net-(U1-Pad37)")
      (node (ref U1) (pin 37)))
    (net (code 48) (name "Net-(U1-Pad25)")
      (node (ref U1) (pin 25)))
    (net (code 49) (name "Net-(U1-Pad24)")
      (node (ref U1) (pin 24)))
    (net (code 50) (name "Net-(U1-Pad9)")
      (node (ref U1) (pin 9)))
    (net (code 51) (name "Net-(U1-Pad8)")
      (node (ref U1) (pin 8)))
    (net (code 52) (name "Net-(U1-Pad21)")
      (node (ref U1) (pin 21)))
    (net (code 53) (name "Net-(U1-Pad23)")
      (node (ref U1) (pin 23)))
    (net (code 54) (name "Net-(U1-Pad14)")
      (node (ref U1) (pin 14)))
    (net (code 55) (name +BATT)
      (node (ref BT1) (pin 1))
      (node (ref U1) (pin 1)))
    (net (code 57) (name "Net-(C13-Pad1)")
      (node (ref L6) (pin 2))
      (node (ref C13) (pin 1))
      (node (ref C16) (pin 2)))
    (net (code 58) (name /Radio/RF_IN)
      (node (ref C13) (pin 2))
      (node (ref U3) (pin 3)))
    (net (code 59) (name "/Radio/Power Amplifier/PA_RF_IN")
      (node (ref L7) (pin 2))
      (node (ref C14) (pin 1))
      (node (ref L1) (pin 1)))
    (net (code 60) (name "Net-(C14-Pad2)")
      (node (ref L7) (pin 1))
      (node (ref C14) (pin 2))
      (node (ref L9) (pin 2))
      (node (ref C17) (pin 2)))
    (net (code 61) (name "Net-(C18-Pad2)")
      (node (ref C18) (pin 2))
      (node (ref L9) (pin 1)))
    (net (code 62) (name "Net-(C15-Pad1)")
      (node (ref L6) (pin 1))
      (node (ref C15) (pin 1))
      (node (ref L12) (pin 2)))
    (net (code 63) (name /Radio/VDD_ANA2)
      (node (ref U4) (pin 7))
      (node (ref C20) (pin 2)))
    (net (code 64) (name "Net-(U4-Pad27)")
      (node (ref U4) (pin 27)))
    (net (code 65) (name "Net-(U4-Pad8)")
      (node (ref U4) (pin 8)))
    (net (code 66) (name "Net-(U4-Pad24)")
      (node (ref U4) (pin 24)))
    (net (code 67) (name "Net-(U4-Pad22)")
      (node (ref U4) (pin 22)))
    (net (code 68) (name ANTSEL)
      (node (ref U3) (pin 4))
      (node (ref C34) (pin 2))
      (node (ref U4) (pin 21)))
    (net (code 69) (name "Net-(U4-Pad18)")
      (node (ref U4) (pin 18)))
    (net (code 70) (name "Net-(U4-Pad13)")
      (node (ref U4) (pin 13)))
    (net (code 71) (name "Net-(U4-Pad12)")
      (node (ref U4) (pin 12)))
    (net (code 72) (name PA_POWER_EN)
      (node (ref U3) (pin 6))
      (node (ref C7) (pin 2))
      (node (ref U4) (pin 20))
      (node (ref U5) (pin 10)))
    (net (code 73) (name "/Radio/Power Amplifier/PDET")
      (node (ref C5) (pin 1))
      (node (ref U5) (pin 6))
      (node (ref U4) (pin 11)))
    (net (code 74) (name "/Radio/Power Amplifier/PA_RF_OUT")
      (node (ref C4) (pin 1))
      (node (ref L4) (pin 2))
      (node (ref U3) (pin 1)))
    (net (code 75) (name /Radio/VDD_ANA1)
      (node (ref C19) (pin 1))
      (node (ref U4) (pin 1)))
    (net (code 76) (name /Radio/ANT_CON)
      (node (ref U3) (pin 5))
      (node (ref J2) (pin 1)))
    (net (code 77) (name /Radio/ANTP1)
      (node (ref C18) (pin 1))
      (node (ref L11) (pin 1))
      (node (ref U4) (pin 5)))
    (net (code 78) (name /Radio/L1L2)
      (node (ref U4) (pin 9))
      (node (ref U4) (pin 10)))
    (net (code 79) (name /Radio/ANTP)
      (node (ref C31) (pin 1))
      (node (ref U4) (pin 3))
      (node (ref L14) (pin 2)))
    (net (code 80) (name /Radio/TCXO_OUT)
      (node (ref C30) (pin 1))
      (node (ref U2) (pin 3))
      (node (ref C29) (pin 1)))
    (net (code 81) (name /Radio/CLK16P)
      (node (ref C30) (pin 2))
      (node (ref U4) (pin 28)))
    (net (code 82) (name "Net-(C2-Pad2)")
      (node (ref L12) (pin 1))
      (node (ref C2) (pin 2)))
    (net (code 83) (name /Radio/ANTN)
      (node (ref U4) (pin 4))
      (node (ref C2) (pin 1))
      (node (ref L8) (pin 1)))
    (net (code 84) (name "Net-(C31-Pad2)")
      (node (ref L13) (pin 1))
      (node (ref C31) (pin 2)))
    (net (code 85) (name "Net-(C1-Pad2)")
      (node (ref C1) (pin 2))
      (node (ref C16) (pin 1))
      (node (ref L10) (pin 2))
      (node (ref L13) (pin 2)))
    (net (code 86) (name "/Data Logging/SD_VDD")
      (node (ref C32) (pin 1))
      (node (ref L15) (pin 2))
      (node (ref C33) (pin 1))
      (node (ref J1) (pin 4)))
    (net (code 87) (name "Net-(PQ1-Pad6)")
      (node (ref PQ1) (pin 6)))
    (net (code 88) (name "Net-(U6-Pad5)")
      (node (ref U6) (pin 5)))
    (net (code 89) (name "/PQ Bus/D-")
      (node (ref PQ1) (pin 2))
      (node (ref U6) (pin 7)))
    (net (code 90) (name "Net-(PQ1-Pad7)")
      (node (ref PQ1) (pin 7)))
    (net (code 91) (name "/PQ Bus/D+")
      (node (ref PQ1) (pin 3))
      (node (ref R10) (pin 2))
      (node (ref U6) (pin 6))
      (node (ref R6) (pin 2))
      (node (ref D1) (pin 1)))
    (net (code 92) (name "Net-(PQ1-Pad8)")
      (node (ref PQ1) (pin 8)))
    (net (code 93) (name "Net-(D1-Pad3)")
      (node (ref R7) (pin 2))
      (node (ref D1) (pin 3)))
    (net (code 94) (name "Net-(D1-Pad2)")
      (node (ref D1) (pin 2)))
    (net (code 95) (name VCC)
      (node (ref U5) (pin 2))
      (node (ref C12) (pin 1))
      (node (ref C8) (pin 1))
      (node (ref L3) (pin 2))
      (node (ref C6) (pin 1))
      (node (ref R1) (pin 2))
      (node (ref R2) (pin 2))
      (node (ref C9) (pin 1))
      (node (ref R10) (pin 1))
      (node (ref L2) (pin 1))
      (node (ref C11) (pin 1))
      (node (ref C23) (pin 1))
      (node (ref C24) (pin 1))
      (node (ref C28) (pin 1))
      (node (ref U2) (pin 4))
      (node (ref U4) (pin 23))
      (node (ref U1) (pin 48))
      (node (ref U1) (pin 13))
      (node (ref U1) (pin 64))
      (node (ref U1) (pin 32))
      (node (ref U1) (pin 19))
      (node (ref PQ1) (pin 5))
      (node (ref C26) (pin 1))
      (node (ref C27) (pin 1))
      (node (ref C22) (pin 1))
      (node (ref C25) (pin 1))
      (node (ref R5) (pin 1))
      (node (ref U6) (pin 3))
      (node (ref L15) (pin 1))
      (node (ref R11) (pin 1))
      (node (ref R12) (pin 1))
      (node (ref R4) (pin 1))
      (node (ref C21) (pin 1))
      (node (ref R13) (pin 1))
      (node (ref R3) (pin 1)))
    (net (code 96) (name "Net-(C3-Pad1)")
      (node (ref L4) (pin 1))
      (node (ref L5) (pin 1))
      (node (ref C3) (pin 1)))
    (net (code 97) (name "/Radio/Power Amplifier/VBA1")
      (node (ref R1) (pin 1))
      (node (ref U5) (pin 1)))
    (net (code 98) (name "/Radio/Power Amplifier/VBA2")
      (node (ref U5) (pin 12))
      (node (ref R2) (pin 1)))
    (net (code 99) (name "/Radio/Power Amplifier/PA_VCC1")
      (node (ref L2) (pin 2))
      (node (ref U5) (pin 11))
      (node (ref C10) (pin 1)))
    (net (code 100) (name "/Radio/Power Amplifier/PA_OUT")
      (node (ref U5) (pin 7))
      (node (ref U5) (pin 8))
      (node (ref U5) (pin 9))
      (node (ref L3) (pin 1))
      (node (ref C3) (pin 2)))
    (net (code 101) (name "/Radio/Power Amplifier/PA_In")
      (node (ref U5) (pin 3))
      (node (ref L1) (pin 2)))))