<Qucs Schematic 0.0.19>
<Properties>
  <View=46,-50,1430,1822,0.674035,0,0>
  <Grid=10,10,1>
  <DataSet=RX.dat>
  <DataDisplay=RX.dpl>
  <OpenDisplay=1>
  <Script=RX.m>
  <RunScript=0>
  <showFrame=0>
  <FrameText0=Title>
  <FrameText1=Drawn By:>
  <FrameText2=Date:>
  <FrameText3=Revision:>
</Properties>
<Symbol>
  <.ID -20 14 SUB>
  <Line -20 -10 40 0 #000080 2 1>
  <Line 20 -10 0 20 #000080 2 1>
  <Line -20 10 40 0 #000080 2 1>
  <Line -20 -10 0 20 #000080 2 1>
  <Line -30 0 10 0 #000080 2 1>
</Symbol>
<Components>
  <C CC1 0 320 460 17 -26 0 1 "1 pF" 1 "" 0 "neutral" 0>
  <C CC2 0 320 660 25 -26 0 1 "1 pF" 1 "" 0 "neutral" 0>
  <GND * 1 280 710 0 0 0 0>
  <GND * 1 280 410 0 0 0 2>
  <GND * 1 580 410 0 0 0 2>
  <GND * 1 630 710 0 0 0 0>
  <GND * 1 910 710 0 0 0 0>
  <SUBST FR1 1 370 170 -30 24 0 0 "4.5" 1 "1.6mm" 1 "35 um" 1 "0.02" 1 "1.72e-8" 1 "0" 1>
  <Eqn SWR1 1 700 140 -28 15 0 0 "absS11=abs(S[1,1])" 1 "swr=(1+absS11)/(1-absS11)" 1 "yes" 0>
  <L LC1 1 240 460 -80 -26 1 1 "100 nH" 1 "" 0>
  <L LC2 1 240 660 -62 -26 1 1 "100nH" 1 "" 0>
  <C CT1 1 430 500 -26 -55 0 2 "4.3 pF" 1 "" 0 "neutral" 0>
  <C CT2 1 430 620 -26 -63 0 2 "4.3 pF" 1 "" 0 "neutral" 0>
  <L LT1 1 510 500 -26 -48 1 0 "43 nH" 1 "" 0>
  <L LT2 1 520 620 -26 -48 1 0 "43 nH" 1 "" 0>
  <C CM1 1 580 460 17 -26 0 1 "11 pF" 1 "" 0 "neutral" 0>
  <C CM2 1 590 660 -83 -26 1 1 "5.6 pF" 1 "" 0 "neutral" 0>
  <L LB1 1 750 500 -26 -48 0 2 "27 nH" 1 "" 0>
  <L LB2 1 670 660 10 -26 0 1 "27 nH" 1 "" 0>
  <C CB2 1 750 620 -26 -63 0 2 "5.1 pF" 1 "" 0 "neutral" 0>
  <Eqn Eqn2 1 531 144 -28 15 0 0 "dBS21=dB(S[2,1])" 1 "dBS11=dB(S[1,1])" 1 "yes" 0>
  <Pac ANTP1 1 180 560 -94 -26 1 1 "1" 1 "50 Ohm" 1 "0 dBm" 0 "1 GHz" 0 "26.85" 0>
  <Pac ANTP3 1 910 620 18 -26 0 1 "2" 1 "50 Ohm" 1 "0 dBm" 0 "1 GHz" 0 "26.85" 0>
  <.SP SP2 1 160 140 0 76 0 0 "log" 1 "100MHz" 1 "600MHz" 1 "100000" 1 "no" 0 "2" 0 "1" 0 "yes" 0 "yes" 0>
</Components>
<Wires>
  <460 500 480 500 "" 0 0 0 "">
  <540 500 580 500 "" 0 0 0 "">
  <580 490 580 500 "" 0 0 0 "">
  <320 500 400 500 "" 0 0 0 "">
  <320 490 320 500 "" 0 0 0 "">
  <240 500 320 500 "" 0 0 0 "">
  <240 490 240 500 "" 0 0 0 "">
  <240 410 240 430 "" 0 0 0 "">
  <240 410 280 410 "" 0 0 0 "">
  <320 410 320 430 "" 0 0 0 "">
  <580 410 580 430 "" 0 0 0 "">
  <460 620 490 620 "" 0 0 0 "">
  <550 620 590 620 "" 0 0 0 "">
  <590 620 590 630 "" 0 0 0 "">
  <240 620 320 620 "" 0 0 0 "">
  <240 620 240 630 "" 0 0 0 "">
  <320 620 400 620 "" 0 0 0 "">
  <320 620 320 630 "" 0 0 0 "">
  <240 690 240 710 "" 0 0 0 "">
  <240 710 280 710 "" 0 0 0 "">
  <320 690 320 710 "" 0 0 0 "">
  <280 710 320 710 "" 0 0 0 "">
  <280 410 320 410 "" 0 0 0 "">
  <590 620 670 620 "" 0 0 0 "">
  <590 710 630 710 "" 0 0 0 "">
  <590 690 590 710 "" 0 0 0 "">
  <630 710 670 710 "" 0 0 0 "">
  <670 690 670 710 "" 0 0 0 "">
  <670 620 670 630 "" 0 0 0 "">
  <580 500 720 500 "" 0 0 0 "">
  <670 620 720 620 "" 0 0 0 "">
  <780 620 810 620 "" 0 0 0 "">
  <780 500 810 500 "" 0 0 0 "">
  <810 500 810 560 "" 0 0 0 "">
  <810 560 810 620 "" 0 0 0 "">
  <810 560 910 560 "" 0 0 0 "">
  <910 560 910 590 "" 0 0 0 "">
  <910 650 910 710 "" 0 0 0 "">
  <180 620 240 620 "" 0 0 0 "">
  <180 590 180 620 "" 0 0 0 "">
  <180 500 240 500 "" 0 0 0 "">
  <180 500 180 530 "" 0 0 0 "">
  <910 560 910 560 "RF_SWITCH" 940 530 0 "">
  <180 620 180 620 "ANTN" 100 620 0 "">
  <180 500 180 500 "ANTP" 100 480 0 "">
</Wires>
<Diagrams>
  <Rect 140 1237 1275 467 3 #c0c0c0 1 00 1 0 0.2 1 1 -0.1 0.5 1.1 1 -0.1 0.5 1.1 315 0 225 "" "" "">
	<"dBS11" #0000ff 0 3 0 0 0>
	  <Mkr 4.33194e+08 910 -415 3 0 0>
	  <Mkr 4.18237e+08 782 -213 3 0 0>
	<"dBS21" #ff0000 0 3 0 0 0>
	  <Mkr 4.3432e+08 953 -571 3 0 0>
	  <Mkr 4.16674e+08 598 -511 3 0 0>
  </Rect>
  <Rect 130 1746 1280 406 3 #c0c0c0 1 00 1 1e+08 2e+07 6e+08 0 0 0.5 10 1 -1 0.2 1 315 0 225 "" "" "">
	<"swr" #0000ff 0 3 0 0 0>
	  <Mkr 4.3418e+08 916 -94 3 0 0>
  </Rect>
</Diagrams>
<Paintings>
</Paintings>
