<Qucs Schematic 0.0.19>
<Properties>
  <View=0,47,1348,1506,0.683014,0,74>
  <Grid=10,10,1>
  <DataSet=TX.dat>
  <DataDisplay=TX.dpl>
  <OpenDisplay=1>
  <Script=TX.m>
  <RunScript=0>
  <showFrame=0>
  <FrameText0=Title>
  <FrameText1=Drawn By:>
  <FrameText2=Date:>
  <FrameText3=Revision:>
</Properties>
<Symbol>
</Symbol>
<Components>
  <SUBST FR1 1 370 120 -30 24 0 0 "4.5" 1 "1.6mm" 1 "35 um" 1 "0.02" 1 "1.72e-8" 1 "0" 1>
  <Eqn SWR1 1 700 90 -28 15 0 0 "absS11=abs(S[1,1])" 1 "swr=(1+absS11)/(1-absS11)" 1 "yes" 0>
  <Eqn Eqn1 1 531 94 -28 15 0 0 "dBS21=dB(S[2,1])" 1 "dBS11=dB(S[1,1])" 1 "yes" 0>
  <.SP SP1 1 160 90 0 76 0 0 "log" 1 "100MHz" 1 "600MHz" 1 "100000" 1 "no" 0 "2" 0 "1" 0 "yes" 0 "yes" 0>
  <L LC 1 250 470 -62 -26 1 1 "100nH" 1 "" 0>
  <Pac ANTP1 1 140 470 -94 -26 1 1 "1" 1 "50 Ohm" 1 "0 dBm" 0 "1 GHz" 0 "26.85" 0>
  <C CT 1 400 420 -26 -63 0 2 "4.3 pF" 1 "" 0 "neutral" 0>
  <L LT 1 480 420 -26 -48 1 0 "43 nH" 1 "" 0>
  <L LF1 1 630 420 -26 -48 0 2 "4.7 nH" 1 "" 0>
  <Pac ANTP2 1 790 470 18 -26 0 1 "2" 1 "50 Ohm" 1 "0 dBm" 0 "1 GHz" 0 "26.85" 0>
  <C CA2 0 680 470 25 -26 1 3 "5.1 pF" 1 "" 0 "neutral" 0>
  <C CA1 1 580 470 -83 -26 1 1 "5.6 pF" 1 "" 0 "neutral" 0>
  <GND * 1 140 520 0 0 0 0>
  <GND * 1 250 520 0 0 0 0>
  <GND * 1 330 520 0 0 0 0>
  <GND * 1 630 520 0 0 0 0>
  <GND * 1 790 520 0 0 0 0>
  <C CC 0 330 480 25 -26 0 1 "1 pF" 1 "" 0 "neutral" 0>
  <C CF1 1 630 350 -26 -63 0 2 "6.8 pF" 1 "" 0 "neutral" 0>
</Components>
<Wires>
  <250 500 250 520 "" 0 0 0 "">
  <140 420 140 440 "" 0 0 0 "">
  <430 420 450 420 "" 0 0 0 "">
  <790 420 790 440 "" 0 0 0 "">
  <580 350 600 350 "" 0 0 0 "">
  <510 420 580 420 "" 0 0 0 "">
  <580 420 600 420 "" 0 0 0 "">
  <580 350 580 420 "" 0 0 0 "">
  <660 350 680 350 "" 0 0 0 "">
  <660 420 680 420 "" 0 0 0 "">
  <680 420 790 420 "" 0 0 0 "">
  <680 350 680 420 "" 0 0 0 "">
  <580 420 580 440 "" 0 0 0 "">
  <680 420 680 440 "" 0 0 0 "">
  <580 500 580 520 "" 0 0 0 "">
  <580 520 630 520 "" 0 0 0 "">
  <680 500 680 520 "" 0 0 0 "">
  <790 500 790 520 "" 0 0 0 "">
  <140 500 140 520 "" 0 0 0 "">
  <140 420 250 420 "" 0 0 0 "">
  <250 420 250 440 "" 0 0 0 "">
  <250 420 330 420 "" 0 0 0 "">
  <330 420 370 420 "" 0 0 0 "">
  <630 520 680 520 "" 0 0 0 "">
  <330 420 330 450 "" 0 0 0 "">
  <330 510 330 520 "" 0 0 0 "">
</Wires>
<Diagrams>
  <Rect 130 989 1171 399 3 #c0c0c0 1 00 1 0 0.2 1 1 -0.1 0.5 1.1 1 -0.1 0.5 1.1 315 0 225 "" "" "">
	<"dBS21" #0000ff 0 3 0 0 0>
	  <Mkr 4.33691e+08 842 -484 3 0 0>
	  <Mkr 3.87577e+08 604 -306 3 0 0>
	<"dBS11" #ff0000 0 3 0 0 0>
	  <Mkr 4.33691e+08 902 -195 3 0 0>
	  <Mkr 3.89715e+08 369 -123 3 0 0>
  </Rect>
  <Rect 120 1423 1180 393 3 #c0c0c0 1 00 1 1e+08 2e+07 6e+08 0 0 0.5 10 1 -1 0.2 1 315 0 225 "" "" "">
	<"swr" #0000ff 0 3 0 0 0>
	  <Mkr 3.90043e+08 425 -252 3 0 0>
	  <Mkr 4.33263e+08 797 -248 3 0 0>
  </Rect>
</Diagrams>
<Paintings>
</Paintings>
