EESchema Schematic File Version 4
EELAYER 30 0
EELAYER END
$Descr A4 11693 8268
encoding utf-8
Sheet 3 9
Title "PQ9ISH Sensor Module"
Date "2018-04-30"
Rev ""
Comp "Libre Space Foundation"
Comment1 ""
Comment2 ""
Comment3 ""
Comment4 ""
$EndDescr
$Comp
L MCU_ST_STM32L4:STM32L432KCUx U2
U 1 1 5AE77B53
P 4750 4000
F 0 "U2" H 4750 4050 50  0000 C CNN
F 1 "STM32L432KCUx" H 5250 4850 50  0000 C CNN
F 2 "Package_DFN_QFN:QFN-32-1EP_5x5mm_P0.5mm_EP3.45x3.45mm" H 4350 3100 50  0001 R CNN
F 3 "http://www.st.com/st-web-ui/static/active/en/resource/technical/document/datasheet/DM00257205.pdf" H 4750 4000 50  0001 C CNN
F 4 "STM32L432KCU6" H 0   0   50  0001 C CNN "Part Number"
	1    4750 4000
	1    0    0    -1  
$EndComp
$Comp
L power:GND #PWR0101
U 1 1 5AE77BC6
P 4750 5100
F 0 "#PWR0101" H 4750 4850 50  0001 C CNN
F 1 "GND" H 4755 4927 50  0000 C CNN
F 2 "" H 4750 5100 50  0001 C CNN
F 3 "" H 4750 5100 50  0001 C CNN
	1    4750 5100
	1    0    0    -1  
$EndComp
Wire Wire Line
	4650 5000 4750 5000
Connection ~ 4750 5000
Wire Wire Line
	4750 5000 4850 5000
Wire Wire Line
	4750 5000 4750 5100
$Comp
L Device:R R4
U 1 1 5AE77C09
P 3900 3000
F 0 "R4" H 3970 3046 50  0000 L CNN
F 1 "10K" H 3970 2955 50  0000 L CNN
F 2 "Resistor_SMD:R_0603_1608Metric_Pad0.99x1.00mm_HandSolder" V 3830 3000 50  0001 C CNN
F 3 "~" H 3900 3000 50  0001 C CNN
F 4 "CRCW060310K0FKEA" H 0   0   50  0001 C CNN "Part Number"
	1    3900 3000
	1    0    0    -1  
$EndComp
$Comp
L power:+3.3V #PWR0102
U 1 1 5AE77D40
P 3900 2750
F 0 "#PWR0102" H 3900 2600 50  0001 C CNN
F 1 "+3.3V" H 3915 2923 50  0000 C CNN
F 2 "" H 3900 2750 50  0001 C CNN
F 3 "" H 3900 2750 50  0001 C CNN
	1    3900 2750
	1    0    0    -1  
$EndComp
Wire Wire Line
	3900 2750 3900 2850
Wire Wire Line
	3900 3150 3900 3300
Wire Wire Line
	3900 3300 4250 3300
Text HLabel 4250 4500 0    50   Input ~ 0
PQ_RESET
Text HLabel 5250 4500 2    50   Input ~ 0
CAN_Tx
Text HLabel 5250 4400 2    50   Input ~ 0
CAN_Rx
Text HLabel 5250 4000 2    50   Input ~ 0
CAN_EN
Text HLabel 5250 4300 2    50   Input ~ 0
I2C1_SDA
Text HLabel 5250 4200 2    50   Input ~ 0
I2C1_SCL
Text HLabel 5250 4100 2    50   Input ~ 0
SENS1_V_PWM
Text HLabel 4250 4200 0    50   Input ~ 0
SENS1_IO1
Text HLabel 4250 4300 0    50   Input ~ 0
SENS1_IO2
Text HLabel 4250 4600 0    50   Input ~ 0
SENS3_V
Text HLabel 5250 3800 2    50   Input ~ 0
SENS3_IO1
Text HLabel 5250 3900 2    50   Input ~ 0
SENS3_IO2
Text HLabel 5250 4800 2    50   Input ~ 0
SENS2_V_PWM
Text HLabel 5250 3400 2    50   Input ~ 0
SENS2_IO1
Text HLabel 5250 3500 2    50   Input ~ 0
SENS2_IO2
Text HLabel 4250 4400 0    50   Input ~ 0
SENS4_V
Text HLabel 5250 3600 2    50   Input ~ 0
SENS4_IO1
Text HLabel 5250 3700 2    50   Input ~ 0
SENS4_IO2
Text HLabel 4250 4700 0    50   Input ~ 0
RS232_TX
Text HLabel 4250 4800 0    50   Input ~ 0
RS232_RX
$Comp
L Device:C_Small C6
U 1 1 5A7DE7BC
P 6100 2300
F 0 "C6" H 6110 2370 50  0000 L CNN
F 1 "100nF" H 6110 2220 50  0000 L CNN
F 2 "Capacitor_SMD:C_0603_1608Metric_Pad0.99x1.00mm_HandSolder" H 6100 2300 50  0001 C CNN
F 3 "" H 6100 2300 50  0001 C CNN
F 4 "C0603C104K9RACTU" H 6100 2300 50  0001 C CNN "Part Number"
	1    6100 2300
	1    0    0    -1  
$EndComp
$Comp
L Device:CP1_Small C2
U 1 1 5A7DE885
P 5250 2550
F 0 "C2" H 5260 2620 50  0000 L CNN
F 1 "1uF" H 5260 2470 50  0000 L CNN
F 2 "Capacitor_SMD:C_0603_1608Metric_Pad0.99x1.00mm_HandSolder" H 5250 2550 50  0001 C CNN
F 3 "" H 5250 2550 50  0001 C CNN
F 4 "GRM188C70J105MA01D" H 5250 2550 50  0001 C CNN "Part Number"
	1    5250 2550
	1    0    0    -1  
$EndComp
$Comp
L Device:C_Small C1
U 1 1 5A7DE90E
P 5000 2550
F 0 "C1" H 5010 2620 50  0000 L CNN
F 1 "10nF" H 5010 2470 50  0000 L CNN
F 2 "Capacitor_SMD:C_0603_1608Metric_Pad0.99x1.00mm_HandSolder" H 5000 2550 50  0001 C CNN
F 3 "" H 5000 2550 50  0001 C CNN
F 4 "C0603C103K9RACTU" H 5000 2550 50  0001 C CNN "Part Number"
	1    5000 2550
	1    0    0    -1  
$EndComp
$Comp
L Device:C_Small C5
U 1 1 5A7DE939
P 5750 2300
F 0 "C5" H 5760 2370 50  0000 L CNN
F 1 "100nF" H 5760 2220 50  0000 L CNN
F 2 "Capacitor_SMD:C_0603_1608Metric_Pad0.99x1.00mm_HandSolder" H 5750 2300 50  0001 C CNN
F 3 "" H 5750 2300 50  0001 C CNN
F 4 "C0603C104K9RACTU" H 5750 2300 50  0001 C CNN "Part Number"
	1    5750 2300
	1    0    0    -1  
$EndComp
$Comp
L power:GND #PWR0103
U 1 1 5A7DEA89
P 5000 2700
F 0 "#PWR0103" H 5000 2450 50  0001 C CNN
F 1 "GND" H 5000 2550 50  0000 C CNN
F 2 "" H 5000 2700 50  0001 C CNN
F 3 "" H 5000 2700 50  0001 C CNN
	1    5000 2700
	1    0    0    -1  
$EndComp
Wire Wire Line
	4850 2400 5000 2400
Wire Wire Line
	5000 2700 5000 2650
Wire Wire Line
	5250 2650 5250 2700
Wire Wire Line
	5250 2700 5000 2700
Connection ~ 5000 2400
Wire Wire Line
	5000 2400 5000 2450
Wire Wire Line
	5250 2400 5250 2450
Wire Wire Line
	6100 2200 6100 2050
Wire Wire Line
	4650 2050 4650 3100
Wire Wire Line
	4750 2050 4750 3100
Connection ~ 4750 2050
Wire Wire Line
	5750 2050 5750 2200
Connection ~ 5750 2050
Wire Wire Line
	6100 2500 6100 2400
Wire Wire Line
	5750 2400 5750 2500
Connection ~ 5750 2500
$Comp
L power:GND #PWR0104
U 1 1 5A7DED74
P 5750 2500
F 0 "#PWR0104" H 5750 2250 50  0001 C CNN
F 1 "GND" H 5750 2350 50  0000 C CNN
F 2 "" H 5750 2500 50  0001 C CNN
F 3 "" H 5750 2500 50  0001 C CNN
	1    5750 2500
	1    0    0    -1  
$EndComp
Wire Wire Line
	5000 2400 5250 2400
Wire Wire Line
	4650 2050 4750 2050
Wire Wire Line
	5750 2050 6100 2050
Wire Wire Line
	5750 2500 6100 2500
Connection ~ 5000 2700
Wire Wire Line
	4750 2050 5750 2050
Wire Wire Line
	4850 3100 4850 2400
$Comp
L power:+3.3V #PWR0105
U 1 1 5AEAA14C
P 5750 2050
F 0 "#PWR0105" H 5750 1900 50  0001 C CNN
F 1 "+3.3V" H 5765 2223 50  0000 C CNN
F 2 "" H 5750 2050 50  0001 C CNN
F 3 "" H 5750 2050 50  0001 C CNN
	1    5750 2050
	1    0    0    -1  
$EndComp
$Comp
L power:VAA #PWR0106
U 1 1 5AEAA1D3
P 5000 2400
F 0 "#PWR0106" H 5000 2250 50  0001 C CNN
F 1 "VAA" H 5017 2573 50  0000 C CNN
F 2 "" H 5000 2400 50  0001 C CNN
F 3 "" H 5000 2400 50  0001 C CNN
	1    5000 2400
	1    0    0    -1  
$EndComp
Text HLabel 5250 4600 2    50   Input ~ 0
SWDIO
Text HLabel 5250 4700 2    50   Input ~ 0
SWCLK
Text HLabel 3900 3300 0    50   Input ~ 0
NRST
NoConn ~ 5250 3300
NoConn ~ 4250 3900
NoConn ~ 4250 4000
$Comp
L power:VAA #PWR0110
U 1 1 5AEF6AF1
P 3650 1650
F 0 "#PWR0110" H 3650 1500 50  0001 C CNN
F 1 "VAA" H 3667 1823 50  0000 C CNN
F 2 "" H 3650 1650 50  0001 C CNN
F 3 "" H 3650 1650 50  0001 C CNN
	1    3650 1650
	-1   0    0    1   
$EndComp
$Comp
L power:+3.3V #PWR0111
U 1 1 5AEF6B14
P 3650 1600
F 0 "#PWR0111" H 3650 1450 50  0001 C CNN
F 1 "+3.3V" H 3665 1773 50  0000 C CNN
F 2 "" H 3650 1600 50  0001 C CNN
F 3 "" H 3650 1600 50  0001 C CNN
	1    3650 1600
	1    0    0    -1  
$EndComp
Wire Wire Line
	3650 1600 3650 1650
$Comp
L Device:R R301
U 1 1 5F4D0F02
P 3900 3700
F 0 "R301" V 4107 3700 50  0000 C CNN
F 1 "10K" V 4016 3700 50  0000 C CNN
F 2 "Resistor_SMD:R_0603_1608Metric_Pad1.05x0.95mm_HandSolder" V 3830 3700 50  0001 C CNN
F 3 "~" H 3900 3700 50  0001 C CNN
F 4 "CRCW060310K0FKEA" H 0   700 50  0001 C CNN "Part Number"
	1    3900 3700
	0    -1   -1   0   
$EndComp
$Comp
L power:GND #PWR0117
U 1 1 5F4D1B73
P 3550 3850
F 0 "#PWR0117" H 3550 3600 50  0001 C CNN
F 1 "GND" H 3555 3677 50  0000 C CNN
F 2 "" H 3550 3850 50  0001 C CNN
F 3 "" H 3550 3850 50  0001 C CNN
	1    3550 3850
	1    0    0    -1  
$EndComp
Wire Wire Line
	4250 3700 4050 3700
Wire Wire Line
	3550 3700 3550 3850
Wire Wire Line
	3750 3700 3550 3700
$EndSCHEMATC
