EESchema Schematic File Version 4
EELAYER 30 0
EELAYER END
$Descr A4 11693 8268
encoding utf-8
Sheet 1 9
Title "PQ9ISH Sensor Module"
Date "2018-04-30"
Rev ""
Comp "Libre Space Foundation"
Comment1 ""
Comment2 ""
Comment3 ""
Comment4 ""
$EndDescr
$Sheet
S 6700 1900 900  1100
U 5AE76C56
F0 "PQ Bus" 50
F1 "PQ_Bus.sch" 50
F2 "RST" I L 6700 2050 50 
F3 "CAN1TX" I L 6700 2300 50 
F4 "CAN1RX" I L 6700 2400 50 
F5 "CanEn" I L 6700 2500 50 
$EndSheet
$Sheet
S 5100 1900 1250 3500
U 5AE772DD
F0 "MCU" 50
F1 "MCU.sch" 50
F2 "PQ_RESET" I R 6350 2050 50 
F3 "CAN_Tx" I R 6350 2300 50 
F4 "CAN_Rx" I R 6350 2400 50 
F5 "CAN_EN" I R 6350 2500 50 
F6 "I2C1_SDA" I R 6350 3650 50 
F7 "I2C1_SCL" I R 6350 3750 50 
F8 "SENS1_V_PWM" I L 5100 2050 50 
F9 "SENS1_IO1" I L 5100 2200 50 
F10 "SENS1_IO2" I L 5100 2300 50 
F11 "SENS3_V" I L 5100 3300 50 
F12 "SENS3_IO1" I L 5100 3450 50 
F13 "SENS3_IO2" I L 5100 3550 50 
F14 "SENS2_V_PWM" I L 5100 2650 50 
F15 "SENS2_IO1" I L 5100 2800 50 
F16 "SENS2_IO2" I L 5100 2900 50 
F17 "SENS4_V" I L 5100 3950 50 
F18 "SENS4_IO1" I L 5100 4100 50 
F19 "SENS4_IO2" I L 5100 4200 50 
F20 "RS232_TX" I R 6350 4750 50 
F21 "RS232_RX" I R 6350 4850 50 
F22 "SWDIO" I L 5100 4800 50 
F23 "SWCLK" I L 5100 5000 50 
F24 "NRST" I L 5100 4700 50 
$EndSheet
$Sheet
S 4300 1950 550  400 
U 5AE772E0
F0 "MQ-7" 50
F1 "MQ-7.sch" 50
F2 "S_Power" I R 4850 2050 50 
F3 "MQ-7_VRL" I R 4850 2200 50 
$EndSheet
Wire Wire Line
	6350 2050 6700 2050
Wire Wire Line
	6350 2300 6700 2300
Wire Wire Line
	6350 2400 6700 2400
Wire Wire Line
	6350 2500 6700 2500
Wire Wire Line
	4850 2050 5100 2050
Wire Wire Line
	5100 2200 4850 2200
$Comp
L Connector_Generic:Conn_01x04 J7
U 1 1 5AEB57A8
P 4500 4900
F 0 "J7" H 4650 4800 50  0000 C CNN
F 1 "SWD" H 4650 4900 50  0000 C CNN
F 2 "Connector_JST:JST_SH_SM04B-SRSS-TB_1x04-1MP_P1.00mm_Horizontal" H 4500 4900 50  0001 C CNN
F 3 "~" H 4500 4900 50  0001 C CNN
F 4 "SM04B-SRSS-TB" H 0   0   50  0001 C CNN "Part Number"
	1    4500 4900
	-1   0    0    1   
$EndComp
$Comp
L power:GND #PWR04
U 1 1 5AEB5965
P 4800 4900
F 0 "#PWR04" H 4800 4650 50  0001 C CNN
F 1 "GND" V 4805 4772 50  0000 R CNN
F 2 "" H 4800 4900 50  0001 C CNN
F 3 "" H 4800 4900 50  0001 C CNN
	1    4800 4900
	0    -1   -1   0   
$EndComp
Wire Wire Line
	4800 4900 4700 4900
Wire Wire Line
	4700 4700 5100 4700
Wire Wire Line
	5100 4800 4700 4800
Wire Wire Line
	4700 5000 5100 5000
$Sheet
S 7900 1900 850  1100
U 5AEBEABD
F0 "PSU" 50
F1 "PSU.sch" 50
$EndSheet
NoConn ~ 6350 4750
NoConn ~ 6350 4850
$Sheet
S 4200 3150 650  400 
U 5AEE333D
F0 "MQ-131" 50
F1 "MQ-131.sch" 50
F2 "MQ-131_VRL" I R 4850 3450 50 
F3 "S_Power" I R 4850 3300 50 
$EndSheet
$Sheet
S 4300 3800 550  400 
U 5AEE3360
F0 "MICS" 50
F1 "MICS.sch" 50
F2 "S_Power" I R 4850 3950 50 
F3 "VSense" I R 4850 4100 50 
$EndSheet
$Sheet
S 6700 3350 750  700 
U 5AEE338B
F0 "BME280" 50
F1 "BME280.sch" 50
F2 "SDI" I L 6700 3650 50 
F3 "SCK" I L 6700 3750 50 
$EndSheet
Wire Wire Line
	4850 3950 5100 3950
Wire Wire Line
	5100 4100 4850 4100
Wire Wire Line
	4850 3300 5100 3300
Wire Wire Line
	4850 3450 5100 3450
Wire Wire Line
	6350 3650 6700 3650
Wire Wire Line
	6700 3750 6350 3750
NoConn ~ 5100 4200
NoConn ~ 5100 3550
NoConn ~ 5100 2900
NoConn ~ 5100 2300
$Comp
L power:PWR_FLAG #FLG0103
U 1 1 5AF1B2CF
P 2650 1250
F 0 "#FLG0103" H 2650 1325 50  0001 C CNN
F 1 "PWR_FLAG" H 2650 1424 50  0000 C CNN
F 2 "" H 2650 1250 50  0001 C CNN
F 3 "~" H 2650 1250 50  0001 C CNN
	1    2650 1250
	1    0    0    -1  
$EndComp
$Comp
L power:GND #PWR0114
U 1 1 5AF1B2F6
P 2650 1350
F 0 "#PWR0114" H 2650 1100 50  0001 C CNN
F 1 "GND" H 2655 1177 50  0000 C CNN
F 2 "" H 2650 1350 50  0001 C CNN
F 3 "" H 2650 1350 50  0001 C CNN
	1    2650 1350
	1    0    0    -1  
$EndComp
Wire Wire Line
	2650 1350 2650 1250
$Sheet
S 4350 2550 500  400 
U 5AF059E4
F0 "FAN" 50
F1 "FAN.sch" 50
F2 "FAN_Pulse" I R 4850 2800 50 
F3 "S_Power" I R 4850 2650 50 
$EndSheet
Wire Wire Line
	4850 2650 5100 2650
Wire Wire Line
	5100 2800 4850 2800
$Comp
L Graphic:Logo_Open_Hardware_Small LOGO101
U 1 1 5B09C630
P 10850 6850
F 0 "LOGO101" H 10850 7125 50  0001 C CNN
F 1 "Logo_Open_Hardware_Small" H 10850 6625 50  0001 C CNN
F 2 "OSHW-Symbol_6.7x6mm_SilkScreen" H 10850 6850 50  0001 C CNN
F 3 "~" H 10850 6850 50  0001 C CNN
	1    10850 6850
	1    0    0    -1  
$EndComp
$EndSCHEMATC
