EESchema Schematic File Version 4
EELAYER 30 0
EELAYER END
$Descr A4 11693 8268
encoding utf-8
Sheet 6 9
Title ""
Date ""
Rev ""
Comp ""
Comment1 ""
Comment2 ""
Comment3 ""
Comment4 ""
$EndDescr
Text Label 5400 3200 0    50   ~ 0
MQ-131_VH
Text HLabel 5650 3550 0    50   Input ~ 0
MQ-131_VRL
Text HLabel 4200 3600 0    50   Input ~ 0
S_Power
$Comp
L lsf-kicad:Si1401EDH Q2
U 1 1 5AEE58DC
P 4750 3200
F 0 "Q2" V 5375 3200 50  0000 C CNN
F 1 "SSM6J216FE" V 5284 3200 50  0000 C CNN
F 2 "lsf-kicad-lib:SOT-563" H 4950 3300 50  0001 C CNN
F 3 "http://www.vishay.com/docs/70080/si1401ed.pdf" H 4750 3200 50  0001 C CNN
F 4 "SSM6J216FE" H 0   -100 50  0001 C CNN "Part Number"
	1    4750 3200
	0    1    -1   0   
$EndComp
$Comp
L Device:R R7
U 1 1 5AEE58E3
P 4400 3450
F 0 "R7" H 4470 3496 50  0000 L CNN
F 1 "100K" H 4470 3405 50  0000 L CNN
F 2 "Resistor_SMD:R_0603_1608Metric_Pad0.99x1.00mm_HandSolder" V 4330 3450 50  0001 C CNN
F 3 "~" H 4400 3450 50  0001 C CNN
F 4 "CRCW0603100KFKEA" H 0   0   50  0001 C CNN "Part Number"
	1    4400 3450
	-1   0    0    -1  
$EndComp
Wire Wire Line
	4200 3600 4400 3600
Wire Wire Line
	4750 3600 4750 3500
Wire Wire Line
	4400 3600 4750 3600
Wire Wire Line
	4400 3300 4400 3200
Connection ~ 4400 3200
Wire Wire Line
	4400 3200 4550 3200
Connection ~ 4950 3200
Connection ~ 4400 3600
$Comp
L Device:C C4
U 1 1 5AEE58F8
P 4950 3800
F 0 "C4" H 5065 3846 50  0000 L CNN
F 1 "47uF" H 5065 3755 50  0000 L CNN
F 2 "Capacitor_SMD:C_1206_3216Metric_Pad1.39x1.80mm_HandSolder" H 4988 3650 50  0001 C CNN
F 3 "~" H 4950 3800 50  0001 C CNN
F 4 "GRM31CE70J476ME15L" H 4950 3800 50  0001 C CNN "Part Number"
	1    4950 3800
	-1   0    0    -1  
$EndComp
Wire Wire Line
	4950 3650 4950 3200
$Comp
L power:GND #PWR09
U 1 1 5AEE5900
P 4950 4000
F 0 "#PWR09" H 4950 3750 50  0001 C CNN
F 1 "GND" H 4955 3827 50  0000 C CNN
F 2 "" H 4950 4000 50  0001 C CNN
F 3 "" H 4950 4000 50  0001 C CNN
	1    4950 4000
	-1   0    0    -1  
$EndComp
Wire Wire Line
	4950 4000 4950 3950
$Comp
L lsf-kicad:MQ-131 S2
U 1 1 5AEE5907
P 6200 3550
F 0 "S2" H 6450 3850 50  0000 L CNN
F 1 "MQ-131" H 6450 3750 50  0000 L CNN
F 2 "lsf-kicad-lib:MQ-131" H 6150 4050 50  0001 C CNN
F 3 "https://www.sparkfun.com/datasheets/Sensors/Biometric/MQ-7.pdf" H 6500 4150 50  0001 C CNN
	1    6200 3550
	1    0    0    -1  
$EndComp
$Comp
L power:GND #PWR011
U 1 1 5AEE590E
P 6200 4000
F 0 "#PWR011" H 6200 3750 50  0001 C CNN
F 1 "GND" H 6205 3827 50  0000 C CNN
F 2 "" H 6200 4000 50  0001 C CNN
F 3 "" H 6200 4000 50  0001 C CNN
	1    6200 4000
	1    0    0    -1  
$EndComp
$Comp
L Device:R R8
U 1 1 5AEE5914
P 5750 3800
F 0 "R8" H 5820 3846 50  0000 L CNN
F 1 "9.53K" H 5820 3755 50  0000 L CNN
F 2 "Resistor_SMD:R_0603_1608Metric_Pad0.99x1.00mm_HandSolder" V 5680 3800 50  0001 C CNN
F 3 "~" H 5750 3800 50  0001 C CNN
F 4 "RR0816P-9531-D-95H" H 0   0   50  0001 C CNN "Part Number"
	1    5750 3800
	1    0    0    -1  
$EndComp
$Comp
L power:GND #PWR010
U 1 1 5AEE591B
P 5750 4000
F 0 "#PWR010" H 5750 3750 50  0001 C CNN
F 1 "GND" H 5755 3827 50  0000 C CNN
F 2 "" H 5750 4000 50  0001 C CNN
F 3 "" H 5750 4000 50  0001 C CNN
	1    5750 4000
	1    0    0    -1  
$EndComp
Wire Wire Line
	5750 3550 5750 3650
Wire Wire Line
	5750 3950 5750 4000
Wire Wire Line
	6200 3900 6200 4000
Text GLabel 4200 3200 0    50   Input ~ 0
5V
Wire Wire Line
	4400 3200 4200 3200
Wire Wire Line
	5650 3550 5750 3550
Wire Wire Line
	6800 3550 6650 3550
Wire Wire Line
	6800 3200 6800 3550
Wire Wire Line
	4950 2900 4950 3000
Wire Wire Line
	4950 3200 6200 3200
Wire Wire Line
	4950 3000 4950 3100
Connection ~ 4950 3000
Connection ~ 4950 3100
Wire Wire Line
	4950 3100 4950 3200
Connection ~ 5750 3550
Connection ~ 6200 3200
Wire Wire Line
	6200 3200 6800 3200
$EndSCHEMATC
