EESchema Schematic File Version 4
EELAYER 30 0
EELAYER END
$Descr A4 11693 8268
encoding utf-8
Sheet 8 9
Title ""
Date ""
Rev ""
Comp ""
Comment1 ""
Comment2 ""
Comment3 ""
Comment4 ""
$EndDescr
$Comp
L BME:BME280 U6
U 1 1 5AEBD0A1
P 6400 2050
F 0 "U6" H 6700 2400 60  0000 C CNN
F 1 "BME280" H 6200 2400 60  0000 C CNN
F 2 "BME:BME280" H 6400 2050 60  0001 C CNN
F 3 "" H 6400 2050 60  0001 C CNN
F 4 "BME280" H 0   0   50  0001 C CNN "Part Number"
	1    6400 2050
	1    0    0    -1  
$EndComp
Wire Wire Line
	5100 1950 5250 1950
Wire Wire Line
	5900 2050 5550 2050
$Comp
L Device:C C7
U 1 1 5AEE2037
P 7000 2450
F 0 "C7" H 6800 2500 50  0000 L CNN
F 1 "100nF" H 6650 2400 50  0000 L CNN
F 2 "Capacitor_SMD:C_0603_1608Metric_Pad0.99x1.00mm_HandSolder" H 7038 2300 50  0001 C CNN
F 3 "~" H 7000 2450 50  0001 C CNN
F 4 "C0603C104K9RACTU" H 0   0   50  0001 C CNN "Part Number"
	1    7000 2450
	1    0    0    -1  
$EndComp
$Comp
L Device:C C8
U 1 1 5AEE20FD
P 7300 2450
F 0 "C8" H 7415 2496 50  0000 L CNN
F 1 "100nF" H 7415 2405 50  0000 L CNN
F 2 "Capacitor_SMD:C_0603_1608Metric_Pad0.99x1.00mm_HandSolder" H 7338 2300 50  0001 C CNN
F 3 "~" H 7300 2450 50  0001 C CNN
F 4 "C0603C104K9RACTU" H 0   0   50  0001 C CNN "Part Number"
	1    7300 2450
	1    0    0    -1  
$EndComp
$Comp
L Device:R R20
U 1 1 5AEE2159
P 5550 1500
F 0 "R20" H 5620 1546 50  0000 L CNN
F 1 "4.7K" H 5620 1455 50  0000 L CNN
F 2 "Resistor_SMD:R_0603_1608Metric_Pad0.99x1.00mm_HandSolder" V 5480 1500 50  0001 C CNN
F 3 "~" H 5550 1500 50  0001 C CNN
F 4 "CRCW06034K70FKEA" H 0   0   50  0001 C CNN "Part Number"
	1    5550 1500
	1    0    0    -1  
$EndComp
$Comp
L Device:R R19
U 1 1 5AEE21E7
P 5250 1500
F 0 "R19" H 5320 1546 50  0000 L CNN
F 1 "4.7K" H 5320 1455 50  0000 L CNN
F 2 "Resistor_SMD:R_0603_1608Metric_Pad0.99x1.00mm_HandSolder" V 5180 1500 50  0001 C CNN
F 3 "~" H 5250 1500 50  0001 C CNN
F 4 "CRCW06034K70FKEA" H 0   0   50  0001 C CNN "Part Number"
	1    5250 1500
	1    0    0    -1  
$EndComp
Wire Wire Line
	5250 1650 5250 1950
Connection ~ 5250 1950
Wire Wire Line
	5250 1950 5900 1950
Wire Wire Line
	5550 1650 5550 2050
Connection ~ 5550 2050
Wire Wire Line
	5550 2050 5100 2050
Wire Wire Line
	5100 1350 5250 1350
Wire Wire Line
	6900 2150 7000 2150
Wire Wire Line
	7300 2150 7300 1950
Connection ~ 7300 1950
Wire Wire Line
	7300 1350 7300 1950
$Comp
L Device:Jumper_NC_Dual JP3
U 1 1 5AEE2B14
P 7750 2250
F 0 "JP3" V 7704 2352 50  0000 L CNN
F 1 "BME Address" V 7795 2352 50  0000 L CNN
F 2 "Jumper:SolderJumper-3_P1.3mm_Open_RoundedPad1.0x1.5mm_NumberLabels" H 7750 2250 50  0001 C CNN
F 3 "~" H 7750 2250 50  0001 C CNN
F 4 "" H 0   0   50  0001 C CNN "Part Number"
	1    7750 2250
	0    1    1    0   
$EndComp
Wire Wire Line
	7650 2250 6900 2250
Wire Wire Line
	7750 2000 7750 1950
Wire Wire Line
	7750 1950 7300 1950
Wire Wire Line
	7000 2300 7000 2150
Connection ~ 7000 2150
Wire Wire Line
	7000 2150 7300 2150
Wire Wire Line
	7300 2300 7300 2150
Connection ~ 7300 2150
$Comp
L power:GND #PWR019
U 1 1 5AEE35C0
P 7000 2650
F 0 "#PWR019" H 7000 2400 50  0001 C CNN
F 1 "GND" H 7005 2477 50  0000 C CNN
F 2 "" H 7000 2650 50  0001 C CNN
F 3 "" H 7000 2650 50  0001 C CNN
	1    7000 2650
	1    0    0    -1  
$EndComp
$Comp
L power:GND #PWR020
U 1 1 5AEE35EC
P 7300 2650
F 0 "#PWR020" H 7300 2400 50  0001 C CNN
F 1 "GND" H 7305 2477 50  0000 C CNN
F 2 "" H 7300 2650 50  0001 C CNN
F 3 "" H 7300 2650 50  0001 C CNN
	1    7300 2650
	1    0    0    -1  
$EndComp
$Comp
L power:GND #PWR017
U 1 1 5AEE3667
P 6300 2600
F 0 "#PWR017" H 6300 2350 50  0001 C CNN
F 1 "GND" V 6300 2500 50  0000 R CNN
F 2 "" H 6300 2600 50  0001 C CNN
F 3 "" H 6300 2600 50  0001 C CNN
	1    6300 2600
	1    0    0    -1  
$EndComp
Connection ~ 5550 1350
Wire Wire Line
	7000 2600 7000 2650
Wire Wire Line
	7300 2600 7300 2650
$Comp
L power:GND #PWR021
U 1 1 5AEE5088
P 7750 2650
F 0 "#PWR021" H 7750 2400 50  0001 C CNN
F 1 "GND" H 7755 2477 50  0000 C CNN
F 2 "" H 7750 2650 50  0001 C CNN
F 3 "" H 7750 2650 50  0001 C CNN
	1    7750 2650
	1    0    0    -1  
$EndComp
Wire Wire Line
	7750 2650 7750 2500
Connection ~ 5250 1350
Wire Wire Line
	5250 1350 5550 1350
Text Label 5600 1350 0    50   ~ 0
BME_VDD
Text Label 5300 1950 0    50   ~ 0
SDI
Text Label 5300 2050 0    50   ~ 0
SCK
Text Label 7400 2250 0    50   ~ 0
SDO
$Comp
L power:GND #PWR018
U 1 1 5AEDF05B
P 6400 2600
F 0 "#PWR018" H 6400 2350 50  0001 C CNN
F 1 "GND" V 6400 2400 50  0000 C CNN
F 2 "" H 6400 2600 50  0001 C CNN
F 3 "" H 6400 2600 50  0001 C CNN
	1    6400 2600
	1    0    0    -1  
$EndComp
Wire Wire Line
	6400 2550 6400 2600
Wire Wire Line
	6300 2550 6300 2600
Wire Wire Line
	6500 1550 6500 1350
Connection ~ 6500 1350
Wire Wire Line
	6500 1350 6600 1350
Wire Wire Line
	6600 1350 6600 1550
Connection ~ 6600 1350
Wire Wire Line
	6600 1350 7300 1350
Text HLabel 5100 1950 0    50   Input ~ 0
SDI
Text HLabel 5100 2050 0    50   Input ~ 0
SCK
Wire Wire Line
	5550 1350 6500 1350
$Comp
L power:+3.3V #PWR0116
U 1 1 5AEEF1C3
P 5100 1350
F 0 "#PWR0116" H 5100 1200 50  0001 C CNN
F 1 "+3.3V" H 5115 1523 50  0000 C CNN
F 2 "" H 5100 1350 50  0001 C CNN
F 3 "" H 5100 1350 50  0001 C CNN
	1    5100 1350
	1    0    0    -1  
$EndComp
$EndSCHEMATC
