(module BME280 (layer F.Cu) (tedit 5B0880A7)
  (attr smd)
  (fp_text reference U6 (at -3.040081 -0.196155 90) (layer F.SilkS)
    (effects (font (size 1 1) (thickness 0.15)))
  )
  (fp_text value BME280 (at 0.2667 2.54) (layer F.Fab)
    (effects (font (size 1 1) (thickness 0.15)))
  )
  (fp_line (start 1.397 0.5588) (end 0.5588 1.3843) (layer F.Fab) (width 0.15))
  (fp_line (start 1.397 0.5588) (end 1.397 -1.397) (layer F.Fab) (width 0.15))
  (fp_line (start -1.397 1.397) (end 0.5461 1.397) (layer F.Fab) (width 0.15))
  (fp_line (start -1.397 -1.397) (end -1.397 1.397) (layer F.Fab) (width 0.15))
  (fp_line (start 1.397 -1.397) (end -1.397 -1.397) (layer F.Fab) (width 0.15))
  (fp_text user %R (at 4.2418 -1.7399 180) (layer F.Fab)
    (effects (font (size 1 1) (thickness 0.15)))
  )
  (fp_line (start 1.4 1.4) (end 1.4 -1.4) (layer F.CrtYd) (width 0.05))
  (fp_line (start -1.4 1.4) (end 1.4 1.4) (layer F.CrtYd) (width 0.05))
  (fp_line (start -1.4 -1.4) (end -1.4 1.4) (layer F.CrtYd) (width 0.05))
  (fp_line (start 1.4 -1.4) (end -1.4 -1.4) (layer F.CrtYd) (width 0.05))
  (fp_line (start -1.4 1.4) (end 0.4 1.4) (layer F.SilkS) (width 0.15))
  (fp_line (start -1.4 -1.4) (end -1.4 1.4) (layer F.SilkS) (width 0.15))
  (fp_line (start 1.4 -1.4) (end -1.4 -1.4) (layer F.SilkS) (width 0.15))
  (fp_line (start 1.4 0.4) (end 1.4 -1.4) (layer F.SilkS) (width 0.15))
  (fp_line (start 0.7 1.5) (end 1.5 1.5) (layer F.SilkS) (width 0.15))
  (fp_line (start 1.5 1.5) (end 1.5 0.7) (layer F.SilkS) (width 0.15))
  (pad 4 smd rect (at -0.975 0.975) (size 0.35 0.35) (layers F.Cu F.Paste F.Mask))
  (pad 5 smd rect (at -0.975 -0.975) (size 0.35 0.35) (layers F.Cu F.Paste F.Mask))
  (pad 3 smd rect (at -0.325 0.975) (size 0.35 0.35) (layers F.Cu F.Paste F.Mask))
  (pad 6 smd rect (at -0.325 -0.975) (size 0.35 0.35) (layers F.Cu F.Paste F.Mask))
  (pad 2 smd rect (at 0.325 0.975) (size 0.35 0.35) (layers F.Cu F.Paste F.Mask))
  (pad 7 smd rect (at 0.325 -0.975) (size 0.35 0.35) (layers F.Cu F.Paste F.Mask))
  (pad 1 smd rect (at 0.975 0.975) (size 0.35 0.35) (layers F.Cu F.Paste F.Mask))
  (pad 8 smd rect (at 0.975 -0.975) (size 0.35 0.35) (layers F.Cu F.Paste F.Mask))
  (model ${KIPRJMOD}/libraries/BME.3dshapes/BME280.step
    (at (xyz 0 0 0))
    (scale (xyz 1 1 1))
    (rotate (xyz 0 0 0))
  )
)
