EESchema Schematic File Version 4
EELAYER 30 0
EELAYER END
$Descr A4 11693 8268
encoding utf-8
Sheet 7 9
Title ""
Date ""
Rev ""
Comp ""
Comment1 ""
Comment2 ""
Comment3 ""
Comment4 ""
$EndDescr
$Comp
L MICS-5524:MICS-5524 U5
U 1 1 5AEE292B
P 5650 3700
F 0 "U5" H 5650 4075 50  0000 C CNN
F 1 "MICS-5524" H 5650 3700 50  0001 L BNN
F 2 "MICS-SMD10" H 5650 3700 50  0001 L BNN
F 3 "5.10 USD" H 5650 3700 50  0001 L BNN
F 4 "MICS-5524" H 0   0   50  0001 C CNN "Part Number"
	1    5650 3700
	1    0    0    -1  
$EndComp
$Comp
L Device:R R17
U 1 1 5AEE2939
P 4650 4200
F 0 "R17" H 4720 4246 50  0000 L CNN
F 1 "82" H 4720 4155 50  0000 L CNN
F 2 "Resistor_SMD:R_0603_1608Metric_Pad0.99x1.00mm_HandSolder" V 4580 4200 50  0001 C CNN
F 3 "~" H 4650 4200 50  0001 C CNN
F 4 "CRCW060382R0FKEA" H 0   0   50  0001 C CNN "Part Number"
	1    4650 4200
	1    0    0    -1  
$EndComp
$Comp
L Device:R R18
U 1 1 5AEE2940
P 4950 4200
F 0 "R18" H 5020 4246 50  0000 L CNN
F 1 "1K" H 5020 4155 50  0000 L CNN
F 2 "Resistor_SMD:R_0603_1608Metric_Pad0.99x1.00mm_HandSolder" V 4880 4200 50  0001 C CNN
F 3 "~" H 4950 4200 50  0001 C CNN
F 4 "CRCW06031K00FKEA" H 0   0   50  0001 C CNN "Part Number"
	1    4950 4200
	1    0    0    -1  
$EndComp
Wire Wire Line
	5150 3800 4650 3800
Wire Wire Line
	4650 3800 4650 4050
Wire Wire Line
	5150 3900 4950 3900
Wire Wire Line
	4950 3900 4950 4050
Wire Wire Line
	6250 3250 6250 3700
Wire Wire Line
	6250 3700 6150 3700
Wire Wire Line
	6150 3700 6150 3800
$Comp
L power:GND #PWR013
U 1 1 5AEE2951
P 4650 4400
F 0 "#PWR013" H 4650 4150 50  0001 C CNN
F 1 "GND" H 4655 4227 50  0000 C CNN
F 2 "" H 4650 4400 50  0001 C CNN
F 3 "" H 4650 4400 50  0001 C CNN
	1    4650 4400
	1    0    0    -1  
$EndComp
$Comp
L power:GND #PWR014
U 1 1 5AEE2957
P 4950 4400
F 0 "#PWR014" H 4950 4150 50  0001 C CNN
F 1 "GND" H 4955 4227 50  0000 C CNN
F 2 "" H 4950 4400 50  0001 C CNN
F 3 "" H 4950 4400 50  0001 C CNN
	1    4950 4400
	1    0    0    -1  
$EndComp
Wire Wire Line
	4950 4400 4950 4350
Wire Wire Line
	4650 4400 4650 4350
Wire Wire Line
	4950 3250 4950 3900
Connection ~ 4950 3900
NoConn ~ 6150 3500
NoConn ~ 6150 3600
NoConn ~ 6150 3900
NoConn ~ 5150 3500
NoConn ~ 5150 3600
NoConn ~ 5150 3700
Text HLabel 3550 3650 0    50   Input ~ 0
S_Power
$Comp
L lsf-kicad:Si1401EDH Q3
U 1 1 5AEE76EF
P 4100 3250
F 0 "Q3" V 4725 3250 50  0000 C CNN
F 1 "SSM6J216FE" V 4634 3250 50  0000 C CNN
F 2 "lsf-kicad-lib:SOT-563" H 4300 3350 50  0001 C CNN
F 3 "http://www.vishay.com/docs/70080/si1401ed.pdf" H 4100 3250 50  0001 C CNN
F 4 "SSM6J216FE" H 0   -100 50  0001 C CNN "Part Number"
	1    4100 3250
	0    1    -1   0   
$EndComp
$Comp
L Device:R R21
U 1 1 5AEE76F6
P 3750 3500
F 0 "R21" H 3820 3546 50  0000 L CNN
F 1 "100K" H 3820 3455 50  0000 L CNN
F 2 "Resistor_SMD:R_0603_1608Metric_Pad0.99x1.00mm_HandSolder" V 3680 3500 50  0001 C CNN
F 3 "~" H 3750 3500 50  0001 C CNN
F 4 "CRCW0603100KFKEA" H 0   0   50  0001 C CNN "Part Number"
	1    3750 3500
	-1   0    0    -1  
$EndComp
Wire Wire Line
	3550 3650 3750 3650
Wire Wire Line
	4100 3650 4100 3550
Wire Wire Line
	3750 3650 4100 3650
Wire Wire Line
	3750 3350 3750 3250
Connection ~ 3750 3250
Wire Wire Line
	3750 3250 3900 3250
Connection ~ 4300 3250
Connection ~ 3750 3650
$Comp
L Device:C C17
U 1 1 5AEE770B
P 4300 3550
F 0 "C17" H 4415 3596 50  0000 L CNN
F 1 "47uF" H 4415 3505 50  0000 L CNN
F 2 "Capacitor_SMD:C_1206_3216Metric_Pad1.39x1.80mm_HandSolder" H 4338 3400 50  0001 C CNN
F 3 "~" H 4300 3550 50  0001 C CNN
F 4 "GRM31CE70J476ME15L" H 4300 3550 50  0001 C CNN "Part Number"
	1    4300 3550
	1    0    0    -1  
$EndComp
Wire Wire Line
	4300 3400 4300 3250
$Comp
L power:GND #PWR0108
U 1 1 5AEE7713
P 4300 3750
F 0 "#PWR0108" H 4300 3500 50  0001 C CNN
F 1 "GND" H 4305 3577 50  0000 C CNN
F 2 "" H 4300 3750 50  0001 C CNN
F 3 "" H 4300 3750 50  0001 C CNN
	1    4300 3750
	-1   0    0    -1  
$EndComp
Wire Wire Line
	4300 3750 4300 3700
Text GLabel 3550 3250 0    50   Input ~ 0
5V
Wire Wire Line
	3750 3250 3550 3250
Wire Wire Line
	4300 3250 4950 3250
Connection ~ 4950 3250
Wire Wire Line
	4950 3250 6250 3250
Text HLabel 4650 4050 0    50   Input ~ 0
VSense
Wire Wire Line
	4300 2950 4300 3050
Wire Wire Line
	4300 3250 4300 3150
Connection ~ 4300 3050
Connection ~ 4300 3150
Wire Wire Line
	4300 3150 4300 3050
$EndSCHEMATC
