(kicad_symbol_lib
	(version 20231120)
	(generator "kicad_symbol_editor")
	(generator_version "8.0")
	(symbol "ESQ-126-39-P-D"
		(pin_names
			(offset 0) hide)
		(exclude_from_sim no)
		(in_bom yes)
		(on_board yes)
		(property "Reference" "J"
			(at 0 34.29 0)
			(effects
				(font
					(size 1.27 1.27)
				)
			)
		)
		(property "Value" "ESQ-126-39-P-D"
			(at 0 -35.56 0)
			(effects
				(font
					(size 1.27 1.27)
				)
			)
		)
		(property "Footprint" ""
			(at 0 0 0)
			(effects
				(font
					(size 1.27 1.27)
				)
				(hide yes)
			)
		)
		(property "Datasheet" ""
			(at 0 0 0)
			(effects
				(font
					(size 1.27 1.27)
				)
				(hide yes)
			)
		)
		(property "Description" ""
			(at 0 0 0)
			(effects
				(font
					(size 1.27 1.27)
				)
				(hide yes)
			)
		)
		(symbol "ESQ-126-39-P-D_1_1"
			(rectangle
				(start -2.54 -31.623)
				(end -1.27 -31.877)
				(stroke
					(width 0.1524)
					(type solid)
				)
				(fill
					(type none)
				)
			)
			(rectangle
				(start -2.54 -29.083)
				(end -1.27 -29.337)
				(stroke
					(width 0.1524)
					(type solid)
				)
				(fill
					(type none)
				)
			)
			(rectangle
				(start -2.54 -26.543)
				(end -1.27 -26.797)
				(stroke
					(width 0.1524)
					(type solid)
				)
				(fill
					(type none)
				)
			)
			(rectangle
				(start -2.54 -24.003)
				(end -1.27 -24.257)
				(stroke
					(width 0.1524)
					(type solid)
				)
				(fill
					(type none)
				)
			)
			(rectangle
				(start -2.54 -21.463)
				(end -1.27 -21.717)
				(stroke
					(width 0.1524)
					(type solid)
				)
				(fill
					(type none)
				)
			)
			(rectangle
				(start -2.54 -18.923)
				(end -1.27 -19.177)
				(stroke
					(width 0.1524)
					(type solid)
				)
				(fill
					(type none)
				)
			)
			(rectangle
				(start -2.54 -16.383)
				(end -1.27 -16.637)
				(stroke
					(width 0.1524)
					(type solid)
				)
				(fill
					(type none)
				)
			)
			(rectangle
				(start -2.54 -13.843)
				(end -1.27 -14.097)
				(stroke
					(width 0.1524)
					(type solid)
				)
				(fill
					(type none)
				)
			)
			(rectangle
				(start -2.54 -11.303)
				(end -1.27 -11.557)
				(stroke
					(width 0.1524)
					(type solid)
				)
				(fill
					(type none)
				)
			)
			(rectangle
				(start -2.54 -8.763)
				(end -1.27 -9.017)
				(stroke
					(width 0.1524)
					(type solid)
				)
				(fill
					(type none)
				)
			)
			(rectangle
				(start -2.54 -6.223)
				(end -1.27 -6.477)
				(stroke
					(width 0.1524)
					(type solid)
				)
				(fill
					(type none)
				)
			)
			(rectangle
				(start -2.54 -3.683)
				(end -1.27 -3.937)
				(stroke
					(width 0.1524)
					(type solid)
				)
				(fill
					(type none)
				)
			)
			(rectangle
				(start -2.54 -1.143)
				(end -1.27 -1.397)
				(stroke
					(width 0.1524)
					(type solid)
				)
				(fill
					(type none)
				)
			)
			(rectangle
				(start -2.54 1.397)
				(end -1.27 1.143)
				(stroke
					(width 0.1524)
					(type solid)
				)
				(fill
					(type none)
				)
			)
			(rectangle
				(start -2.54 3.937)
				(end -1.27 3.683)
				(stroke
					(width 0.1524)
					(type solid)
				)
				(fill
					(type none)
				)
			)
			(rectangle
				(start -2.54 6.477)
				(end -1.27 6.223)
				(stroke
					(width 0.1524)
					(type solid)
				)
				(fill
					(type none)
				)
			)
			(rectangle
				(start -2.54 9.017)
				(end -1.27 8.763)
				(stroke
					(width 0.1524)
					(type solid)
				)
				(fill
					(type none)
				)
			)
			(rectangle
				(start -2.54 11.557)
				(end -1.27 11.303)
				(stroke
					(width 0.1524)
					(type solid)
				)
				(fill
					(type none)
				)
			)
			(rectangle
				(start -2.54 14.097)
				(end -1.27 13.843)
				(stroke
					(width 0.1524)
					(type solid)
				)
				(fill
					(type none)
				)
			)
			(rectangle
				(start -2.54 16.637)
				(end -1.27 16.383)
				(stroke
					(width 0.1524)
					(type solid)
				)
				(fill
					(type none)
				)
			)
			(rectangle
				(start -2.54 19.177)
				(end -1.27 18.923)
				(stroke
					(width 0.1524)
					(type solid)
				)
				(fill
					(type none)
				)
			)
			(rectangle
				(start -2.54 21.717)
				(end -1.27 21.463)
				(stroke
					(width 0.1524)
					(type solid)
				)
				(fill
					(type none)
				)
			)
			(rectangle
				(start -2.54 24.257)
				(end -1.27 24.003)
				(stroke
					(width 0.1524)
					(type solid)
				)
				(fill
					(type none)
				)
			)
			(rectangle
				(start -2.54 26.797)
				(end -1.27 26.543)
				(stroke
					(width 0.1524)
					(type solid)
				)
				(fill
					(type none)
				)
			)
			(rectangle
				(start -2.54 29.337)
				(end -1.27 29.083)
				(stroke
					(width 0.1524)
					(type solid)
				)
				(fill
					(type none)
				)
			)
			(rectangle
				(start -2.54 31.877)
				(end -1.27 31.623)
				(stroke
					(width 0.1524)
					(type solid)
				)
				(fill
					(type none)
				)
			)
			(rectangle
				(start -2.54 33.02)
				(end 2.54 -33.02)
				(stroke
					(width 0.254)
					(type solid)
				)
				(fill
					(type background)
				)
			)
			(rectangle
				(start 2.54 -31.623)
				(end 1.27 -31.877)
				(stroke
					(width 0.1524)
					(type solid)
				)
				(fill
					(type none)
				)
			)
			(rectangle
				(start 2.54 -29.083)
				(end 1.27 -29.337)
				(stroke
					(width 0.1524)
					(type solid)
				)
				(fill
					(type none)
				)
			)
			(rectangle
				(start 2.54 -26.543)
				(end 1.27 -26.797)
				(stroke
					(width 0.1524)
					(type solid)
				)
				(fill
					(type none)
				)
			)
			(rectangle
				(start 2.54 -24.003)
				(end 1.27 -24.257)
				(stroke
					(width 0.1524)
					(type solid)
				)
				(fill
					(type none)
				)
			)
			(rectangle
				(start 2.54 -21.463)
				(end 1.27 -21.717)
				(stroke
					(width 0.1524)
					(type solid)
				)
				(fill
					(type none)
				)
			)
			(rectangle
				(start 2.54 -18.923)
				(end 1.27 -19.177)
				(stroke
					(width 0.1524)
					(type solid)
				)
				(fill
					(type none)
				)
			)
			(rectangle
				(start 2.54 -16.383)
				(end 1.27 -16.637)
				(stroke
					(width 0.1524)
					(type solid)
				)
				(fill
					(type none)
				)
			)
			(rectangle
				(start 2.54 -13.843)
				(end 1.27 -14.097)
				(stroke
					(width 0.1524)
					(type solid)
				)
				(fill
					(type none)
				)
			)
			(rectangle
				(start 2.54 -11.303)
				(end 1.27 -11.557)
				(stroke
					(width 0.1524)
					(type solid)
				)
				(fill
					(type none)
				)
			)
			(rectangle
				(start 2.54 -8.763)
				(end 1.27 -9.017)
				(stroke
					(width 0.1524)
					(type solid)
				)
				(fill
					(type none)
				)
			)
			(rectangle
				(start 2.54 -6.223)
				(end 1.27 -6.477)
				(stroke
					(width 0.1524)
					(type solid)
				)
				(fill
					(type none)
				)
			)
			(rectangle
				(start 2.54 -3.683)
				(end 1.27 -3.937)
				(stroke
					(width 0.1524)
					(type solid)
				)
				(fill
					(type none)
				)
			)
			(rectangle
				(start 2.54 -1.143)
				(end 1.27 -1.397)
				(stroke
					(width 0.1524)
					(type solid)
				)
				(fill
					(type none)
				)
			)
			(rectangle
				(start 2.54 1.397)
				(end 1.27 1.143)
				(stroke
					(width 0.1524)
					(type solid)
				)
				(fill
					(type none)
				)
			)
			(rectangle
				(start 2.54 3.937)
				(end 1.27 3.683)
				(stroke
					(width 0.1524)
					(type solid)
				)
				(fill
					(type none)
				)
			)
			(rectangle
				(start 2.54 6.477)
				(end 1.27 6.223)
				(stroke
					(width 0.1524)
					(type solid)
				)
				(fill
					(type none)
				)
			)
			(rectangle
				(start 2.54 9.017)
				(end 1.27 8.763)
				(stroke
					(width 0.1524)
					(type solid)
				)
				(fill
					(type none)
				)
			)
			(rectangle
				(start 2.54 11.557)
				(end 1.27 11.303)
				(stroke
					(width 0.1524)
					(type solid)
				)
				(fill
					(type none)
				)
			)
			(rectangle
				(start 2.54 14.097)
				(end 1.27 13.843)
				(stroke
					(width 0.1524)
					(type solid)
				)
				(fill
					(type none)
				)
			)
			(rectangle
				(start 2.54 16.637)
				(end 1.27 16.383)
				(stroke
					(width 0.1524)
					(type solid)
				)
				(fill
					(type none)
				)
			)
			(rectangle
				(start 2.54 19.177)
				(end 1.27 18.923)
				(stroke
					(width 0.1524)
					(type solid)
				)
				(fill
					(type none)
				)
			)
			(rectangle
				(start 2.54 21.717)
				(end 1.27 21.463)
				(stroke
					(width 0.1524)
					(type solid)
				)
				(fill
					(type none)
				)
			)
			(rectangle
				(start 2.54 24.257)
				(end 1.27 24.003)
				(stroke
					(width 0.1524)
					(type solid)
				)
				(fill
					(type none)
				)
			)
			(rectangle
				(start 2.54 26.797)
				(end 1.27 26.543)
				(stroke
					(width 0.1524)
					(type solid)
				)
				(fill
					(type none)
				)
			)
			(rectangle
				(start 2.54 29.337)
				(end 1.27 29.083)
				(stroke
					(width 0.1524)
					(type solid)
				)
				(fill
					(type none)
				)
			)
			(rectangle
				(start 2.54 31.877)
				(end 1.27 31.623)
				(stroke
					(width 0.1524)
					(type solid)
				)
				(fill
					(type none)
				)
			)
			(pin passive line
				(at -6.35 31.75 0)
				(length 3.81)
				(name "Pin_1"
					(effects
						(font
							(size 1.27 1.27)
						)
					)
				)
				(number "1"
					(effects
						(font
							(size 1.27 1.27)
						)
					)
				)
			)
			(pin passive line
				(at 6.35 21.59 180)
				(length 3.81)
				(name "Pin_10"
					(effects
						(font
							(size 1.27 1.27)
						)
					)
				)
				(number "10"
					(effects
						(font
							(size 1.27 1.27)
						)
					)
				)
			)
			(pin passive line
				(at -6.35 19.05 0)
				(length 3.81)
				(name "Pin_11"
					(effects
						(font
							(size 1.27 1.27)
						)
					)
				)
				(number "11"
					(effects
						(font
							(size 1.27 1.27)
						)
					)
				)
			)
			(pin passive line
				(at 6.35 19.05 180)
				(length 3.81)
				(name "Pin_12"
					(effects
						(font
							(size 1.27 1.27)
						)
					)
				)
				(number "12"
					(effects
						(font
							(size 1.27 1.27)
						)
					)
				)
			)
			(pin passive line
				(at -6.35 16.51 0)
				(length 3.81)
				(name "Pin_13"
					(effects
						(font
							(size 1.27 1.27)
						)
					)
				)
				(number "13"
					(effects
						(font
							(size 1.27 1.27)
						)
					)
				)
			)
			(pin passive line
				(at 6.35 16.51 180)
				(length 3.81)
				(name "Pin_14"
					(effects
						(font
							(size 1.27 1.27)
						)
					)
				)
				(number "14"
					(effects
						(font
							(size 1.27 1.27)
						)
					)
				)
			)
			(pin passive line
				(at -6.35 13.97 0)
				(length 3.81)
				(name "Pin_15"
					(effects
						(font
							(size 1.27 1.27)
						)
					)
				)
				(number "15"
					(effects
						(font
							(size 1.27 1.27)
						)
					)
				)
			)
			(pin passive line
				(at 6.35 13.97 180)
				(length 3.81)
				(name "Pin_16"
					(effects
						(font
							(size 1.27 1.27)
						)
					)
				)
				(number "16"
					(effects
						(font
							(size 1.27 1.27)
						)
					)
				)
			)
			(pin passive line
				(at -6.35 11.43 0)
				(length 3.81)
				(name "Pin_17"
					(effects
						(font
							(size 1.27 1.27)
						)
					)
				)
				(number "17"
					(effects
						(font
							(size 1.27 1.27)
						)
					)
				)
			)
			(pin passive line
				(at 6.35 11.43 180)
				(length 3.81)
				(name "Pin_18"
					(effects
						(font
							(size 1.27 1.27)
						)
					)
				)
				(number "18"
					(effects
						(font
							(size 1.27 1.27)
						)
					)
				)
			)
			(pin passive line
				(at -6.35 8.89 0)
				(length 3.81)
				(name "Pin_19"
					(effects
						(font
							(size 1.27 1.27)
						)
					)
				)
				(number "19"
					(effects
						(font
							(size 1.27 1.27)
						)
					)
				)
			)
			(pin passive line
				(at 6.35 31.75 180)
				(length 3.81)
				(name "Pin_2"
					(effects
						(font
							(size 1.27 1.27)
						)
					)
				)
				(number "2"
					(effects
						(font
							(size 1.27 1.27)
						)
					)
				)
			)
			(pin passive line
				(at 6.35 8.89 180)
				(length 3.81)
				(name "Pin_20"
					(effects
						(font
							(size 1.27 1.27)
						)
					)
				)
				(number "20"
					(effects
						(font
							(size 1.27 1.27)
						)
					)
				)
			)
			(pin passive line
				(at -6.35 6.35 0)
				(length 3.81)
				(name "Pin_21"
					(effects
						(font
							(size 1.27 1.27)
						)
					)
				)
				(number "21"
					(effects
						(font
							(size 1.27 1.27)
						)
					)
				)
			)
			(pin passive line
				(at 6.35 6.35 180)
				(length 3.81)
				(name "Pin_22"
					(effects
						(font
							(size 1.27 1.27)
						)
					)
				)
				(number "22"
					(effects
						(font
							(size 1.27 1.27)
						)
					)
				)
			)
			(pin passive line
				(at -6.35 3.81 0)
				(length 3.81)
				(name "Pin_23"
					(effects
						(font
							(size 1.27 1.27)
						)
					)
				)
				(number "23"
					(effects
						(font
							(size 1.27 1.27)
						)
					)
				)
			)
			(pin passive line
				(at 6.35 3.81 180)
				(length 3.81)
				(name "Pin_24"
					(effects
						(font
							(size 1.27 1.27)
						)
					)
				)
				(number "24"
					(effects
						(font
							(size 1.27 1.27)
						)
					)
				)
			)
			(pin passive line
				(at -6.35 1.27 0)
				(length 3.81)
				(name "Pin_25"
					(effects
						(font
							(size 1.27 1.27)
						)
					)
				)
				(number "25"
					(effects
						(font
							(size 1.27 1.27)
						)
					)
				)
			)
			(pin passive line
				(at 6.35 1.27 180)
				(length 3.81)
				(name "Pin_26"
					(effects
						(font
							(size 1.27 1.27)
						)
					)
				)
				(number "26"
					(effects
						(font
							(size 1.27 1.27)
						)
					)
				)
			)
			(pin passive line
				(at -6.35 -1.27 0)
				(length 3.81)
				(name "Pin_27"
					(effects
						(font
							(size 1.27 1.27)
						)
					)
				)
				(number "27"
					(effects
						(font
							(size 1.27 1.27)
						)
					)
				)
			)
			(pin passive line
				(at 6.35 -1.27 180)
				(length 3.81)
				(name "Pin_28"
					(effects
						(font
							(size 1.27 1.27)
						)
					)
				)
				(number "28"
					(effects
						(font
							(size 1.27 1.27)
						)
					)
				)
			)
			(pin passive line
				(at -6.35 -3.81 0)
				(length 3.81)
				(name "Pin_29"
					(effects
						(font
							(size 1.27 1.27)
						)
					)
				)
				(number "29"
					(effects
						(font
							(size 1.27 1.27)
						)
					)
				)
			)
			(pin passive line
				(at -6.35 29.21 0)
				(length 3.81)
				(name "Pin_3"
					(effects
						(font
							(size 1.27 1.27)
						)
					)
				)
				(number "3"
					(effects
						(font
							(size 1.27 1.27)
						)
					)
				)
			)
			(pin passive line
				(at 6.35 -3.81 180)
				(length 3.81)
				(name "Pin_30"
					(effects
						(font
							(size 1.27 1.27)
						)
					)
				)
				(number "30"
					(effects
						(font
							(size 1.27 1.27)
						)
					)
				)
			)
			(pin passive line
				(at -6.35 -6.35 0)
				(length 3.81)
				(name "Pin_31"
					(effects
						(font
							(size 1.27 1.27)
						)
					)
				)
				(number "31"
					(effects
						(font
							(size 1.27 1.27)
						)
					)
				)
			)
			(pin passive line
				(at 6.35 -6.35 180)
				(length 3.81)
				(name "Pin_32"
					(effects
						(font
							(size 1.27 1.27)
						)
					)
				)
				(number "32"
					(effects
						(font
							(size 1.27 1.27)
						)
					)
				)
			)
			(pin passive line
				(at -6.35 -8.89 0)
				(length 3.81)
				(name "Pin_33"
					(effects
						(font
							(size 1.27 1.27)
						)
					)
				)
				(number "33"
					(effects
						(font
							(size 1.27 1.27)
						)
					)
				)
			)
			(pin passive line
				(at 6.35 -8.89 180)
				(length 3.81)
				(name "Pin_34"
					(effects
						(font
							(size 1.27 1.27)
						)
					)
				)
				(number "34"
					(effects
						(font
							(size 1.27 1.27)
						)
					)
				)
			)
			(pin passive line
				(at -6.35 -11.43 0)
				(length 3.81)
				(name "Pin_35"
					(effects
						(font
							(size 1.27 1.27)
						)
					)
				)
				(number "35"
					(effects
						(font
							(size 1.27 1.27)
						)
					)
				)
			)
			(pin passive line
				(at 6.35 -11.43 180)
				(length 3.81)
				(name "Pin_36"
					(effects
						(font
							(size 1.27 1.27)
						)
					)
				)
				(number "36"
					(effects
						(font
							(size 1.27 1.27)
						)
					)
				)
			)
			(pin passive line
				(at -6.35 -13.97 0)
				(length 3.81)
				(name "Pin_37"
					(effects
						(font
							(size 1.27 1.27)
						)
					)
				)
				(number "37"
					(effects
						(font
							(size 1.27 1.27)
						)
					)
				)
			)
			(pin passive line
				(at 6.35 -13.97 180)
				(length 3.81)
				(name "Pin_38"
					(effects
						(font
							(size 1.27 1.27)
						)
					)
				)
				(number "38"
					(effects
						(font
							(size 1.27 1.27)
						)
					)
				)
			)
			(pin passive line
				(at -6.35 -16.51 0)
				(length 3.81)
				(name "Pin_39"
					(effects
						(font
							(size 1.27 1.27)
						)
					)
				)
				(number "39"
					(effects
						(font
							(size 1.27 1.27)
						)
					)
				)
			)
			(pin passive line
				(at 6.35 29.21 180)
				(length 3.81)
				(name "Pin_4"
					(effects
						(font
							(size 1.27 1.27)
						)
					)
				)
				(number "4"
					(effects
						(font
							(size 1.27 1.27)
						)
					)
				)
			)
			(pin passive line
				(at 6.35 -16.51 180)
				(length 3.81)
				(name "Pin_40"
					(effects
						(font
							(size 1.27 1.27)
						)
					)
				)
				(number "40"
					(effects
						(font
							(size 1.27 1.27)
						)
					)
				)
			)
			(pin passive line
				(at -6.35 -19.05 0)
				(length 3.81)
				(name "Pin_41"
					(effects
						(font
							(size 1.27 1.27)
						)
					)
				)
				(number "41"
					(effects
						(font
							(size 1.27 1.27)
						)
					)
				)
			)
			(pin passive line
				(at 6.35 -19.05 180)
				(length 3.81)
				(name "Pin_42"
					(effects
						(font
							(size 1.27 1.27)
						)
					)
				)
				(number "42"
					(effects
						(font
							(size 1.27 1.27)
						)
					)
				)
			)
			(pin passive line
				(at -6.35 -21.59 0)
				(length 3.81)
				(name "Pin_43"
					(effects
						(font
							(size 1.27 1.27)
						)
					)
				)
				(number "43"
					(effects
						(font
							(size 1.27 1.27)
						)
					)
				)
			)
			(pin passive line
				(at 6.35 -21.59 180)
				(length 3.81)
				(name "Pin_44"
					(effects
						(font
							(size 1.27 1.27)
						)
					)
				)
				(number "44"
					(effects
						(font
							(size 1.27 1.27)
						)
					)
				)
			)
			(pin passive line
				(at -6.35 -24.13 0)
				(length 3.81)
				(name "Pin_45"
					(effects
						(font
							(size 1.27 1.27)
						)
					)
				)
				(number "45"
					(effects
						(font
							(size 1.27 1.27)
						)
					)
				)
			)
			(pin passive line
				(at 6.35 -24.13 180)
				(length 3.81)
				(name "Pin_46"
					(effects
						(font
							(size 1.27 1.27)
						)
					)
				)
				(number "46"
					(effects
						(font
							(size 1.27 1.27)
						)
					)
				)
			)
			(pin passive line
				(at -6.35 -26.67 0)
				(length 3.81)
				(name "Pin_47"
					(effects
						(font
							(size 1.27 1.27)
						)
					)
				)
				(number "47"
					(effects
						(font
							(size 1.27 1.27)
						)
					)
				)
			)
			(pin passive line
				(at 6.35 -26.67 180)
				(length 3.81)
				(name "Pin_48"
					(effects
						(font
							(size 1.27 1.27)
						)
					)
				)
				(number "48"
					(effects
						(font
							(size 1.27 1.27)
						)
					)
				)
			)
			(pin passive line
				(at -6.35 -29.21 0)
				(length 3.81)
				(name "Pin_49"
					(effects
						(font
							(size 1.27 1.27)
						)
					)
				)
				(number "49"
					(effects
						(font
							(size 1.27 1.27)
						)
					)
				)
			)
			(pin passive line
				(at -6.35 26.67 0)
				(length 3.81)
				(name "Pin_5"
					(effects
						(font
							(size 1.27 1.27)
						)
					)
				)
				(number "5"
					(effects
						(font
							(size 1.27 1.27)
						)
					)
				)
			)
			(pin passive line
				(at 6.35 -29.21 180)
				(length 3.81)
				(name "Pin_50"
					(effects
						(font
							(size 1.27 1.27)
						)
					)
				)
				(number "50"
					(effects
						(font
							(size 1.27 1.27)
						)
					)
				)
			)
			(pin passive line
				(at -6.35 -31.75 0)
				(length 3.81)
				(name "Pin_51"
					(effects
						(font
							(size 1.27 1.27)
						)
					)
				)
				(number "51"
					(effects
						(font
							(size 1.27 1.27)
						)
					)
				)
			)
			(pin passive line
				(at 6.35 -31.75 180)
				(length 3.81)
				(name "Pin_52"
					(effects
						(font
							(size 1.27 1.27)
						)
					)
				)
				(number "52"
					(effects
						(font
							(size 1.27 1.27)
						)
					)
				)
			)
			(pin passive line
				(at 6.35 26.67 180)
				(length 3.81)
				(name "Pin_6"
					(effects
						(font
							(size 1.27 1.27)
						)
					)
				)
				(number "6"
					(effects
						(font
							(size 1.27 1.27)
						)
					)
				)
			)
			(pin passive line
				(at -6.35 24.13 0)
				(length 3.81)
				(name "Pin_7"
					(effects
						(font
							(size 1.27 1.27)
						)
					)
				)
				(number "7"
					(effects
						(font
							(size 1.27 1.27)
						)
					)
				)
			)
			(pin passive line
				(at 6.35 24.13 180)
				(length 3.81)
				(name "Pin_8"
					(effects
						(font
							(size 1.27 1.27)
						)
					)
				)
				(number "8"
					(effects
						(font
							(size 1.27 1.27)
						)
					)
				)
			)
			(pin passive line
				(at -6.35 21.59 0)
				(length 3.81)
				(name "Pin_9"
					(effects
						(font
							(size 1.27 1.27)
						)
					)
				)
				(number "9"
					(effects
						(font
							(size 1.27 1.27)
						)
					)
				)
			)
		)
	)
)
