<<<<<<<<<<<<<<< 42: InterProcess Comm Configuration File >>>>>>>>>>>>>>>>
1                                       ! Number of Sockets
**********************************  IPC 0   *****************************
OFF                                     ! IPC Mode (OFF,TX,RX,TXRX,ACS,WRITEFILE,READFILE)
0                                       ! AC.ID for ACS mode
"State00.42"                            ! File name for WRITE or READ
SERVER                                  ! Socket Role (SERVER,CLIENT,GMSEC_CLIENT)
localhost     1881                     ! Server Host Name, Port 
TRUE                                    ! Allow Blocking (i.e. wait on RX)
FALSE                                    ! Echo to stdout
1                                       ! Number of TX prefixes
"SC[0].AC"                                 ! Prefix 0
