ISO-10303-21;
HEADER;
FILE_DESCRIPTION(('FreeCAD Model'),'2;1');
FILE_NAME('Open CASCADE Shape Model','2024-08-28T19:20:49',(''),(''),
  'Open CASCADE STEP processor 7.7','Ondsel','Unknown');
FILE_SCHEMA(('AUTOMOTIVE_DESIGN { 1 0 10303 214 1 1 1 1 }'));
ENDSEC;
DATA;
#1 = APPLICATION_PROTOCOL_DEFINITION('international standard',
  'automotive_design',2000,#2);
#2 = APPLICATION_CONTEXT(
  'core data for automotive mechanical design processes');
#3 = SHAPE_DEFINITION_REPRESENTATION(#4,#10);
#4 = PRODUCT_DEFINITION_SHAPE('','',#5);
#5 = PRODUCT_DEFINITION('design','',#6,#9);
#6 = PRODUCT_DEFINITION_FORMATION('','',#7);
#7 = PRODUCT('M3 titanium rod','M3 titanium rod','',(#8));
#8 = PRODUCT_CONTEXT('',#2,'mechanical');
#9 = PRODUCT_DEFINITION_CONTEXT('part definition',#2,'design');
#10 = ADVANCED_BREP_SHAPE_REPRESENTATION('',(#11,#15),#176);
#11 = AXIS2_PLACEMENT_3D('',#12,#13,#14);
#12 = CARTESIAN_POINT('',(0.,0.,0.));
#13 = DIRECTION('',(0.,0.,1.));
#14 = DIRECTION('',(1.,0.,-0.));
#15 = MANIFOLD_SOLID_BREP('',#16);
#16 = CLOSED_SHELL('',(#17,#50,#68,#101,#119,#152,#164));
#17 = ADVANCED_FACE('',(#18),#45,.F.);
#18 = FACE_BOUND('',#19,.F.);
#19 = EDGE_LOOP('',(#20,#30,#37,#38));
#20 = ORIENTED_EDGE('',*,*,#21,.T.);
#21 = EDGE_CURVE('',#22,#24,#26,.T.);
#22 = VERTEX_POINT('',#23);
#23 = CARTESIAN_POINT('',(-36.665,-42.86249999993,5.2));
#24 = VERTEX_POINT('',#25);
#25 = CARTESIAN_POINT('',(-36.665,-42.86249999993,-1.E-15));
#26 = LINE('',#27,#28);
#27 = CARTESIAN_POINT('',(-36.665,-42.86249999993,0.));
#28 = VECTOR('',#29,1.);
#29 = DIRECTION('',(0.,0.,-1.));
#30 = ORIENTED_EDGE('',*,*,#31,.F.);
#31 = EDGE_CURVE('',#24,#24,#32,.T.);
#32 = CIRCLE('',#33,0.8);
#33 = AXIS2_PLACEMENT_3D('',#34,#35,#36);
#34 = CARTESIAN_POINT('',(-37.465,-42.86249999993,-1.46E-15));
#35 = DIRECTION('',(0.,0.,-1.));
#36 = DIRECTION('',(-1.,0.,0.));
#37 = ORIENTED_EDGE('',*,*,#21,.F.);
#38 = ORIENTED_EDGE('',*,*,#39,.T.);
#39 = EDGE_CURVE('',#22,#22,#40,.T.);
#40 = CIRCLE('',#41,0.8);
#41 = AXIS2_PLACEMENT_3D('',#42,#43,#44);
#42 = CARTESIAN_POINT('',(-37.465,-42.86249999993,5.2));
#43 = DIRECTION('',(0.,0.,-1.));
#44 = DIRECTION('',(-1.,0.,0.));
#45 = CYLINDRICAL_SURFACE('',#46,0.8);
#46 = AXIS2_PLACEMENT_3D('',#47,#48,#49);
#47 = CARTESIAN_POINT('',(-37.465,-42.86249999993,0.));
#48 = DIRECTION('',(0.,0.,-1.));
#49 = DIRECTION('',(-1.,0.,0.));
#50 = ADVANCED_FACE('',(#51),#63,.F.);
#51 = FACE_BOUND('',#52,.F.);
#52 = EDGE_LOOP('',(#53,#61,#62));
#53 = ORIENTED_EDGE('',*,*,#54,.T.);
#54 = EDGE_CURVE('',#55,#22,#57,.T.);
#55 = VERTEX_POINT('',#56);
#56 = CARTESIAN_POINT('',(-37.465,-42.86249999993,5.680688495222));
#57 = LINE('',#58,#59);
#58 = CARTESIAN_POINT('',(-36.665,-42.86249999993,5.2));
#59 = VECTOR('',#60,1.);
#60 = DIRECTION('',(0.857167300702,-1.E-16,-0.51503807491));
#61 = ORIENTED_EDGE('',*,*,#39,.F.);
#62 = ORIENTED_EDGE('',*,*,#54,.F.);
#63 = CONICAL_SURFACE('',#64,0.8,1.029744258677);
#64 = AXIS2_PLACEMENT_3D('',#65,#66,#67);
#65 = CARTESIAN_POINT('',(-37.465,-42.86249999993,5.2));
#66 = DIRECTION('',(0.,0.,-1.));
#67 = DIRECTION('',(-1.,0.,0.));
#68 = ADVANCED_FACE('',(#69),#96,.F.);
#69 = FACE_BOUND('',#70,.F.);
#70 = EDGE_LOOP('',(#71,#81,#88,#89));
#71 = ORIENTED_EDGE('',*,*,#72,.T.);
#72 = EDGE_CURVE('',#73,#75,#77,.T.);
#73 = VERTEX_POINT('',#74);
#74 = CARTESIAN_POINT('',(-38.265,-42.86249999993,315.29999999997));
#75 = VERTEX_POINT('',#76);
#76 = CARTESIAN_POINT('',(-38.265,-42.86249999993,320.49999999997));
#77 = LINE('',#78,#79);
#78 = CARTESIAN_POINT('',(-38.265,-42.86249999993,320.49999999997));
#79 = VECTOR('',#80,1.);
#80 = DIRECTION('',(0.,0.,1.));
#81 = ORIENTED_EDGE('',*,*,#82,.F.);
#82 = EDGE_CURVE('',#75,#75,#83,.T.);
#83 = CIRCLE('',#84,0.8);
#84 = AXIS2_PLACEMENT_3D('',#85,#86,#87);
#85 = CARTESIAN_POINT('',(-37.465,-42.86249999993,320.49999999997));
#86 = DIRECTION('',(0.,0.,1.));
#87 = DIRECTION('',(1.,0.,-0.));
#88 = ORIENTED_EDGE('',*,*,#72,.F.);
#89 = ORIENTED_EDGE('',*,*,#90,.T.);
#90 = EDGE_CURVE('',#73,#73,#91,.T.);
#91 = CIRCLE('',#92,0.8);
#92 = AXIS2_PLACEMENT_3D('',#93,#94,#95);
#93 = CARTESIAN_POINT('',(-37.465,-42.86249999993,315.29999999997));
#94 = DIRECTION('',(0.,0.,1.));
#95 = DIRECTION('',(1.,0.,-0.));
#96 = CYLINDRICAL_SURFACE('',#97,0.8);
#97 = AXIS2_PLACEMENT_3D('',#98,#99,#100);
#98 = CARTESIAN_POINT('',(-37.465,-42.86249999993,320.49999999997));
#99 = DIRECTION('',(0.,0.,1.));
#100 = DIRECTION('',(1.,0.,-0.));
#101 = ADVANCED_FACE('',(#102),#114,.F.);
#102 = FACE_BOUND('',#103,.F.);
#103 = EDGE_LOOP('',(#104,#112,#113));
#104 = ORIENTED_EDGE('',*,*,#105,.T.);
#105 = EDGE_CURVE('',#106,#73,#108,.T.);
#106 = VERTEX_POINT('',#107);
#107 = CARTESIAN_POINT('',(-37.465,-42.86249999993,314.81931150475));
#108 = LINE('',#109,#110);
#109 = CARTESIAN_POINT('',(-38.265,-42.86249999993,315.29999999997));
#110 = VECTOR('',#111,1.);
#111 = DIRECTION('',(-0.857167300702,-1.E-16,0.51503807491));
#112 = ORIENTED_EDGE('',*,*,#90,.F.);
#113 = ORIENTED_EDGE('',*,*,#105,.F.);
#114 = CONICAL_SURFACE('',#115,0.8,1.029744258677);
#115 = AXIS2_PLACEMENT_3D('',#116,#117,#118);
#116 = CARTESIAN_POINT('',(-37.465,-42.86249999993,315.29999999997));
#117 = DIRECTION('',(0.,0.,1.));
#118 = DIRECTION('',(1.,0.,-0.));
#119 = ADVANCED_FACE('',(#120),#147,.T.);
#120 = FACE_BOUND('',#121,.T.);
#121 = EDGE_LOOP('',(#122,#131,#139,#146));
#122 = ORIENTED_EDGE('',*,*,#123,.T.);
#123 = EDGE_CURVE('',#124,#124,#126,.T.);
#124 = VERTEX_POINT('',#125);
#125 = CARTESIAN_POINT('',(-35.965,-42.86249999993,0.));
#126 = CIRCLE('',#127,1.5);
#127 = AXIS2_PLACEMENT_3D('',#128,#129,#130);
#128 = CARTESIAN_POINT('',(-37.465,-42.86249999993,0.));
#129 = DIRECTION('',(0.,0.,1.));
#130 = DIRECTION('',(1.,0.,-0.));
#131 = ORIENTED_EDGE('',*,*,#132,.T.);
#132 = EDGE_CURVE('',#124,#133,#135,.T.);
#133 = VERTEX_POINT('',#134);
#134 = CARTESIAN_POINT('',(-35.965,-42.86249999993,320.49999999997));
#135 = LINE('',#136,#137);
#136 = CARTESIAN_POINT('',(-35.965,-42.86249999993,324.74264068709));
#137 = VECTOR('',#138,1.);
#138 = DIRECTION('',(0.,0.,1.));
#139 = ORIENTED_EDGE('',*,*,#140,.T.);
#140 = EDGE_CURVE('',#133,#133,#141,.T.);
#141 = CIRCLE('',#142,1.5);
#142 = AXIS2_PLACEMENT_3D('',#143,#144,#145);
#143 = CARTESIAN_POINT('',(-37.465,-42.86249999993,320.49999999997));
#144 = DIRECTION('',(0.,0.,-1.));
#145 = DIRECTION('',(-1.,0.,0.));
#146 = ORIENTED_EDGE('',*,*,#132,.F.);
#147 = CYLINDRICAL_SURFACE('',#148,1.5);
#148 = AXIS2_PLACEMENT_3D('',#149,#150,#151);
#149 = CARTESIAN_POINT('',(-37.465,-42.86249999993,324.74264068709));
#150 = DIRECTION('',(0.,0.,-1.));
#151 = DIRECTION('',(-1.,0.,0.));
#152 = ADVANCED_FACE('',(#153,#156),#159,.F.);
#153 = FACE_BOUND('',#154,.T.);
#154 = EDGE_LOOP('',(#155));
#155 = ORIENTED_EDGE('',*,*,#123,.F.);
#156 = FACE_BOUND('',#157,.T.);
#157 = EDGE_LOOP('',(#158));
#158 = ORIENTED_EDGE('',*,*,#31,.F.);
#159 = PLANE('',#160);
#160 = AXIS2_PLACEMENT_3D('',#161,#162,#163);
#161 = CARTESIAN_POINT('',(-37.465,-42.86249999993,0.));
#162 = DIRECTION('',(0.,0.,1.));
#163 = DIRECTION('',(1.,0.,-0.));
#164 = ADVANCED_FACE('',(#165,#168),#171,.F.);
#165 = FACE_BOUND('',#166,.T.);
#166 = EDGE_LOOP('',(#167));
#167 = ORIENTED_EDGE('',*,*,#140,.F.);
#168 = FACE_BOUND('',#169,.T.);
#169 = EDGE_LOOP('',(#170));
#170 = ORIENTED_EDGE('',*,*,#82,.F.);
#171 = PLANE('',#172);
#172 = AXIS2_PLACEMENT_3D('',#173,#174,#175);
#173 = CARTESIAN_POINT('',(-37.465,-42.86249999993,320.49999999997));
#174 = DIRECTION('',(0.,0.,-1.));
#175 = DIRECTION('',(-1.,0.,0.));
#176 = ( GEOMETRIC_REPRESENTATION_CONTEXT(3) 
GLOBAL_UNCERTAINTY_ASSIGNED_CONTEXT((#180)) GLOBAL_UNIT_ASSIGNED_CONTEXT
((#177,#178,#179)) REPRESENTATION_CONTEXT('Context #1',
  '3D Context with UNIT and UNCERTAINTY') );
#177 = ( LENGTH_UNIT() NAMED_UNIT(*) SI_UNIT(.MILLI.,.METRE.) );
#178 = ( NAMED_UNIT(*) PLANE_ANGLE_UNIT() SI_UNIT($,.RADIAN.) );
#179 = ( NAMED_UNIT(*) SI_UNIT($,.STERADIAN.) SOLID_ANGLE_UNIT() );
#180 = UNCERTAINTY_MEASURE_WITH_UNIT(LENGTH_MEASURE(1.E-07),#177,
  'distance_accuracy_value','confusion accuracy');
#181 = PRODUCT_RELATED_PRODUCT_CATEGORY('part',$,(#7));
#182 = MECHANICAL_DESIGN_GEOMETRIC_PRESENTATION_REPRESENTATION('',(#183,
    #194,#202),#176);
#183 = STYLED_ITEM('color',(#184),#15);
#184 = PRESENTATION_STYLE_ASSIGNMENT((#185,#191));
#185 = SURFACE_STYLE_USAGE(.BOTH.,#186);
#186 = SURFACE_SIDE_STYLE('',(#187));
#187 = SURFACE_STYLE_FILL_AREA(#188);
#188 = FILL_AREA_STYLE('',(#189));
#189 = FILL_AREA_STYLE_COLOUR('',#190);
#190 = COLOUR_RGB('',0.686274528749,0.658823550289,0.639215714193);
#191 = CURVE_STYLE('',#192,POSITIVE_LENGTH_MEASURE(0.1),#193);
#192 = DRAUGHTING_PRE_DEFINED_CURVE_FONT('continuous');
#193 = COLOUR_RGB('',9.803921802644E-02,9.803921802644E-02,
  9.803921802644E-02);
#194 = OVER_RIDING_STYLED_ITEM('overriding color',(#195),#17,#183);
#195 = PRESENTATION_STYLE_ASSIGNMENT((#196));
#196 = SURFACE_STYLE_USAGE(.BOTH.,#197);
#197 = SURFACE_SIDE_STYLE('',(#198));
#198 = SURFACE_STYLE_FILL_AREA(#199);
#199 = FILL_AREA_STYLE('',(#200));
#200 = FILL_AREA_STYLE_COLOUR('',#201);
#201 = COLOUR_RGB('',0.792156867455,0.819607860991,0.933333342953);
#202 = OVER_RIDING_STYLED_ITEM('overriding color',(#203),#68,#183);
#203 = PRESENTATION_STYLE_ASSIGNMENT((#204));
#204 = SURFACE_STYLE_USAGE(.BOTH.,#205);
#205 = SURFACE_SIDE_STYLE('',(#206));
#206 = SURFACE_STYLE_FILL_AREA(#207);
#207 = FILL_AREA_STYLE('',(#208));
#208 = FILL_AREA_STYLE_COLOUR('',#201);
ENDSEC;
END-ISO-10303-21;
