5,0,-5,-5
-6,9,-7,3
0,-7,-2,3
-9,10,3,10
6,4,3,2
0,2,9,-8
-7,0,-7,-3
8,3,8,-10
-9,-3,3,10
0,-3,3,-3
2,0,2,9
9,2,-3,3
-10,9,-10,-3
-9,-3,-9,8
-6,7,-4,8
3,8,-9,-3
-2,-7,0,2
2,-3,-8,9
9,-10,-3,-10
-7,-2,2,1
-1,-10,-1,0
-10,-3,-10,-2
8,2,-2,0
4,-8,2,-4
0,-7,-3,-7
8,2,0,-8
-7,-2,3,-1
0,7,3,7
2,8,-1,8
-10,10,0,10
-4,4,0,-6
-7,6,4,-4
2,-2,0,8
2,-3,3,10
-4,4,6,0
10,-10,0,-10
-7,0,3,-3
-3,0,7,3
0,3,-3,-7
7,0,7,-8
3,-3,-7,0
0,-7,7,3
-2,-8,0,-8
3,0,0,0
0,0,0,-10
3,-5,4,0
2,0,-8,8
8,3,10,4
-6,-5,4,-6
8,2,10,-1
