(kicad_sch (version 20211123) (generator eeschema)

  (uuid bd00fc93-80b1-455f-ac5c-c5b7952f66a9)

  (paper "A4")

  (title_block
    (title "Sky Runner")
    (company "White Noise Payload Team")
  )

  (lib_symbols
    (symbol "Connector_Generic:Conn_01x04" (pin_names (offset 1.016) hide) (in_bom yes) (on_board yes)
      (property "Reference" "J" (id 0) (at 0 5.08 0)
        (effects (font (size 1.27 1.27)))
      )
      (property "Value" "Conn_01x04" (id 1) (at 0 -7.62 0)
        (effects (font (size 1.27 1.27)))
      )
      (property "Footprint" "" (id 2) (at 0 0 0)
        (effects (font (size 1.27 1.27)) hide)
      )
      (property "Datasheet" "~" (id 3) (at 0 0 0)
        (effects (font (size 1.27 1.27)) hide)
      )
      (property "ki_keywords" "connector" (id 4) (at 0 0 0)
        (effects (font (size 1.27 1.27)) hide)
      )
      (property "ki_description" "Generic connector, single row, 01x04, script generated (kicad-library-utils/schlib/autogen/connector/)" (id 5) (at 0 0 0)
        (effects (font (size 1.27 1.27)) hide)
      )
      (property "ki_fp_filters" "Connector*:*_1x??_*" (id 6) (at 0 0 0)
        (effects (font (size 1.27 1.27)) hide)
      )
      (symbol "Conn_01x04_1_1"
        (rectangle (start -1.27 -4.953) (end 0 -5.207)
          (stroke (width 0.1524) (type default) (color 0 0 0 0))
          (fill (type none))
        )
        (rectangle (start -1.27 -2.413) (end 0 -2.667)
          (stroke (width 0.1524) (type default) (color 0 0 0 0))
          (fill (type none))
        )
        (rectangle (start -1.27 0.127) (end 0 -0.127)
          (stroke (width 0.1524) (type default) (color 0 0 0 0))
          (fill (type none))
        )
        (rectangle (start -1.27 2.667) (end 0 2.413)
          (stroke (width 0.1524) (type default) (color 0 0 0 0))
          (fill (type none))
        )
        (rectangle (start -1.27 3.81) (end 1.27 -6.35)
          (stroke (width 0.254) (type default) (color 0 0 0 0))
          (fill (type background))
        )
        (pin passive line (at -5.08 2.54 0) (length 3.81)
          (name "Pin_1" (effects (font (size 1.27 1.27))))
          (number "1" (effects (font (size 1.27 1.27))))
        )
        (pin passive line (at -5.08 0 0) (length 3.81)
          (name "Pin_2" (effects (font (size 1.27 1.27))))
          (number "2" (effects (font (size 1.27 1.27))))
        )
        (pin passive line (at -5.08 -2.54 0) (length 3.81)
          (name "Pin_3" (effects (font (size 1.27 1.27))))
          (number "3" (effects (font (size 1.27 1.27))))
        )
        (pin passive line (at -5.08 -5.08 0) (length 3.81)
          (name "Pin_4" (effects (font (size 1.27 1.27))))
          (number "4" (effects (font (size 1.27 1.27))))
        )
      )
    )
    (symbol "power:+3V3" (power) (pin_names (offset 0)) (in_bom yes) (on_board yes)
      (property "Reference" "#PWR" (id 0) (at 0 -3.81 0)
        (effects (font (size 1.27 1.27)) hide)
      )
      (property "Value" "+3V3" (id 1) (at 0 3.556 0)
        (effects (font (size 1.27 1.27)))
      )
      (property "Footprint" "" (id 2) (at 0 0 0)
        (effects (font (size 1.27 1.27)) hide)
      )
      (property "Datasheet" "" (id 3) (at 0 0 0)
        (effects (font (size 1.27 1.27)) hide)
      )
      (property "ki_keywords" "power-flag" (id 4) (at 0 0 0)
        (effects (font (size 1.27 1.27)) hide)
      )
      (property "ki_description" "Power symbol creates a global label with name \"+3V3\"" (id 5) (at 0 0 0)
        (effects (font (size 1.27 1.27)) hide)
      )
      (symbol "+3V3_0_1"
        (polyline
          (pts
            (xy -0.762 1.27)
            (xy 0 2.54)
          )
          (stroke (width 0) (type default) (color 0 0 0 0))
          (fill (type none))
        )
        (polyline
          (pts
            (xy 0 0)
            (xy 0 2.54)
          )
          (stroke (width 0) (type default) (color 0 0 0 0))
          (fill (type none))
        )
        (polyline
          (pts
            (xy 0 2.54)
            (xy 0.762 1.27)
          )
          (stroke (width 0) (type default) (color 0 0 0 0))
          (fill (type none))
        )
      )
      (symbol "+3V3_1_1"
        (pin power_in line (at 0 0 90) (length 0) hide
          (name "+3V3" (effects (font (size 1.27 1.27))))
          (number "1" (effects (font (size 1.27 1.27))))
        )
      )
    )
    (symbol "power:+5V" (power) (pin_names (offset 0)) (in_bom yes) (on_board yes)
      (property "Reference" "#PWR" (id 0) (at 0 -3.81 0)
        (effects (font (size 1.27 1.27)) hide)
      )
      (property "Value" "+5V" (id 1) (at 0 3.556 0)
        (effects (font (size 1.27 1.27)))
      )
      (property "Footprint" "" (id 2) (at 0 0 0)
        (effects (font (size 1.27 1.27)) hide)
      )
      (property "Datasheet" "" (id 3) (at 0 0 0)
        (effects (font (size 1.27 1.27)) hide)
      )
      (property "ki_keywords" "power-flag" (id 4) (at 0 0 0)
        (effects (font (size 1.27 1.27)) hide)
      )
      (property "ki_description" "Power symbol creates a global label with name \"+5V\"" (id 5) (at 0 0 0)
        (effects (font (size 1.27 1.27)) hide)
      )
      (symbol "+5V_0_1"
        (polyline
          (pts
            (xy -0.762 1.27)
            (xy 0 2.54)
          )
          (stroke (width 0) (type default) (color 0 0 0 0))
          (fill (type none))
        )
        (polyline
          (pts
            (xy 0 0)
            (xy 0 2.54)
          )
          (stroke (width 0) (type default) (color 0 0 0 0))
          (fill (type none))
        )
        (polyline
          (pts
            (xy 0 2.54)
            (xy 0.762 1.27)
          )
          (stroke (width 0) (type default) (color 0 0 0 0))
          (fill (type none))
        )
      )
      (symbol "+5V_1_1"
        (pin power_in line (at 0 0 90) (length 0) hide
          (name "+5V" (effects (font (size 1.27 1.27))))
          (number "1" (effects (font (size 1.27 1.27))))
        )
      )
    )
    (symbol "power:GND" (power) (pin_names (offset 0)) (in_bom yes) (on_board yes)
      (property "Reference" "#PWR" (id 0) (at 0 -6.35 0)
        (effects (font (size 1.27 1.27)) hide)
      )
      (property "Value" "GND" (id 1) (at 0 -3.81 0)
        (effects (font (size 1.27 1.27)))
      )
      (property "Footprint" "" (id 2) (at 0 0 0)
        (effects (font (size 1.27 1.27)) hide)
      )
      (property "Datasheet" "" (id 3) (at 0 0 0)
        (effects (font (size 1.27 1.27)) hide)
      )
      (property "ki_keywords" "power-flag" (id 4) (at 0 0 0)
        (effects (font (size 1.27 1.27)) hide)
      )
      (property "ki_description" "Power symbol creates a global label with name \"GND\" , ground" (id 5) (at 0 0 0)
        (effects (font (size 1.27 1.27)) hide)
      )
      (symbol "GND_0_1"
        (polyline
          (pts
            (xy 0 0)
            (xy 0 -1.27)
            (xy 1.27 -1.27)
            (xy 0 -2.54)
            (xy -1.27 -1.27)
            (xy 0 -1.27)
          )
          (stroke (width 0) (type default) (color 0 0 0 0))
          (fill (type none))
        )
      )
      (symbol "GND_1_1"
        (pin power_in line (at 0 0 270) (length 0) hide
          (name "GND" (effects (font (size 1.27 1.27))))
          (number "1" (effects (font (size 1.27 1.27))))
        )
      )
    )
    (symbol "skyrunner_PCB:XB3-24Z8UT-J" (pin_names (offset 0.762)) (in_bom yes) (on_board yes)
      (property "Reference" "IC" (id 0) (at 0 20.32 0)
        (effects (font (size 1.27 1.27)) (justify left))
      )
      (property "Value" "XB3-24Z8UT-J" (id 1) (at -6.35 16.51 0)
        (effects (font (size 1.27 1.27)) (justify left))
      )
      (property "Footprint" "XB324Z8UTJ" (id 2) (at -34.29 -25.4 0)
        (effects (font (size 1.27 1.27)) (justify left) hide)
      )
      (property "Datasheet" "https://www.digi.com/resources/documentation/digidocs/pdfs/90001543.pdf" (id 3) (at -34.29 -27.94 0)
        (effects (font (size 1.27 1.27)) (justify left) hide)
      )
      (property "Description" "Zigbee Modules (802.15.4) XBee3,2.4 Ghz ZB 3.0, U.FL Ant, TH MT" (id 4) (at -34.29 -30.48 0)
        (effects (font (size 1.27 1.27)) (justify left) hide)
      )
      (property "Height" "2.79" (id 5) (at 27.94 6.35 0)
        (effects (font (size 1.27 1.27)) (justify left) hide)
      )
      (property "Manufacturer_Name" "Digi International" (id 6) (at -34.29 -35.56 0)
        (effects (font (size 1.27 1.27)) (justify left) hide)
      )
      (property "Manufacturer_Part_Number" "XB3-24Z8UT-J" (id 7) (at -34.29 -38.1 0)
        (effects (font (size 1.27 1.27)) (justify left) hide)
      )
      (property "Mouser Part Number" "888-XB3-24Z8UT-J" (id 8) (at -34.29 -40.64 0)
        (effects (font (size 1.27 1.27)) (justify left) hide)
      )
      (property "Mouser Price/Stock" "https://www.mouser.com/Search/Refine.aspx?Keyword=888-XB3-24Z8UT-J" (id 9) (at -34.29 -43.18 0)
        (effects (font (size 1.27 1.27)) (justify left) hide)
      )
      (property "Arrow Part Number" "XB3-24Z8UT-J" (id 10) (at -34.29 -45.72 0)
        (effects (font (size 1.27 1.27)) (justify left) hide)
      )
      (property "Arrow Price/Stock" "https://www.arrow.com/en/products/xb3-24z8ut-j/digi-international" (id 11) (at -34.29 -48.26 0)
        (effects (font (size 1.27 1.27)) (justify left) hide)
      )
      (symbol "XB3-24Z8UT-J_0_0"
        (pin passive line (at -31.75 11.43 0) (length 5.08)
          (name "VCC" (effects (font (size 1.27 1.27))))
          (number "1" (effects (font (size 1.27 1.27))))
        )
        (pin passive line (at -31.75 -11.43 0) (length 5.08)
          (name "GND" (effects (font (size 1.27 1.27))))
          (number "10" (effects (font (size 1.27 1.27))))
        )
        (pin passive line (at 31.75 -11.43 180) (length 5.08)
          (name "DIO4/SPI_MOSI" (effects (font (size 1.27 1.27))))
          (number "11" (effects (font (size 1.27 1.27))))
        )
        (pin passive line (at 31.75 -8.89 180) (length 5.08)
          (name "~{CTS}/DIO7" (effects (font (size 1.27 1.27))))
          (number "12" (effects (font (size 1.27 1.27))))
        )
        (pin passive line (at 31.75 -6.35 180) (length 5.08)
          (name "ON/~{SLEEP}/DIO9" (effects (font (size 1.27 1.27))))
          (number "13" (effects (font (size 1.27 1.27))))
        )
        (pin passive line (at 31.75 -3.81 180) (length 5.08)
          (name "[RESERVED]_2" (effects (font (size 1.27 1.27))))
          (number "14" (effects (font (size 1.27 1.27))))
        )
        (pin passive line (at 31.75 -1.27 180) (length 5.08)
          (name "ASSOCIATE/DIO5" (effects (font (size 1.27 1.27))))
          (number "15" (effects (font (size 1.27 1.27))))
        )
        (pin passive line (at 31.75 1.27 180) (length 5.08)
          (name "~{RTS}/DIO6" (effects (font (size 1.27 1.27))))
          (number "16" (effects (font (size 1.27 1.27))))
        )
        (pin passive line (at 31.75 3.81 180) (length 5.08)
          (name "AD3/DIO3/SPI_~{SSEL}" (effects (font (size 1.27 1.27))))
          (number "17" (effects (font (size 1.27 1.27))))
        )
        (pin passive line (at 31.75 6.35 180) (length 5.08)
          (name "AD2/DIO2/SPI_CLK" (effects (font (size 1.27 1.27))))
          (number "18" (effects (font (size 1.27 1.27))))
        )
        (pin passive line (at 31.75 8.89 180) (length 5.08)
          (name "AD1/DIO1/SPI_~{ATTN}" (effects (font (size 1.27 1.27))))
          (number "19" (effects (font (size 1.27 1.27))))
        )
        (pin passive line (at -31.75 8.89 0) (length 5.08)
          (name "DOUT/DIO13" (effects (font (size 1.27 1.27))))
          (number "2" (effects (font (size 1.27 1.27))))
        )
        (pin passive line (at 31.75 11.43 180) (length 5.08)
          (name "AD0_/DIO0" (effects (font (size 1.27 1.27))))
          (number "20" (effects (font (size 1.27 1.27))))
        )
        (pin passive line (at -31.75 6.35 0) (length 5.08)
          (name "DIN/~{CONFIG}/DIO14" (effects (font (size 1.27 1.27))))
          (number "3" (effects (font (size 1.27 1.27))))
        )
        (pin passive line (at -31.75 3.81 0) (length 5.08)
          (name "DIO12/SPI_MISO" (effects (font (size 1.27 1.27))))
          (number "4" (effects (font (size 1.27 1.27))))
        )
        (pin passive line (at -31.75 1.27 0) (length 5.08)
          (name "~{RESET}" (effects (font (size 1.27 1.27))))
          (number "5" (effects (font (size 1.27 1.27))))
        )
        (pin passive line (at -31.75 -1.27 0) (length 5.08)
          (name "RSSI_PWM/DIO10" (effects (font (size 1.27 1.27))))
          (number "6" (effects (font (size 1.27 1.27))))
        )
        (pin passive line (at -31.75 -3.81 0) (length 5.08)
          (name "PWM1/DIO11" (effects (font (size 1.27 1.27))))
          (number "7" (effects (font (size 1.27 1.27))))
        )
        (pin passive line (at -31.75 -6.35 0) (length 5.08)
          (name "[RESERVED]_1" (effects (font (size 1.27 1.27))))
          (number "8" (effects (font (size 1.27 1.27))))
        )
        (pin passive line (at -31.75 -8.89 0) (length 5.08)
          (name "~{DTR}/SLEEP_RQ/DIO8" (effects (font (size 1.27 1.27))))
          (number "9" (effects (font (size 1.27 1.27))))
        )
      )
      (symbol "XB3-24Z8UT-J_0_1"
        (polyline
          (pts
            (xy -26.67 13.97)
            (xy 26.67 13.97)
            (xy 26.67 -13.97)
            (xy -26.67 -13.97)
            (xy -26.67 13.97)
          )
          (stroke (width 0.1524) (type default) (color 0 0 0 0))
          (fill (type none))
        )
      )
    )
    (symbol "skyrunner_PCB:neo-7m-breakout" (in_bom yes) (on_board yes)
      (property "Reference" "U" (id 0) (at 0 -8.89 0)
        (effects (font (size 1.27 1.27)))
      )
      (property "Value" "neo-7m-breakout" (id 1) (at 0 10.16 0)
        (effects (font (size 1.27 1.27)))
      )
      (property "Footprint" "" (id 2) (at 0 0 0)
        (effects (font (size 1.27 1.27)) hide)
      )
      (property "Datasheet" "" (id 3) (at 0 0 0)
        (effects (font (size 1.27 1.27)) hide)
      )
      (symbol "neo-7m-breakout_0_1"
        (rectangle (start -2.54 8.255) (end 3.175 -6.985)
          (stroke (width 0) (type default) (color 0 0 0 0))
          (fill (type none))
        )
      )
      (symbol "neo-7m-breakout_1_1"
        (pin input line (at -5.08 6.35 0) (length 2.54)
          (name "VCC" (effects (font (size 1.27 1.27))))
          (number "1" (effects (font (size 1.27 1.27))))
        )
        (pin input line (at -5.08 2.54 0) (length 2.54)
          (name "RX" (effects (font (size 1.27 1.27))))
          (number "2" (effects (font (size 1.27 1.27))))
        )
        (pin input line (at -5.08 -1.27 0) (length 2.54)
          (name "TX" (effects (font (size 1.27 1.27))))
          (number "3" (effects (font (size 1.27 1.27))))
        )
        (pin input line (at -5.08 -5.08 0) (length 2.54)
          (name "GND" (effects (font (size 1.27 1.27))))
          (number "4" (effects (font (size 1.27 1.27))))
        )
      )
    )
  )


  (no_connect (at 209.55 71.12) (uuid 2bb9da08-d26c-43a1-8081-b07427bf8d43))
  (no_connect (at 209.55 83.82) (uuid 3a4f5125-b7cb-4628-af97-59ba3cc4a3bf))
  (no_connect (at 209.55 81.28) (uuid 3ae19968-355a-42b2-af96-4c66a86ec702))
  (no_connect (at 146.05 81.28) (uuid 52e49c47-181b-45f3-b398-f1df4d6d9818))
  (no_connect (at 209.55 68.58) (uuid 52e49c47-181b-45f3-b398-f1df4d6d9819))
  (no_connect (at 146.05 73.66) (uuid 53262f3b-125b-4314-a5be-a6f6b3de7931))
  (no_connect (at 209.55 86.36) (uuid 87460413-c81c-423c-bec5-e8778d6de295))
  (no_connect (at 209.55 73.66) (uuid 8bf47345-5bf9-4ff2-9cb9-ac08d9516e65))
  (no_connect (at 209.55 66.04) (uuid 8c4e6edf-7571-4514-a6be-f99ae582feca))
  (no_connect (at 146.05 78.74) (uuid 9ae112ab-ac72-4a00-8185-501659bcc254))
  (no_connect (at 146.05 86.36) (uuid a1e89d74-2fbe-4977-af97-d29be68b1f6e))
  (no_connect (at 209.55 78.74) (uuid b562f097-b02b-4734-b6b8-cc38a7ddfa9a))
  (no_connect (at 209.55 76.2) (uuid c10a47e5-6b5a-4ce7-b9c7-6e081f2b9502))
  (no_connect (at 146.05 83.82) (uuid d0ccd85b-a527-4073-9d9a-40ab088f3745))
  (no_connect (at 146.05 76.2) (uuid fb6e02ec-ccae-44a5-84a8-09825b194762))
  (no_connect (at 209.55 88.9) (uuid fe8d0174-18f1-4da2-a6c9-a5a2d82be247))

  (wire (pts (xy 173.99 128.27) (xy 173.99 132.08))
    (stroke (width 0) (type default) (color 0 0 0 0))
    (uuid 0303f78c-21fd-4173-ad75-cdb169f57af3)
  )
  (wire (pts (xy 143.51 71.12) (xy 146.05 71.12))
    (stroke (width 0) (type default) (color 0 0 0 0))
    (uuid 14b745b7-f188-4423-baec-b665d306b698)
  )
  (wire (pts (xy 177.8 128.27) (xy 173.99 128.27))
    (stroke (width 0) (type default) (color 0 0 0 0))
    (uuid 402617a3-107f-467b-8100-6c51f97793e2)
  )
  (wire (pts (xy 143.51 68.58) (xy 146.05 68.58))
    (stroke (width 0) (type default) (color 0 0 0 0))
    (uuid 4ef67b36-30e9-4cc4-b2a4-e93a6613179c)
  )
  (wire (pts (xy 248.92 81.28) (xy 251.46 81.28))
    (stroke (width 0) (type default) (color 0 0 0 0))
    (uuid 51a24ba8-1bf8-40a0-bfa3-f7ac4a4f5f45)
  )
  (wire (pts (xy 248.92 78.74) (xy 251.46 78.74))
    (stroke (width 0) (type default) (color 0 0 0 0))
    (uuid 6228de16-9c9b-406c-844e-b238db28cbe2)
  )
  (wire (pts (xy 146.05 88.9) (xy 143.51 88.9))
    (stroke (width 0) (type default) (color 0 0 0 0))
    (uuid 908f7a66-c62b-414a-879d-cb073971108a)
  )
  (wire (pts (xy 231.14 76.2) (xy 231.14 78.74))
    (stroke (width 0) (type default) (color 0 0 0 0))
    (uuid a16ca0c9-36b7-4c59-b3ae-20dabb0837a7)
  )
  (wire (pts (xy 172.72 124.46) (xy 177.8 124.46))
    (stroke (width 0) (type default) (color 0 0 0 0))
    (uuid a53a93c1-a0c1-4d87-beaf-28bb9f639902)
  )
  (wire (pts (xy 146.05 66.04) (xy 142.24 66.04))
    (stroke (width 0) (type default) (color 0 0 0 0))
    (uuid b1df77e6-60f8-49b1-8b78-73038b3f9e4f)
  )
  (wire (pts (xy 172.72 116.84) (xy 172.72 114.3))
    (stroke (width 0) (type default) (color 0 0 0 0))
    (uuid b8133282-9afa-462e-aa9b-c0eb0997883a)
  )
  (wire (pts (xy 177.8 116.84) (xy 172.72 116.84))
    (stroke (width 0) (type default) (color 0 0 0 0))
    (uuid ba6b7f74-10da-4994-ac47-375cacc3c41c)
  )
  (wire (pts (xy 231.14 73.66) (xy 251.46 73.66))
    (stroke (width 0) (type default) (color 0 0 0 0))
    (uuid c6cb3c94-8161-4771-9f24-196d6ce3b9c7)
  )
  (wire (pts (xy 231.14 72.39) (xy 231.14 73.66))
    (stroke (width 0) (type default) (color 0 0 0 0))
    (uuid cb0779c7-561b-40fe-8101-ceb8b7940dc4)
  )
  (wire (pts (xy 172.72 120.65) (xy 177.8 120.65))
    (stroke (width 0) (type default) (color 0 0 0 0))
    (uuid d2bf1fef-06de-41d4-a197-08b6b4952cbe)
  )
  (wire (pts (xy 142.24 66.04) (xy 142.24 55.88))
    (stroke (width 0) (type default) (color 0 0 0 0))
    (uuid ecc26bbb-5551-4d2d-bb55-6cbb0c2235b4)
  )
  (wire (pts (xy 143.51 88.9) (xy 143.51 92.71))
    (stroke (width 0) (type default) (color 0 0 0 0))
    (uuid f0bebbab-79bb-4bf2-8821-ef817ff26d95)
  )
  (wire (pts (xy 231.14 76.2) (xy 251.46 76.2))
    (stroke (width 0) (type default) (color 0 0 0 0))
    (uuid fd77ca30-c162-4a47-8b3d-0afb1ca16cbc)
  )

  (text "Telemetry" (at 173.99 53.34 0)
    (effects (font (size 1.27 1.27)) (justify left bottom))
    (uuid 8721f631-ed52-4d65-857a-a2b745821bc7)
  )
  (text "Connector for USB-serial converter." (at 238.76 69.85 0)
    (effects (font (size 1.27 1.27)) (justify left bottom))
    (uuid 8bc23266-22da-4bcf-846a-57f983623036)
  )
  (text "GPS" (at 181.61 110.49 0)
    (effects (font (size 1.27 1.27)) (justify left bottom))
    (uuid 8c78df11-04a9-4dd6-9b60-37f46613edd1)
  )

  (label "GPS_RX" (at 172.72 120.65 180)
    (effects (font (size 1.27 1.27)) (justify right bottom))
    (uuid 032ddeb9-743f-44b7-b026-769f7fe360cc)
  )
  (label "GPS_RX" (at 248.92 81.28 180)
    (effects (font (size 1.27 1.27)) (justify right bottom))
    (uuid 23561b3b-9ba6-44b6-bb23-8dbc417d890d)
  )
  (label "GPS_TX" (at 172.72 124.46 180)
    (effects (font (size 1.27 1.27)) (justify right bottom))
    (uuid 9c8353c8-6f64-4142-8460-4030e7ca1b58)
  )
  (label "GPS_TX" (at 248.92 78.74 180)
    (effects (font (size 1.27 1.27)) (justify right bottom))
    (uuid de8f8d52-9c71-45a7-b76f-4ab98e6001c8)
  )

  (hierarchical_label "XBEE_TX" (shape output) (at 143.51 68.58 180)
    (effects (font (size 1.27 1.27)) (justify right))
    (uuid 3251795e-8989-4ac5-aa8d-b55f87b1fa8d)
  )
  (hierarchical_label "XBEE_RX" (shape input) (at 143.51 71.12 180)
    (effects (font (size 1.27 1.27)) (justify right))
    (uuid 6ad9012c-1136-4f1d-adb3-a4abd6700320)
  )

  (symbol (lib_id "power:GND") (at 173.99 132.08 0) (unit 1)
    (in_bom yes) (on_board yes) (fields_autoplaced)
    (uuid 10d66b27-5370-46c6-9ea1-6c5e00e86394)
    (property "Reference" "#PWR0504" (id 0) (at 173.99 138.43 0)
      (effects (font (size 1.27 1.27)) hide)
    )
    (property "Value" "GND" (id 1) (at 173.99 137.16 0))
    (property "Footprint" "" (id 2) (at 173.99 132.08 0)
      (effects (font (size 1.27 1.27)) hide)
    )
    (property "Datasheet" "" (id 3) (at 173.99 132.08 0)
      (effects (font (size 1.27 1.27)) hide)
    )
    (pin "1" (uuid 5646b072-ea11-412f-8793-a7c7ba16736d))
  )

  (symbol (lib_id "skyrunner_PCB:neo-7m-breakout") (at 182.88 123.19 0) (unit 1)
    (in_bom yes) (on_board yes) (fields_autoplaced)
    (uuid 1a2000a7-ffc9-4475-a2f8-3c5812cd56fb)
    (property "Reference" "U502" (id 0) (at 186.69 121.2849 0)
      (effects (font (size 1.27 1.27)) (justify left))
    )
    (property "Value" "neo-7m-breakout" (id 1) (at 186.69 123.8249 0)
      (effects (font (size 1.27 1.27)) (justify left))
    )
    (property "Footprint" "sky_runner:neo-7M" (id 2) (at 182.88 123.19 0)
      (effects (font (size 1.27 1.27)) hide)
    )
    (property "Datasheet" "" (id 3) (at 182.88 123.19 0)
      (effects (font (size 1.27 1.27)) hide)
    )
    (pin "1" (uuid a57f0240-fda2-45bd-9850-5a43d6e7d092))
    (pin "2" (uuid 0c954273-f4e0-4862-83f3-6b8de254dc23))
    (pin "3" (uuid df30cf75-4438-4f1a-bbe9-81b0d7dfef71))
    (pin "4" (uuid c921a7f3-8363-4706-b284-c75223c77af5))
  )

  (symbol (lib_id "Connector_Generic:Conn_01x04") (at 256.54 76.2 0) (unit 1)
    (in_bom yes) (on_board yes) (fields_autoplaced)
    (uuid 502bc130-2dcd-46cc-8502-11dbd339aa99)
    (property "Reference" "J501" (id 0) (at 259.08 76.1999 0)
      (effects (font (size 1.27 1.27)) (justify left))
    )
    (property "Value" "Conn_01x04" (id 1) (at 259.08 78.7399 0)
      (effects (font (size 1.27 1.27)) (justify left))
    )
    (property "Footprint" "Connector_JST:JST_XH_B4B-XH-A_1x04_P2.50mm_Vertical" (id 2) (at 256.54 76.2 0)
      (effects (font (size 1.27 1.27)) hide)
    )
    (property "Datasheet" "~" (id 3) (at 256.54 76.2 0)
      (effects (font (size 1.27 1.27)) hide)
    )
    (pin "1" (uuid 2129acb5-fa3c-41d5-88a2-333967671ead))
    (pin "2" (uuid 0c3e70f2-0341-413f-a047-f98d440a8d53))
    (pin "3" (uuid 8a3128f6-9e71-46d8-b68f-c2dd1a643b66))
    (pin "4" (uuid 6a8916e5-2e4a-479b-8fcf-e7f17a3664b0))
  )

  (symbol (lib_id "skyrunner_PCB:XB3-24Z8UT-J") (at 177.8 77.47 0) (unit 1)
    (in_bom yes) (on_board yes) (fields_autoplaced)
    (uuid 7ec1f63f-878f-4484-bda5-7caa7f746de6)
    (property "Reference" "U501" (id 0) (at 177.8 58.42 0))
    (property "Value" "XB3-24Z8UT-J" (id 1) (at 177.8 60.96 0))
    (property "Footprint" "XB324Z8UTJ" (id 2) (at 143.51 102.87 0)
      (effects (font (size 1.27 1.27)) (justify left) hide)
    )
    (property "Datasheet" "https://www.digi.com/resources/documentation/digidocs/pdfs/90001543.pdf" (id 3) (at 143.51 105.41 0)
      (effects (font (size 1.27 1.27)) (justify left) hide)
    )
    (property "Description" "Zigbee Modules (802.15.4) XBee3,2.4 Ghz ZB 3.0, U.FL Ant, TH MT" (id 4) (at 143.51 107.95 0)
      (effects (font (size 1.27 1.27)) (justify left) hide)
    )
    (property "Height" "2.79" (id 5) (at 205.74 71.12 0)
      (effects (font (size 1.27 1.27)) (justify left) hide)
    )
    (property "Manufacturer_Name" "" (id 6) (at 143.51 113.03 0)
      (effects (font (size 1.27 1.27)) (justify left) hide)
    )
    (property "Manufacturer_Part_Number" "" (id 7) (at 143.51 115.57 0)
      (effects (font (size 1.27 1.27)) (justify left) hide)
    )
    (property "Mouser Part Number" "888-XB3-24Z8UT-J" (id 8) (at 143.51 118.11 0)
      (effects (font (size 1.27 1.27)) (justify left) hide)
    )
    (property "Mouser Price/Stock" "https://www.mouser.com/Search/Refine.aspx?Keyword=888-XB3-24Z8UT-J" (id 9) (at 143.51 120.65 0)
      (effects (font (size 1.27 1.27)) (justify left) hide)
    )
    (property "Arrow Part Number" "XB3-24Z8UT-J" (id 10) (at 143.51 123.19 0)
      (effects (font (size 1.27 1.27)) (justify left) hide)
    )
    (property "Arrow Price/Stock" "https://www.arrow.com/en/products/xb3-24z8ut-j/digi-international" (id 11) (at 143.51 125.73 0)
      (effects (font (size 1.27 1.27)) (justify left) hide)
    )
    (property "Mfr. No." "XB3-24Z8UT-J" (id 12) (at 177.8 77.47 0)
      (effects (font (size 1.27 1.27)) hide)
    )
    (property "Mfr." "Digi International" (id 13) (at 177.8 77.47 0)
      (effects (font (size 1.27 1.27)) hide)
    )
    (pin "1" (uuid 7b45c050-f018-4b52-a5ae-8f63ce586da3))
    (pin "10" (uuid edde944b-6503-4359-bed9-7c078f92b1e1))
    (pin "11" (uuid 883dc82f-c0ad-43f2-8ece-936b34a68d93))
    (pin "12" (uuid 768949b4-bd1b-4e0e-a2c9-f75a8fcfa6f3))
    (pin "13" (uuid 9e9f693b-06dd-47d8-8b2c-fcff2a52f665))
    (pin "14" (uuid 793b4951-3359-483b-8aab-916cd9eeb9dd))
    (pin "15" (uuid 0ecc34c6-2704-45f8-bbbf-cd0f00bbe8fa))
    (pin "16" (uuid f70b450b-63b7-4cb6-897c-1c9362d5e52e))
    (pin "17" (uuid 54f7f550-3938-4624-91af-761575ffad50))
    (pin "18" (uuid 226677ed-1994-4a7a-b64b-2ad328a85caf))
    (pin "19" (uuid de63d817-45dc-43ef-9892-c487bb1fd652))
    (pin "2" (uuid bbabab39-e200-4fd6-87c6-153560d4e5ae))
    (pin "20" (uuid bdc1c385-3c60-4e74-b06d-82ff5dce85bb))
    (pin "3" (uuid da18c398-7f94-421d-9de1-6e0e91ca216e))
    (pin "4" (uuid c71a4346-39c1-4f53-a45d-74ec172d4482))
    (pin "5" (uuid 812548c1-c62a-46bc-8572-27cedb696e0f))
    (pin "6" (uuid ab7feda8-b9a8-486a-a2b7-d1f61ac88005))
    (pin "7" (uuid 9cac1c14-b0c2-481a-b282-05f65b41d2ee))
    (pin "8" (uuid 379e6b13-f99b-4f95-99d8-2abe8d03f492))
    (pin "9" (uuid 4025ffc0-3fb8-4679-b114-b3d722927d22))
  )

  (symbol (lib_id "power:+3V3") (at 142.24 55.88 0) (unit 1)
    (in_bom yes) (on_board yes) (fields_autoplaced)
    (uuid 8a4d1bec-63cd-408d-8181-461c4f341991)
    (property "Reference" "#PWR0501" (id 0) (at 142.24 59.69 0)
      (effects (font (size 1.27 1.27)) hide)
    )
    (property "Value" "+3V3" (id 1) (at 142.24 50.8 0))
    (property "Footprint" "" (id 2) (at 142.24 55.88 0)
      (effects (font (size 1.27 1.27)) hide)
    )
    (property "Datasheet" "" (id 3) (at 142.24 55.88 0)
      (effects (font (size 1.27 1.27)) hide)
    )
    (pin "1" (uuid a2e0e0a1-0dba-47c1-bf56-d1a776ce1ccf))
  )

  (symbol (lib_id "power:+5V") (at 172.72 114.3 0) (unit 1)
    (in_bom yes) (on_board yes) (fields_autoplaced)
    (uuid a3be2d74-65e9-49f8-9105-03bf913b2ab5)
    (property "Reference" "#PWR0503" (id 0) (at 172.72 118.11 0)
      (effects (font (size 1.27 1.27)) hide)
    )
    (property "Value" "+5V" (id 1) (at 172.72 109.22 0))
    (property "Footprint" "" (id 2) (at 172.72 114.3 0)
      (effects (font (size 1.27 1.27)) hide)
    )
    (property "Datasheet" "" (id 3) (at 172.72 114.3 0)
      (effects (font (size 1.27 1.27)) hide)
    )
    (pin "1" (uuid f2d9f8e3-0e6d-487c-93b3-9b376a211b80))
  )

  (symbol (lib_id "power:GND") (at 143.51 92.71 0) (unit 1)
    (in_bom yes) (on_board yes) (fields_autoplaced)
    (uuid cb4cadd2-04e0-4ea2-8e16-8997f62a2557)
    (property "Reference" "#PWR0502" (id 0) (at 143.51 99.06 0)
      (effects (font (size 1.27 1.27)) hide)
    )
    (property "Value" "GND" (id 1) (at 143.51 97.79 0))
    (property "Footprint" "" (id 2) (at 143.51 92.71 0)
      (effects (font (size 1.27 1.27)) hide)
    )
    (property "Datasheet" "" (id 3) (at 143.51 92.71 0)
      (effects (font (size 1.27 1.27)) hide)
    )
    (pin "1" (uuid bc771ac7-3a78-467c-966e-17ac725d0d11))
  )

  (symbol (lib_id "power:GND") (at 231.14 78.74 0) (unit 1)
    (in_bom yes) (on_board yes) (fields_autoplaced)
    (uuid d72826c1-744d-45d3-9fbd-f78a3abb2234)
    (property "Reference" "#PWR0506" (id 0) (at 231.14 85.09 0)
      (effects (font (size 1.27 1.27)) hide)
    )
    (property "Value" "GND" (id 1) (at 231.14 83.82 0))
    (property "Footprint" "" (id 2) (at 231.14 78.74 0)
      (effects (font (size 1.27 1.27)) hide)
    )
    (property "Datasheet" "" (id 3) (at 231.14 78.74 0)
      (effects (font (size 1.27 1.27)) hide)
    )
    (pin "1" (uuid 77f6ead9-5658-4b4f-96c0-89d767241059))
  )

  (symbol (lib_id "power:+5V") (at 231.14 72.39 0) (unit 1)
    (in_bom yes) (on_board yes) (fields_autoplaced)
    (uuid ee879207-9060-42a4-9bce-77788e8e9e5b)
    (property "Reference" "#PWR0505" (id 0) (at 231.14 76.2 0)
      (effects (font (size 1.27 1.27)) hide)
    )
    (property "Value" "+5V" (id 1) (at 231.14 67.31 0))
    (property "Footprint" "" (id 2) (at 231.14 72.39 0)
      (effects (font (size 1.27 1.27)) hide)
    )
    (property "Datasheet" "" (id 3) (at 231.14 72.39 0)
      (effects (font (size 1.27 1.27)) hide)
    )
    (pin "1" (uuid 536f8837-32c1-4ac0-800d-7423a12937f5))
  )
)
