185.00	1.0325	3.0347	0.32952	340.45	374.47	2.0242	0.58719	0.80520	212.91	4.2793	undefined	undefined	vapor
185.21	1.0454	3.0697	0.32576	340.54	374.59	2.0225	0.58773	0.80601	212.98	4.2656	undefined	undefined	vapor
185.42	1.0583	3.1051	0.32206	340.63	374.72	2.0209	0.58826	0.80682	213.06	4.2521	undefined	undefined	vapor
185.62	1.0714	3.1407	0.31840	340.72	374.84	2.0194	0.58880	0.80764	213.13	4.2385	undefined	undefined	vapor
185.83	1.0846	3.1766	0.31480	340.82	374.96	2.0178	0.58934	0.80845	213.21	4.2251	undefined	undefined	vapor
186.04	1.0979	3.2129	0.31125	340.91	375.08	2.0162	0.58988	0.80927	213.28	4.2116	undefined	undefined	vapor
186.25	1.1114	3.2495	0.30774	341.00	375.21	2.0146	0.59042	0.81010	213.35	4.1982	undefined	undefined	vapor
186.45	1.1250	3.2864	0.30429	341.10	375.33	2.0130	0.59097	0.81093	213.42	4.1849	undefined	undefined	vapor
186.66	1.1387	3.3236	0.30088	341.19	375.45	2.0114	0.59151	0.81176	213.50	4.1716	undefined	undefined	vapor
186.87	1.1525	3.3612	0.29752	341.28	375.57	2.0099	0.59206	0.81259	213.57	4.1584	undefined	undefined	vapor
187.08	1.1665	3.3991	0.29420	341.37	375.69	2.0083	0.59260	0.81342	213.64	4.1452	undefined	undefined	vapor
187.28	1.1806	3.4373	0.29093	341.47	375.81	2.0068	0.59315	0.81426	213.71	4.1321	undefined	undefined	vapor
187.49	1.1949	3.4758	0.28770	341.56	375.93	2.0052	0.59370	0.81511	213.78	4.1190	undefined	undefined	vapor
187.70	1.2093	3.5147	0.28452	341.65	376.06	2.0037	0.59425	0.81595	213.85	4.1059	undefined	undefined	vapor
187.91	1.2238	3.5539	0.28138	341.74	376.18	2.0021	0.59480	0.81680	213.92	4.0929	undefined	undefined	vapor
188.11	1.2385	3.5935	0.27828	341.83	376.30	2.0006	0.59536	0.81765	213.99	4.0800	undefined	undefined	vapor
188.32	1.2533	3.6334	0.27523	341.92	376.42	1.9990	0.59591	0.81851	214.06	4.0671	undefined	undefined	vapor
188.53	1.2682	3.6736	0.27221	342.02	376.54	1.9975	0.59647	0.81937	214.13	4.0542	undefined	undefined	vapor
188.74	1.2833	3.7142	0.26924	342.11	376.66	1.9960	0.59702	0.82023	214.20	4.0414	undefined	undefined	vapor
188.94	1.2985	3.7552	0.26630	342.20	376.78	1.9945	0.59758	0.82109	214.27	4.0287	undefined	undefined	vapor
189.15	1.3138	3.7964	0.26341	342.29	376.90	1.9929	0.59814	0.82196	214.34	4.0160	undefined	undefined	vapor
189.36	1.3293	3.8381	0.26055	342.38	377.02	1.9914	0.59870	0.82283	214.41	4.0033	undefined	undefined	vapor
189.57	1.3450	3.8801	0.25773	342.47	377.14	1.9899	0.59926	0.82370	214.47	3.9907	undefined	undefined	vapor
189.77	1.3608	3.9224	0.25495	342.56	377.26	1.9884	0.59982	0.82458	214.54	3.9781	undefined	undefined	vapor
189.98	1.3767	3.9651	0.25220	342.65	377.38	1.9869	0.60039	0.82546	214.61	3.9656	undefined	undefined	vapor
190.19	1.3928	4.0081	0.24949	342.75	377.49	1.9854	0.60095	0.82634	214.68	3.9531	undefined	undefined	vapor
190.40	1.4090	4.0516	0.24682	342.84	377.61	1.9839	0.60152	0.82723	214.74	3.9407	undefined	undefined	vapor
190.60	1.4254	4.0953	0.24418	342.93	377.73	1.9824	0.60208	0.82811	214.81	3.9283	undefined	undefined	vapor
190.81	1.4419	4.1395	0.24158	343.02	377.85	1.9809	0.60265	0.82901	214.87	3.9160	undefined	undefined	vapor
191.02	1.4585	4.1840	0.23901	343.11	377.97	1.9795	0.60322	0.82990	214.94	3.9037	undefined	undefined	vapor
191.23	1.4754	4.2289	0.23647	343.20	378.09	1.9780	0.60379	0.83080	215.01	3.8915	undefined	undefined	vapor
191.43	1.4923	4.2741	0.23397	343.29	378.20	1.9765	0.60436	0.83170	215.07	3.8793	undefined	undefined	vapor
191.64	1.5095	4.3198	0.23149	343.38	378.32	1.9751	0.60493	0.83261	215.14	3.8671	undefined	undefined	vapor
191.85	1.5267	4.3658	0.22906	343.47	378.44	1.9736	0.60550	0.83351	215.20	3.8550	undefined	undefined	vapor
192.06	1.5442	4.4121	0.22665	343.56	378.55	1.9721	0.60608	0.83442	215.26	3.8429	undefined	undefined	vapor
192.26	1.5617	4.4589	0.22427	343.65	378.67	1.9707	0.60665	0.83534	215.33	3.8309	undefined	undefined	vapor
192.47	1.5795	4.5060	0.22192	343.74	378.79	1.9692	0.60723	0.83626	215.39	3.8190	undefined	undefined	vapor
192.68	1.5974	4.5536	0.21961	343.83	378.91	1.9678	0.60781	0.83718	215.45	3.8070	undefined	undefined	vapor
192.89	1.6154	4.6015	0.21732	343.91	379.02	1.9663	0.60838	0.83810	215.52	3.7952	undefined	undefined	vapor
193.09	1.6336	4.6498	0.21506	344.00	379.14	1.9649	0.60896	0.83903	215.58	3.7833	undefined	undefined	vapor
193.30	1.6520	4.6985	0.21284	344.09	379.25	1.9635	0.60954	0.83996	215.64	3.7715	undefined	undefined	vapor
193.51	1.6705	4.7476	0.21063	344.18	379.37	1.9620	0.61012	0.84089	215.70	3.7598	undefined	undefined	vapor
193.72	1.6892	4.7970	0.20846	344.27	379.48	1.9606	0.61071	0.84182	215.77	3.7481	undefined	undefined	vapor
193.92	1.7081	4.8469	0.20632	344.36	379.60	1.9592	0.61129	0.84276	215.83	3.7365	undefined	undefined	vapor
194.13	1.7271	4.8972	0.20420	344.45	379.72	1.9578	0.61187	0.84371	215.89	3.7248	undefined	undefined	vapor
194.34	1.7463	4.9479	0.20211	344.54	379.83	1.9564	0.61246	0.84465	215.95	3.7133	undefined	undefined	vapor
194.55	1.7657	4.9989	0.20004	344.62	379.95	1.9549	0.61305	0.84560	216.01	3.7018	undefined	undefined	vapor
194.75	1.7852	5.0504	0.19800	344.71	380.06	1.9535	0.61363	0.84655	216.07	3.6903	undefined	undefined	vapor
194.96	1.8049	5.1023	0.19599	344.80	380.17	1.9521	0.61422	0.84751	216.13	3.6789	undefined	undefined	vapor
195.17	1.8247	5.1546	0.19400	344.89	380.29	1.9507	0.61481	0.84847	216.19	3.6675	undefined	undefined	vapor
195.38	1.8447	5.2073	0.19204	344.98	380.40	1.9493	0.61540	0.84943	216.25	3.6561	undefined	undefined	vapor
195.58	1.8649	5.2605	0.19010	345.06	380.52	1.9479	0.61599	0.85039	216.31	3.6448	undefined	undefined	vapor
195.79	1.8853	5.3140	0.18818	345.15	380.63	1.9466	0.61658	0.85136	216.36	3.6336	undefined	undefined	vapor
196.00	1.9058	5.3680	0.18629	345.24	380.74	1.9452	0.61718	0.85233	216.42	3.6224	undefined	undefined	vapor
196.21	1.9265	5.4224	0.18442	345.33	380.86	1.9438	0.61777	0.85330	216.48	3.6112	undefined	undefined	vapor
196.41	1.9474	5.4772	0.18258	345.41	380.97	1.9424	0.61837	0.85428	216.54	3.6001	undefined	undefined	vapor
196.62	1.9685	5.5324	0.18075	345.50	381.08	1.9410	0.61896	0.85526	216.59	3.5890	undefined	undefined	vapor
196.83	1.9897	5.5881	0.17895	345.59	381.19	1.9397	0.61956	0.85625	216.65	3.5780	undefined	undefined	vapor
197.04	2.0111	5.6442	0.17717	345.67	381.31	1.9383	0.62016	0.85723	216.71	3.5670	undefined	undefined	vapor
197.24	2.0327	5.7007	0.17542	345.76	381.42	1.9369	0.62075	0.85822	216.76	3.5560	undefined	undefined	vapor
197.45	2.0545	5.7577	0.17368	345.85	381.53	1.9356	0.62135	0.85922	216.82	3.5451	undefined	undefined	vapor
197.66	2.0764	5.8151	0.17197	345.93	381.64	1.9342	0.62195	0.86021	216.88	3.5342	undefined	undefined	vapor
197.87	2.0986	5.8729	0.17027	346.02	381.75	1.9329	0.62255	0.86121	216.93	3.5234	undefined	undefined	vapor
198.07	2.1209	5.9312	0.16860	346.11	381.86	1.9315	0.62316	0.86222	216.99	3.5126	undefined	undefined	vapor
198.28	2.1434	5.9900	0.16695	346.19	381.98	1.9302	0.62376	0.86322	217.04	3.5019	undefined	undefined	vapor
198.49	2.1660	6.0491	0.16531	346.28	382.09	1.9289	0.62436	0.86423	217.09	3.4912	undefined	undefined	vapor
198.70	2.1889	6.1088	0.16370	346.36	382.20	1.9275	0.62497	0.86525	217.15	3.4805	undefined	undefined	vapor
198.90	2.2120	6.1688	0.16211	346.45	382.31	1.9262	0.62557	0.86626	217.20	3.4699	undefined	undefined	vapor
199.11	2.2352	6.2294	0.16053	346.54	382.42	1.9248	0.62618	0.86728	217.25	3.4594	undefined	undefined	vapor
199.32	2.2586	6.2904	0.15897	346.62	382.53	1.9235	0.62679	0.86830	217.31	3.4488	undefined	undefined	vapor
199.53	2.2822	6.3518	0.15744	346.71	382.64	1.9222	0.62739	0.86933	217.36	3.4384	undefined	undefined	vapor
199.73	2.3060	6.4137	0.15592	346.79	382.75	1.9209	0.62800	0.87036	217.41	3.4279	undefined	undefined	vapor
199.94	2.3300	6.4761	0.15441	346.88	382.86	1.9196	0.62861	0.87139	217.46	3.4175	undefined	undefined	vapor
200.15	2.3542	6.5389	0.15293	346.96	382.96	1.9182	0.62922	0.87243	217.51	3.4071	undefined	undefined	vapor
200.36	2.3786	6.6022	0.15146	347.05	383.07	1.9169	0.62983	0.87347	217.57	3.3968	undefined	undefined	vapor
200.57	2.4032	6.6660	0.15002	347.13	383.18	1.9156	0.63045	0.87451	217.62	3.3865	undefined	undefined	vapor
200.77	2.4280	6.7302	0.14858	347.21	383.29	1.9143	0.63106	0.87556	217.67	3.3763	undefined	undefined	vapor
200.98	2.4529	6.7950	0.14717	347.30	383.40	1.9130	0.63167	0.87661	217.72	3.3661	undefined	undefined	vapor
201.19	2.4781	6.8602	0.14577	347.38	383.51	1.9117	0.63229	0.87766	217.77	3.3559	undefined	undefined	vapor
201.40	2.5035	6.9259	0.14439	347.47	383.61	1.9104	0.63290	0.87871	217.82	3.3458	undefined	undefined	vapor
201.60	2.5290	6.9920	0.14302	347.55	383.72	1.9091	0.63352	0.87977	217.87	3.3358	undefined	undefined	vapor
201.81	2.5548	7.0587	0.14167	347.63	383.83	1.9079	0.63414	0.88084	217.91	3.3257	undefined	undefined	vapor
202.02	2.5807	7.1258	0.14033	347.72	383.93	1.9066	0.63475	0.88190	217.96	3.3157	undefined	undefined	vapor
202.23	2.6069	7.1934	0.13902	347.80	384.04	1.9053	0.63537	0.88297	218.01	3.3058	undefined	undefined	vapor
202.43	2.6333	7.2616	0.13771	347.88	384.15	1.9040	0.63599	0.88404	218.06	3.2958	undefined	undefined	vapor
202.64	2.6599	7.3302	0.13642	347.97	384.25	1.9027	0.63661	0.88512	218.11	3.2860	undefined	undefined	vapor
202.85	2.6866	7.3993	0.13515	348.05	384.36	1.9015	0.63723	0.88620	218.15	3.2761	undefined	undefined	vapor
203.06	2.7136	7.4689	0.13389	348.13	384.47	1.9002	0.63785	0.88728	218.20	3.2663	undefined	undefined	vapor
203.26	2.7408	7.5390	0.13264	348.22	384.57	1.8989	0.63847	0.88837	218.25	3.2566	undefined	undefined	vapor
203.47	2.7682	7.6096	0.13141	348.30	384.68	1.8977	0.63910	0.88946	218.29	3.2469	undefined	undefined	vapor
203.68	2.7958	7.6808	0.13020	348.38	384.78	1.8964	0.63972	0.89055	218.34	3.2372	undefined	undefined	vapor
203.89	2.8237	7.7524	0.12899	348.46	384.89	1.8952	0.64034	0.89165	218.38	3.2275	undefined	undefined	vapor
204.09	2.8517	7.8246	0.12780	348.55	384.99	1.8939	0.64097	0.89275	218.43	3.2179	undefined	undefined	vapor
204.30	2.8800	7.8972	0.12663	348.63	385.10	1.8927	0.64160	0.89385	218.47	3.2084	undefined	undefined	vapor
204.51	2.9084	7.9704	0.12546	348.71	385.20	1.8914	0.64222	0.89496	218.52	3.1989	undefined	undefined	vapor
204.72	2.9371	8.0441	0.12431	348.79	385.30	1.8902	0.64285	0.89607	218.56	3.1894	undefined	undefined	vapor
204.92	2.9660	8.1184	0.12318	348.87	385.41	1.8889	0.64348	0.89718	218.61	3.1799	undefined	undefined	vapor
205.13	2.9951	8.1931	0.12205	348.95	385.51	1.8877	0.64410	0.89830	218.65	3.1705	undefined	undefined	vapor
205.34	3.0244	8.2684	0.12094	349.04	385.61	1.8865	0.64473	0.89942	218.69	3.1612	undefined	undefined	vapor
205.55	3.0540	8.3442	0.11984	349.12	385.72	1.8852	0.64536	0.90055	218.73	3.1518	undefined	undefined	vapor
205.75	3.0837	8.4206	0.11876	349.20	385.82	1.8840	0.64599	0.90167	218.78	3.1425	undefined	undefined	vapor
205.96	3.1137	8.4974	0.11768	349.28	385.92	1.8828	0.64662	0.90280	218.82	3.1333	undefined	undefined	vapor
206.17	3.1440	8.5749	0.11662	349.36	386.02	1.8816	0.64726	0.90394	218.86	3.1241	undefined	undefined	vapor
206.38	3.1744	8.6528	0.11557	349.44	386.12	1.8803	0.64789	0.90508	218.90	3.1149	undefined	undefined	vapor
206.58	3.2051	8.7313	0.11453	349.52	386.23	1.8791	0.64852	0.90622	218.94	3.1058	undefined	undefined	vapor
206.79	3.2359	8.8104	0.11350	349.60	386.33	1.8779	0.64915	0.90737	218.98	3.0967	undefined	undefined	vapor
207.00	3.2671	8.8900	0.11249	349.68	386.43	1.8767	0.64979	0.90851	219.02	3.0876	undefined	undefined	vapor
207.21	3.2984	8.9702	0.11148	349.76	386.53	1.8755	0.65042	0.90967	219.06	3.0786	undefined	undefined	vapor
207.41	3.3300	9.0509	0.11049	349.84	386.63	1.8743	0.65106	0.91082	219.10	3.0696	undefined	undefined	vapor
207.62	3.3618	9.1322	0.10950	349.92	386.73	1.8731	0.65170	0.91198	219.14	3.0606	undefined	undefined	vapor
207.83	3.3938	9.2140	0.10853	350.00	386.83	1.8719	0.65233	0.91315	219.18	3.0517	undefined	undefined	vapor
208.04	3.4261	9.2964	0.10757	350.08	386.93	1.8707	0.65297	0.91431	219.22	3.0428	undefined	undefined	vapor
208.24	3.4586	9.3793	0.10662	350.16	387.03	1.8695	0.65361	0.91548	219.26	3.0340	undefined	undefined	vapor
208.45	3.4913	9.4629	0.10568	350.23	387.13	1.8683	0.65425	0.91666	219.29	3.0252	undefined	undefined	vapor
208.66	3.5243	9.5470	0.10475	350.31	387.23	1.8671	0.65489	0.91784	219.33	3.0164	undefined	undefined	vapor
208.87	3.5575	9.6316	0.10382	350.39	387.33	1.8659	0.65552	0.91902	219.37	3.0077	undefined	undefined	vapor
209.07	3.5909	9.7169	0.10291	350.47	387.43	1.8647	0.65617	0.92020	219.41	2.9990	undefined	undefined	vapor
209.28	3.6246	9.8027	0.10201	350.55	387.52	1.8636	0.65681	0.92139	219.44	2.9903	undefined	undefined	vapor
209.49	3.6585	9.8891	0.10112	350.63	387.62	1.8624	0.65745	0.92259	219.48	2.9817	undefined	undefined	vapor
209.70	3.6927	9.9761	0.10024	350.70	387.72	1.8612	0.65809	0.92378	219.51	2.9731	undefined	undefined	vapor
209.90	3.7271	10.064	0.099367	350.78	387.82	1.8600	0.65873	0.92498	219.55	2.9645	undefined	undefined	vapor
210.11	3.7617	10.152	0.098504	350.86	387.91	1.8589	0.65937	0.92619	219.58	2.9560	undefined	undefined	vapor
210.32	3.7966	10.241	0.097650	350.94	388.01	1.8577	0.66002	0.92739	219.62	2.9475	undefined	undefined	vapor
210.53	3.8318	10.330	0.096805	351.01	388.11	1.8565	0.66066	0.92861	219.65	2.9391	undefined	undefined	vapor
210.73	3.8671	10.420	0.095969	351.09	388.20	1.8554	0.66131	0.92982	219.69	2.9307	undefined	undefined	vapor
210.94	3.9028	10.511	0.095142	351.17	388.30	1.8542	0.66195	0.93104	219.72	2.9223	undefined	undefined	vapor
211.15	3.9387	10.602	0.094324	351.24	388.40	1.8531	0.66260	0.93226	219.75	2.9139	undefined	undefined	vapor
211.36	3.9748	10.694	0.093514	351.32	388.49	1.8519	0.66325	0.93349	219.79	2.9056	undefined	undefined	vapor
211.56	4.0112	10.786	0.092713	351.40	388.59	1.8508	0.66389	0.93472	219.82	2.8973	undefined	undefined	vapor
211.77	4.0478	10.879	0.091921	351.47	388.68	1.8496	0.66454	0.93596	219.85	2.8891	undefined	undefined	vapor
211.98	4.0847	10.973	0.091136	351.55	388.78	1.8485	0.66519	0.93719	219.88	2.8809	undefined	undefined	vapor
212.19	4.1218	11.067	0.090360	351.63	388.87	1.8473	0.66584	0.93844	219.91	2.8727	undefined	undefined	vapor
212.39	4.1592	11.162	0.089592	351.70	388.96	1.8462	0.66648	0.93968	219.94	2.8646	undefined	undefined	vapor
212.60	4.1969	11.257	0.088832	351.78	389.06	1.8450	0.66713	0.94093	219.97	2.8565	undefined	undefined	vapor
212.81	4.2348	11.353	0.088080	351.85	389.15	1.8439	0.66778	0.94219	220.00	2.8484	undefined	undefined	vapor
213.02	4.2729	11.450	0.087336	351.93	389.25	1.8428	0.66843	0.94345	220.03	2.8404	undefined	undefined	vapor
213.22	4.3114	11.547	0.086599	352.00	389.34	1.8416	0.66909	0.94471	220.06	2.8324	undefined	undefined	vapor
213.43	4.3501	11.645	0.085870	352.08	389.43	1.8405	0.66974	0.94597	220.09	2.8244	undefined	undefined	vapor
213.64	4.3890	11.744	0.085149	352.15	389.52	1.8394	0.67039	0.94724	220.12	2.8165	undefined	undefined	vapor
213.85	4.4282	11.843	0.084435	352.23	389.62	1.8383	0.67104	0.94852	220.15	2.8086	undefined	undefined	vapor
214.05	4.4677	11.943	0.083728	352.30	389.71	1.8371	0.67169	0.94980	220.18	2.8007	undefined	undefined	vapor
214.26	4.5075	12.044	0.083029	352.37	389.80	1.8360	0.67235	0.95108	220.21	2.7929	undefined	undefined	vapor
214.47	4.5475	12.145	0.082336	352.45	389.89	1.8349	0.67300	0.95237	220.23	2.7851	undefined	undefined	vapor
214.68	4.5878	12.247	0.081651	352.52	389.98	1.8338	0.67366	0.95366	220.26	2.7773	undefined	undefined	vapor
214.88	4.6283	12.350	0.080973	352.60	390.07	1.8327	0.67431	0.95495	220.29	2.7696	undefined	undefined	vapor
215.09	4.6691	12.453	0.080302	352.67	390.16	1.8316	0.67497	0.95625	220.31	2.7619	undefined	undefined	vapor
215.30	4.7102	12.557	0.079637	352.74	390.25	1.8305	0.67562	0.95755	220.34	2.7542	undefined	undefined	vapor
215.51	4.7516	12.662	0.078979	352.82	390.34	1.8293	0.67628	0.95886	220.36	2.7465	undefined	undefined	vapor
215.71	4.7932	12.767	0.078328	352.89	390.43	1.8282	0.67694	0.96017	220.39	2.7389	undefined	undefined	vapor
215.92	4.8351	12.873	0.077684	352.96	390.52	1.8271	0.67759	0.96149	220.41	2.7314	undefined	undefined	vapor
216.13	4.8773	12.979	0.077046	353.03	390.61	1.8260	0.67825	0.96281	220.44	2.7238	undefined	undefined	vapor
216.34	4.9198	13.087	0.076414	353.11	390.70	1.8249	0.67891	0.96413	220.46	2.7163	undefined	undefined	vapor
216.55	4.9625	13.195	0.075789	353.18	390.79	1.8238	0.67957	0.96546	220.49	2.7088	undefined	undefined	vapor
216.75	5.0055	13.303	0.075170	353.25	390.88	1.8228	0.68022	0.96679	220.51	2.7014	undefined	undefined	vapor
216.96	5.0488	13.413	0.074557	353.32	390.96	1.8217	0.68088	0.96813	220.53	2.6940	undefined	undefined	vapor
217.17	5.0924	13.523	0.073950	353.39	391.05	1.8206	0.68154	0.96947	220.55	2.6866	undefined	undefined	vapor
217.38	5.1363	13.633	0.073350	353.46	391.14	1.8195	0.68220	0.97082	220.58	2.6792	undefined	undefined	vapor
217.58	5.1804	13.745	0.072755	353.53	391.22	1.8184	0.68286	0.97217	220.60	2.6719	undefined	undefined	vapor
217.79	5.2249	13.857	0.072166	353.61	391.31	1.8173	0.68353	0.97352	220.62	2.6646	undefined	undefined	vapor
218.00	5.2696	13.970	0.071583	353.68	391.40	1.8162	0.68419	0.97488	220.64	2.6573	undefined	undefined	vapor
218.21	5.3146	14.083	0.071006	353.75	391.48	1.8152	0.68485	0.97624	220.66	2.6501	undefined	undefined	vapor
218.41	5.3599	14.198	0.070435	353.82	391.57	1.8141	0.68551	0.97761	220.68	2.6429	undefined	undefined	vapor
218.62	5.4055	14.313	0.069869	353.89	391.65	1.8130	0.68617	0.97898	220.70	2.6357	undefined	undefined	vapor
218.83	5.4514	14.428	0.069308	353.96	391.74	1.8120	0.68684	0.98036	220.72	2.6286	undefined	undefined	vapor
219.04	5.4975	14.545	0.068754	354.03	391.82	1.8109	0.68750	0.98174	220.74	2.6215	undefined	undefined	vapor
219.24	5.5440	14.662	0.068204	354.10	391.91	1.8098	0.68816	0.98313	220.76	2.6144	undefined	undefined	vapor
219.45	5.5908	14.780	0.067660	354.17	391.99	1.8088	0.68883	0.98452	220.78	2.6074	undefined	undefined	vapor
219.66	5.6378	14.898	0.067121	354.23	392.08	1.8077	0.68949	0.98591	220.80	2.6003	undefined	undefined	vapor
219.87	5.6852	15.018	0.066588	354.30	392.16	1.8066	0.69016	0.98731	220.81	2.5933	undefined	undefined	vapor
220.07	5.7328	15.138	0.066060	354.37	392.24	1.8056	0.69082	0.98872	220.83	2.5864	undefined	undefined	vapor
220.28	5.7808	15.259	0.065536	354.44	392.33	1.8045	0.69149	0.99013	220.85	2.5795	undefined	undefined	vapor
220.49	5.8290	15.380	0.065018	354.51	392.41	1.8035	0.69216	0.99154	220.86	2.5726	undefined	undefined	vapor
220.70	5.8776	15.503	0.064505	354.58	392.49	1.8024	0.69282	0.99296	220.88	2.5657	undefined	undefined	vapor
220.90	5.9264	15.626	0.063997	354.65	392.57	1.8014	0.69349	0.99438	220.90	2.5588	undefined	undefined	vapor
221.11	5.9756	15.750	0.063494	354.71	392.65	1.8003	0.69416	0.99581	220.91	2.5520	undefined	undefined	vapor
221.32	6.0250	15.874	0.062995	354.78	392.74	1.7993	0.69482	0.99725	220.93	2.5452	undefined	undefined	vapor
221.53	6.0748	16.000	0.062501	354.85	392.82	1.7982	0.69549	0.99869	220.94	2.5385	undefined	undefined	vapor
221.73	6.1249	16.126	0.062013	354.91	392.90	1.7972	0.69616	1.0001	220.95	2.5318	undefined	undefined	vapor
221.94	6.1752	16.253	0.061528	354.98	392.98	1.7961	0.69683	1.0016	220.97	2.5251	undefined	undefined	vapor
222.15	6.2259	16.380	0.061049	355.05	393.06	1.7951	0.69750	1.0030	220.98	2.5184	undefined	undefined	vapor
222.36	6.2769	16.509	0.060573	355.11	393.14	1.7941	0.69817	1.0045	220.99	2.5117	undefined	undefined	vapor
222.56	6.3282	16.638	0.060103	355.18	393.22	1.7930	0.69884	1.0060	221.01	2.5051	undefined	undefined	vapor
222.77	6.3799	16.768	0.059637	355.25	393.29	1.7920	0.69951	1.0074	221.02	2.4985	undefined	undefined	vapor
222.98	6.4318	16.899	0.059175	355.31	393.37	1.7910	0.70018	1.0089	221.03	2.4920	undefined	undefined	vapor
223.19	6.4841	17.031	0.058717	355.38	393.45	1.7899	0.70085	1.0104	221.04	2.4855	undefined	undefined	vapor
223.39	6.5366	17.163	0.058264	355.44	393.53	1.7889	0.70152	1.0119	221.05	2.4790	undefined	undefined	vapor
223.60	6.5895	17.296	0.057815	355.51	393.61	1.7879	0.70219	1.0133	221.06	2.4725	undefined	undefined	vapor
223.81	6.6427	17.430	0.057371	355.57	393.68	1.7868	0.70286	1.0148	221.07	2.4660	undefined	undefined	vapor
224.02	6.6963	17.565	0.056930	355.64	393.76	1.7858	0.70354	1.0163	221.08	2.4596	undefined	undefined	vapor
224.22	6.7501	17.701	0.056494	355.70	393.84	1.7848	0.70421	1.0178	221.09	2.4532	undefined	undefined	vapor
224.43	6.8043	17.838	0.056062	355.77	393.91	1.7838	0.70488	1.0194	221.10	2.4469	undefined	undefined	vapor
224.64	6.8588	17.975	0.055633	355.83	393.99	1.7828	0.70556	1.0209	221.11	2.4405	undefined	undefined	vapor
224.85	6.9136	18.113	0.055209	355.90	394.06	1.7817	0.70623	1.0224	221.12	2.4342	undefined	undefined	vapor
225.05	6.9688	18.252	0.054789	355.96	394.14	1.7807	0.70690	1.0239	221.13	2.4279	undefined	undefined	vapor
225.26	7.0243	18.392	0.054372	356.02	394.21	1.7797	0.70758	1.0254	221.14	2.4217	undefined	undefined	vapor
225.47	7.0801	18.532	0.053960	356.09	394.29	1.7787	0.70825	1.0270	221.14	2.4154	undefined	undefined	vapor
225.68	7.1362	18.674	0.053551	356.15	394.36	1.7777	0.70893	1.0285	221.15	2.4092	undefined	undefined	vapor
225.88	7.1927	18.816	0.053146	356.21	394.44	1.7767	0.70960	1.0301	221.16	2.4030	undefined	undefined	vapor
226.09	7.2495	18.959	0.052744	356.27	394.51	1.7757	0.71028	1.0316	221.16	2.3969	undefined	undefined	vapor
226.30	7.3066	19.103	0.052347	356.34	394.58	1.7747	0.71096	1.0332	221.17	2.3908	undefined	undefined	vapor
226.51	7.3641	19.248	0.051953	356.40	394.66	1.7737	0.71163	1.0348	221.17	2.3847	undefined	undefined	vapor
226.71	7.4219	19.394	0.051562	356.46	394.73	1.7727	0.71231	1.0363	221.18	2.3786	undefined	undefined	vapor
226.92	7.4800	19.541	0.051176	356.52	394.80	1.7717	0.71299	1.0379	221.18	2.3725	undefined	undefined	vapor
227.13	7.5385	19.688	0.050792	356.58	394.87	1.7707	0.71366	1.0395	221.19	2.3665	undefined	undefined	vapor
227.34	7.5973	19.836	0.050412	356.64	394.94	1.7697	0.71434	1.0411	221.19	2.3605	undefined	undefined	vapor
227.54	7.6565	19.986	0.050036	356.70	395.01	1.7687	0.71502	1.0427	221.19	2.3546	undefined	undefined	vapor
227.75	7.7160	20.136	0.049663	356.77	395.08	1.7677	0.71570	1.0443	221.20	2.3486	undefined	undefined	vapor
227.96	7.7758	20.287	0.049293	356.83	395.16	1.7667	0.71638	1.0459	221.20	2.3427	undefined	undefined	vapor
228.17	7.8360	20.439	0.048927	356.89	395.22	1.7657	0.71706	1.0475	221.20	2.3368	undefined	undefined	vapor
228.37	7.8965	20.591	0.048564	356.95	395.29	1.7647	0.71774	1.0491	221.20	2.3309	undefined	undefined	vapor
228.58	7.9574	20.745	0.048204	357.01	395.36	1.7637	0.71842	1.0507	221.20	2.3251	undefined	undefined	vapor
228.79	8.0187	20.900	0.047848	357.06	395.43	1.7628	0.71910	1.0524	221.20	2.3193	undefined	undefined	vapor
229.00	8.0802	21.055	0.047495	357.12	395.50	1.7618	0.71978	1.0540	221.20	2.3135	undefined	undefined	vapor
229.20	8.1422	21.211	0.047144	357.18	395.57	1.7608	0.72046	1.0556	221.20	2.3077	undefined	undefined	vapor
229.41	8.2044	21.369	0.046797	357.24	395.64	1.7598	0.72114	1.0573	221.20	2.3019	undefined	undefined	vapor
229.62	8.2671	21.527	0.046453	357.30	395.70	1.7588	0.72182	1.0589	221.20	2.2962	undefined	undefined	vapor
229.83	8.3301	21.686	0.046112	357.36	395.77	1.7578	0.72250	1.0606	221.20	2.2905	undefined	undefined	vapor
230.03	8.3934	21.846	0.045775	357.42	395.84	1.7569	0.72319	1.0623	221.20	2.2848	undefined	undefined	vapor
230.24	8.4571	22.007	0.045440	357.47	395.90	1.7559	0.72387	1.0639	221.20	2.2792	undefined	undefined	vapor
230.45	8.5212	22.169	0.045108	357.53	395.97	1.7549	0.72455	1.0656	221.20	2.2736	undefined	undefined	vapor
230.66	8.5856	22.332	0.044779	357.59	396.03	1.7540	0.72523	1.0673	221.19	2.2680	undefined	undefined	vapor
230.86	8.6504	22.496	0.044453	357.65	396.10	1.7530	0.72592	1.0690	221.19	2.2624	undefined	undefined	vapor
231.07	8.7155	22.661	0.044129	357.70	396.16	1.7520	0.72660	1.0707	221.19	2.2568	undefined	undefined	vapor
231.28	8.7810	22.826	0.043809	357.76	396.23	1.7510	0.72729	1.0724	221.18	2.2513	undefined	undefined	vapor
231.49	8.8469	22.993	0.043491	357.81	396.29	1.7501	0.72797	1.0741	221.18	2.2458	undefined	undefined	vapor
231.70	8.9131	23.161	0.043177	357.87	396.35	1.7491	0.72866	1.0759	221.17	2.2403	undefined	undefined	vapor
231.90	8.9797	23.329	0.042865	357.93	396.42	1.7481	0.72934	1.0776	221.17	2.2348	undefined	undefined	vapor
232.11	9.0467	23.499	0.042555	357.98	396.48	1.7472	0.73003	1.0793	221.16	2.2294	undefined	undefined	vapor
232.32	9.1140	23.669	0.042249	358.04	396.54	1.7462	0.73071	1.0811	221.16	2.2240	undefined	undefined	vapor
232.53	9.1817	23.841	0.041944	358.09	396.60	1.7453	0.73140	1.0828	221.15	2.2186	undefined	undefined	vapor
232.73	9.2498	24.014	0.041643	358.15	396.67	1.7443	0.73209	1.0846	221.14	2.2132	undefined	undefined	vapor
232.94	9.3183	24.187	0.041344	358.20	396.73	1.7433	0.73277	1.0863	221.14	2.2079	undefined	undefined	vapor
233.15	9.3871	24.362	0.041048	358.26	396.79	1.7424	0.73346	1.0881	221.13	2.2025	undefined	undefined	vapor
233.36	9.4563	24.537	0.040755	358.31	396.85	1.7414	0.73415	1.0899	221.12	2.1972	undefined	undefined	vapor
233.56	9.5259	24.714	0.040463	358.36	396.91	1.7405	0.73484	1.0917	221.11	2.1920	undefined	undefined	vapor
233.77	9.5958	24.891	0.040175	358.42	396.97	1.7395	0.73552	1.0935	221.10	2.1867	undefined	undefined	vapor
233.98	9.6661	25.070	0.039889	358.47	397.03	1.7386	0.73621	1.0953	221.09	2.1815	undefined	undefined	vapor
234.19	9.7368	25.249	0.039605	358.52	397.08	1.7376	0.73690	1.0971	221.08	2.1762	undefined	undefined	vapor
234.39	9.8079	25.430	0.039324	358.57	397.14	1.7367	0.73759	1.0989	221.07	2.1711	undefined	undefined	vapor
234.60	9.8794	25.612	0.039045	358.63	397.20	1.7357	0.73828	1.1007	221.06	2.1659	undefined	undefined	vapor
234.81	9.9513	25.794	0.038768	358.68	397.26	1.7348	0.73897	1.1025	221.05	2.1607	undefined	undefined	vapor
235.02	10.024	25.978	0.038494	358.73	397.31	1.7338	0.73966	1.1044	221.04	2.1556	undefined	undefined	vapor
235.22	10.096	26.163	0.038222	358.78	397.37	1.7329	0.74035	1.1062	221.03	2.1505	undefined	undefined	vapor
235.43	10.169	26.349	0.037953	358.83	397.43	1.7319	0.74104	1.1081	221.02	2.1454	undefined	undefined	vapor
235.64	10.243	26.535	0.037685	358.88	397.48	1.7310	0.74174	1.1099	221.00	2.1403	undefined	undefined	vapor
235.85	10.316	26.723	0.037420	358.93	397.54	1.7301	0.74243	1.1118	220.99	2.1353	undefined	undefined	vapor
236.05	10.391	26.912	0.037158	358.98	397.59	1.7291	0.74312	1.1137	220.98	2.1303	undefined	undefined	vapor
236.26	10.465	27.102	0.036897	359.03	397.65	1.7282	0.74381	1.1156	220.96	2.1253	undefined	undefined	vapor
236.47	10.540	27.294	0.036639	359.08	397.70	1.7272	0.74451	1.1175	220.95	2.1203	undefined	undefined	vapor
236.68	10.616	27.486	0.036382	359.13	397.76	1.7263	0.74520	1.1194	220.93	2.1153	undefined	undefined	vapor
236.88	10.691	27.679	0.036128	359.18	397.81	1.7254	0.74589	1.1213	220.92	2.1104	undefined	undefined	vapor
237.09	10.767	27.874	0.035876	359.23	397.86	1.7244	0.74659	1.1232	220.90	2.1055	undefined	undefined	vapor
237.30	10.844	28.069	0.035626	359.28	397.91	1.7235	0.74728	1.1251	220.89	2.1006	undefined	undefined	vapor
237.51	10.921	28.266	0.035379	359.33	397.97	1.7226	0.74798	1.1271	220.87	2.0957	undefined	undefined	vapor
237.71	10.998	28.463	0.035133	359.38	398.02	1.7216	0.74867	1.1290	220.85	2.0909	undefined	undefined	vapor
237.92	11.076	28.662	0.034889	359.42	398.07	1.7207	0.74937	1.1310	220.83	2.0860	undefined	undefined	vapor
238.13	11.154	28.862	0.034647	359.47	398.12	1.7198	0.75006	1.1329	220.82	2.0812	undefined	undefined	vapor
238.34	11.233	29.063	0.034408	359.52	398.17	1.7189	0.75076	1.1349	220.80	2.0764	undefined	undefined	vapor
238.54	11.312	29.266	0.034170	359.57	398.22	1.7179	0.75146	1.1369	220.78	2.0716	undefined	undefined	vapor
238.75	11.391	29.469	0.033934	359.61	398.27	1.7170	0.75215	1.1389	220.76	2.0669	undefined	undefined	vapor
238.96	11.471	29.673	0.033700	359.66	398.32	1.7161	0.75285	1.1409	220.74	2.0621	undefined	undefined	vapor
239.17	11.551	29.879	0.033468	359.70	398.36	1.7151	0.75355	1.1429	220.72	2.0574	undefined	undefined	vapor
239.37	11.632	30.086	0.033238	359.75	398.41	1.7142	0.75425	1.1449	220.70	2.0527	undefined	undefined	vapor
239.58	11.713	30.294	0.033010	359.80	398.46	1.7133	0.75495	1.1469	220.68	2.0481	undefined	undefined	vapor
239.79	11.794	30.503	0.032784	359.84	398.51	1.7124	0.75565	1.1490	220.66	2.0434	undefined	undefined	vapor
240.00	11.876	30.713	0.032559	359.88	398.55	1.7115	0.75635	1.1510	220.64	2.0388	undefined	undefined	vapor
240.20	11.959	30.925	0.032337	359.93	398.60	1.7105	0.75705	1.1531	220.62	2.0341	undefined	undefined	vapor
240.41	12.041	31.137	0.032116	359.97	398.64	1.7096	0.75775	1.1551	220.59	2.0295	undefined	undefined	vapor
240.62	12.124	31.351	0.031897	360.02	398.69	1.7087	0.75845	1.1572	220.57	2.0249	undefined	undefined	vapor
240.83	12.208	31.566	0.031679	360.06	398.73	1.7078	0.75915	1.1593	220.55	2.0204	undefined	undefined	vapor
241.03	12.292	31.782	0.031464	360.10	398.78	1.7069	0.75985	1.1614	220.52	2.0158	undefined	undefined	vapor
241.24	12.376	32.000	0.031250	360.15	398.82	1.7059	0.76055	1.1635	220.50	2.0113	undefined	undefined	vapor
241.45	12.461	32.219	0.031038	360.19	398.87	1.7050	0.76126	1.1656	220.47	2.0068	undefined	undefined	vapor
241.66	12.546	32.438	0.030828	360.23	398.91	1.7041	0.76196	1.1677	220.45	2.0023	undefined	undefined	vapor
241.86	12.632	32.659	0.030619	360.27	398.95	1.7032	0.76266	1.1699	220.42	1.9978	undefined	undefined	vapor
242.07	12.718	32.882	0.030412	360.31	398.99	1.7023	0.76337	1.1720	220.40	1.9934	undefined	undefined	vapor
242.28	12.805	33.105	0.030207	360.36	399.03	1.7014	0.76407	1.1742	220.37	1.9890	undefined	undefined	vapor
242.49	12.892	33.330	0.030003	360.40	399.07	1.7005	0.76478	1.1763	220.34	1.9845	undefined	undefined	vapor
242.69	12.979	33.556	0.029801	360.44	399.12	1.6996	0.76548	1.1785	220.32	1.9801	undefined	undefined	vapor
242.90	13.067	33.784	0.029600	360.48	399.15	1.6986	0.76619	1.1807	220.29	1.9758	undefined	undefined	vapor
243.11	13.155	34.012	0.029401	360.52	399.19	1.6977	0.76689	1.1829	220.26	1.9714	undefined	undefined	vapor
243.32	13.244	34.242	0.029204	360.56	399.23	1.6968	0.76760	1.1851	220.23	1.9671	undefined	undefined	vapor
243.52	13.333	34.473	0.029008	360.60	399.27	1.6959	0.76831	1.1873	220.20	1.9627	undefined	undefined	vapor
243.73	13.422	34.706	0.028814	360.63	399.31	1.6950	0.76902	1.1896	220.17	1.9584	undefined	undefined	vapor
243.94	13.512	34.939	0.028621	360.67	399.35	1.6941	0.76972	1.1918	220.14	1.9541	undefined	undefined	vapor
244.15	13.603	35.174	0.028430	360.71	399.38	1.6932	0.77043	1.1941	220.11	1.9499	undefined	undefined	vapor
244.35	13.694	35.411	0.028240	360.75	399.42	1.6923	0.77114	1.1963	220.08	1.9456	undefined	undefined	vapor
244.56	13.785	35.648	0.028052	360.79	399.46	1.6914	0.77185	1.1986	220.05	1.9414	undefined	undefined	vapor
244.77	13.877	35.887	0.027865	360.82	399.49	1.6905	0.77256	1.2009	220.02	1.9371	undefined	undefined	vapor
244.98	13.969	36.128	0.027680	360.86	399.53	1.6896	0.77327	1.2032	219.99	1.9329	undefined	undefined	vapor
245.18	14.062	36.369	0.027496	360.90	399.56	1.6887	0.77398	1.2055	219.95	1.9287	undefined	undefined	vapor
245.39	14.155	36.612	0.027313	360.93	399.60	1.6878	0.77470	1.2078	219.92	1.9246	undefined	undefined	vapor
245.60	14.249	36.857	0.027132	360.97	399.63	1.6869	0.77541	1.2102	219.89	1.9204	undefined	undefined	vapor
245.81	14.343	37.102	0.026953	361.00	399.66	1.6860	0.77612	1.2125	219.85	1.9163	undefined	undefined	vapor
246.01	14.437	37.349	0.026774	361.04	399.69	1.6851	0.77683	1.2149	219.82	1.9121	undefined	undefined	vapor
246.22	14.532	37.598	0.026597	361.07	399.73	1.6842	0.77755	1.2173	219.78	1.9080	undefined	undefined	vapor
246.43	14.627	37.847	0.026422	361.11	399.76	1.6833	0.77826	1.2197	219.75	1.9039	undefined	undefined	vapor
246.64	14.723	38.098	0.026248	361.14	399.79	1.6824	0.77898	1.2221	219.71	1.8999	undefined	undefined	vapor
246.84	14.820	38.351	0.026075	361.18	399.82	1.6815	0.77969	1.2245	219.68	1.8958	undefined	undefined	vapor
247.05	14.916	38.605	0.025903	361.21	399.85	1.6806	0.78041	1.2269	219.64	1.8918	undefined	undefined	vapor
247.26	15.014	38.860	0.025733	361.24	399.88	1.6797	0.78113	1.2294	219.60	1.8878	undefined	undefined	vapor
247.47	15.111	39.117	0.025564	361.27	399.91	1.6788	0.78184	1.2318	219.56	1.8837	undefined	undefined	vapor
247.68	15.209	39.375	0.025397	361.31	399.93	1.6779	0.78256	1.2343	219.53	1.8797	undefined	undefined	vapor
247.88	15.308	39.635	0.025230	361.34	399.96	1.6770	0.78328	1.2368	219.49	1.8758	undefined	undefined	vapor
248.09	15.407	39.896	0.025065	361.37	399.99	1.6761	0.78400	1.2393	219.45	1.8718	undefined	undefined	vapor
248.30	15.507	40.158	0.024901	361.40	400.01	1.6752	0.78472	1.2418	219.41	1.8679	undefined	undefined	vapor
248.51	15.607	40.422	0.024739	361.43	400.04	1.6743	0.78544	1.2443	219.37	1.8639	undefined	undefined	vapor
248.71	15.707	40.688	0.024577	361.46	400.07	1.6734	0.78616	1.2468	219.33	1.8600	undefined	undefined	vapor
248.92	15.808	40.955	0.024417	361.49	400.09	1.6725	0.78688	1.2494	219.29	1.8561	undefined	undefined	vapor
249.13	15.910	41.223	0.024258	361.52	400.12	1.6716	0.78760	1.2520	219.25	1.8522	undefined	undefined	vapor
249.34	16.012	41.493	0.024101	361.55	400.14	1.6707	0.78833	1.2546	219.20	1.8484	undefined	undefined	vapor
249.54	16.114	41.764	0.023944	361.58	400.16	1.6698	0.78905	1.2572	219.16	1.8445	undefined	undefined	vapor
249.75	16.217	42.037	0.023789	361.61	400.19	1.6689	0.78977	1.2598	219.12	1.8407	undefined	undefined	vapor
249.96	16.320	42.311	0.023634	361.64	400.21	1.6681	0.79050	1.2624	219.08	1.8368	undefined	undefined	vapor
250.17	16.424	42.587	0.023481	361.66	400.23	1.6672	0.79122	1.2650	219.03	1.8330	undefined	undefined	vapor
250.37	16.528	42.864	0.023329	361.69	400.25	1.6663	0.79195	1.2677	218.99	1.8292	undefined	undefined	vapor
250.58	16.633	43.143	0.023179	361.72	400.27	1.6654	0.79268	1.2704	218.94	1.8255	undefined	undefined	vapor
250.79	16.738	43.424	0.023029	361.74	400.29	1.6645	0.79340	1.2731	218.90	1.8217	undefined	undefined	vapor
251.00	16.844	43.706	0.022880	361.77	400.31	1.6636	0.79413	1.2758	218.85	1.8179	undefined	undefined	vapor
251.20	16.950	43.989	0.022733	361.79	400.33	1.6627	0.79486	1.2785	218.81	1.8142	undefined	undefined	vapor
251.41	17.057	44.275	0.022586	361.82	400.35	1.6618	0.79559	1.2812	218.76	1.8105	undefined	undefined	vapor
251.62	17.164	44.561	0.022441	361.84	400.36	1.6609	0.79632	1.2840	218.71	1.8068	undefined	undefined	vapor
251.83	17.272	44.850	0.022297	361.87	400.38	1.6600	0.79705	1.2868	218.66	1.8031	undefined	undefined	vapor
252.03	17.380	45.139	0.022154	361.89	400.40	1.6591	0.79778	1.2896	218.62	1.7994	undefined	undefined	vapor
252.24	17.489	45.431	0.022011	361.92	400.41	1.6583	0.79851	1.2924	218.57	1.7957	undefined	undefined	vapor
252.45	17.598	45.724	0.021870	361.94	400.43	1.6574	0.79925	1.2952	218.52	1.7921	undefined	undefined	vapor
252.66	17.708	46.019	0.021730	361.96	400.44	1.6565	0.79998	1.2980	218.47	1.7884	undefined	undefined	vapor
252.86	17.818	46.315	0.021591	361.98	400.46	1.6556	0.80072	1.3009	218.42	1.7848	undefined	undefined	vapor
253.07	17.929	46.613	0.021453	362.01	400.47	1.6547	0.80145	1.3038	218.37	1.7812	undefined	undefined	vapor
253.28	18.040	46.913	0.021316	362.03	400.48	1.6538	0.80219	1.3067	218.32	1.7776	undefined	undefined	vapor
253.49	18.152	47.214	0.021180	362.05	400.49	1.6529	0.80292	1.3096	218.27	1.7740	undefined	undefined	vapor
253.69	18.264	47.517	0.021045	362.07	400.50	1.6520	0.80366	1.3125	218.22	1.7705	undefined	undefined	vapor
253.90	18.377	47.822	0.020911	362.09	400.52	1.6511	0.80440	1.3155	218.16	1.7669	undefined	undefined	vapor
254.11	18.490	48.129	0.020778	362.11	400.53	1.6502	0.80514	1.3184	218.11	1.7634	undefined	undefined	vapor
254.32	18.603	48.437	0.020645	362.13	400.53	1.6494	0.80588	1.3214	218.06	1.7598	undefined	undefined	vapor
254.52	18.718	48.747	0.020514	362.15	400.54	1.6485	0.80662	1.3245	218.00	1.7563	undefined	undefined	vapor
254.73	18.832	49.058	0.020384	362.16	400.55	1.6476	0.80736	1.3275	217.95	1.7528	undefined	undefined	vapor
254.94	18.948	49.371	0.020255	362.18	400.56	1.6467	0.80810	1.3305	217.90	1.7493	undefined	undefined	vapor
255.15	19.063	49.686	0.020126	362.20	400.57	1.6458	0.80885	1.3336	217.84	1.7458	undefined	undefined	vapor
255.35	19.180	50.003	0.019999	362.22	400.57	1.6449	0.80959	1.3367	217.78	1.7424	undefined	undefined	vapor
255.56	19.297	50.322	0.019872	362.23	400.58	1.6440	0.81034	1.3398	217.73	1.7389	undefined	undefined	vapor
255.77	19.414	50.642	0.019746	362.25	400.58	1.6431	0.81108	1.3429	217.67	1.7355	undefined	undefined	vapor
255.98	19.532	50.964	0.019622	362.26	400.59	1.6422	0.81183	1.3461	217.61	1.7320	undefined	undefined	vapor
256.18	19.650	51.288	0.019498	362.28	400.59	1.6414	0.81258	1.3493	217.56	1.7286	undefined	undefined	vapor
256.39	19.769	51.614	0.019375	362.29	400.59	1.6405	0.81333	1.3525	217.50	1.7252	undefined	undefined	vapor
256.60	19.888	51.942	0.019252	362.31	400.60	1.6396	0.81408	1.3557	217.44	1.7218	undefined	undefined	vapor
256.81	20.008	52.271	0.019131	362.32	400.60	1.6387	0.81483	1.3589	217.38	1.7185	undefined	undefined	vapor
257.01	20.129	52.602	0.019011	362.33	400.60	1.6378	0.81558	1.3622	217.32	1.7151	undefined	undefined	vapor
257.22	20.250	52.935	0.018891	362.35	400.60	1.6369	0.81633	1.3655	217.26	1.7117	undefined	undefined	vapor
257.43	20.371	53.270	0.018772	362.36	400.60	1.6360	0.81708	1.3688	217.20	1.7084	undefined	undefined	vapor
257.64	20.493	53.607	0.018654	362.37	400.60	1.6351	0.81784	1.3721	217.14	1.7051	undefined	undefined	vapor
257.84	20.616	53.946	0.018537	362.38	400.60	1.6342	0.81859	1.3755	217.08	1.7017	undefined	undefined	vapor
258.05	20.739	54.286	0.018421	362.39	400.60	1.6333	0.81935	1.3788	217.02	1.6984	undefined	undefined	vapor
258.26	20.862	54.629	0.018305	362.40	400.59	1.6325	0.82011	1.3822	216.95	1.6951	undefined	undefined	vapor
258.47	20.986	54.974	0.018191	362.41	400.59	1.6316	0.82086	1.3857	216.89	1.6919	undefined	undefined	vapor
258.67	21.111	55.320	0.018077	362.42	400.58	1.6307	0.82162	1.3891	216.83	1.6886	undefined	undefined	vapor
258.88	21.236	55.668	0.017964	362.43	400.58	1.6298	0.82238	1.3926	216.76	1.6853	undefined	undefined	vapor
259.09	21.362	56.019	0.017851	362.44	400.57	1.6289	0.82315	1.3961	216.70	1.6821	undefined	undefined	vapor
259.30	21.488	56.371	0.017740	362.45	400.57	1.6280	0.82391	1.3996	216.63	1.6788	undefined	undefined	vapor
259.50	21.615	56.725	0.017629	362.45	400.56	1.6271	0.82467	1.4032	216.57	1.6756	undefined	undefined	vapor
259.71	21.743	57.082	0.017519	362.46	400.55	1.6262	0.82544	1.4068	216.50	1.6724	undefined	undefined	vapor
259.92	21.871	57.440	0.017409	362.47	400.54	1.6253	0.82620	1.4104	216.44	1.6692	undefined	undefined	vapor
260.13	21.999	57.800	0.017301	362.47	400.53	1.6244	0.82697	1.4140	216.37	1.6660	undefined	undefined	vapor
260.33	22.128	58.163	0.017193	362.48	400.52	1.6235	0.82774	1.4177	216.30	1.6628	undefined	undefined	vapor
260.54	22.258	58.527	0.017086	362.48	400.51	1.6226	0.82851	1.4213	216.23	1.6596	undefined	undefined	vapor
260.75	22.388	58.894	0.016980	362.49	400.50	1.6217	0.82928	1.4251	216.16	1.6565	undefined	undefined	vapor
260.96	22.519	59.262	0.016874	362.49	400.49	1.6208	0.83005	1.4288	216.09	1.6533	undefined	undefined	vapor
261.16	22.650	59.633	0.016769	362.49	400.47	1.6199	0.83082	1.4326	216.02	1.6502	undefined	undefined	vapor
261.37	22.782	60.006	0.016665	362.49	400.46	1.6190	0.83159	1.4364	215.95	1.6471	undefined	undefined	vapor
261.58	22.914	60.381	0.016562	362.50	400.44	1.6181	0.83237	1.4402	215.88	1.6439	undefined	undefined	vapor
261.79	23.047	60.758	0.016459	362.50	400.43	1.6173	0.83315	1.4441	215.81	1.6408	undefined	undefined	vapor
261.99	23.180	61.137	0.016357	362.50	400.41	1.6164	0.83392	1.4480	215.74	1.6377	undefined	undefined	vapor
262.20	23.314	61.519	0.016255	362.50	400.40	1.6155	0.83470	1.4519	215.67	1.6346	undefined	undefined	vapor
262.41	23.449	61.902	0.016154	362.50	400.38	1.6146	0.83548	1.4558	215.60	1.6316	undefined	undefined	vapor
262.62	23.584	62.288	0.016054	362.50	400.36	1.6137	0.83626	1.4598	215.52	1.6285	undefined	undefined	vapor
262.83	23.720	62.676	0.015955	362.49	400.34	1.6128	0.83705	1.4638	215.45	1.6254	undefined	undefined	vapor
263.03	23.856	63.067	0.015856	362.49	400.32	1.6119	0.83783	1.4679	215.37	1.6224	undefined	undefined	vapor
263.24	23.993	63.459	0.015758	362.49	400.30	1.6109	0.83861	1.4720	215.30	1.6193	undefined	undefined	vapor
263.45	24.131	63.854	0.015661	362.49	400.28	1.6100	0.83940	1.4761	215.22	1.6163	undefined	undefined	vapor
263.66	24.269	64.251	0.015564	362.48	400.25	1.6091	0.84019	1.4802	215.15	1.6133	undefined	undefined	vapor
263.86	24.407	64.650	0.015468	362.48	400.23	1.6082	0.84098	1.4844	215.07	1.6103	undefined	undefined	vapor
264.07	24.546	65.052	0.015372	362.47	400.21	1.6073	0.84177	1.4886	214.99	1.6073	undefined	undefined	vapor
264.28	24.686	65.456	0.015277	362.47	400.18	1.6064	0.84256	1.4929	214.92	1.6043	undefined	undefined	vapor
264.49	24.826	65.862	0.015183	362.46	400.16	1.6055	0.84335	1.4972	214.84	1.6013	undefined	undefined	vapor
264.69	24.967	66.271	0.015090	362.45	400.13	1.6046	0.84415	1.5015	214.76	1.5983	undefined	undefined	vapor
264.90	25.109	66.682	0.014997	362.45	400.10	1.6037	0.84494	1.5059	214.68	1.5954	undefined	undefined	vapor
265.11	25.251	67.096	0.014904	362.44	400.07	1.6028	0.84574	1.5103	214.60	1.5924	undefined	undefined	vapor
265.32	25.393	67.511	0.014812	362.43	400.04	1.6019	0.84654	1.5147	214.52	1.5895	undefined	undefined	vapor
265.52	25.537	67.930	0.014721	362.42	400.01	1.6010	0.84734	1.5192	214.44	1.5865	undefined	undefined	vapor
265.73	25.681	68.351	0.014630	362.41	399.98	1.6001	0.84814	1.5237	214.36	1.5836	undefined	undefined	vapor
265.94	25.825	68.774	0.014540	362.40	399.95	1.5992	0.84895	1.5282	214.28	1.5807	undefined	undefined	vapor
266.15	25.970	69.199	0.014451	362.39	399.92	1.5982	0.84975	1.5328	214.19	1.5778	undefined	undefined	vapor
266.35	26.116	69.628	0.014362	362.38	399.88	1.5973	0.85056	1.5375	214.11	1.5749	undefined	undefined	vapor
266.56	26.262	70.058	0.014274	362.36	399.85	1.5964	0.85137	1.5421	214.03	1.5720	undefined	undefined	vapor
266.77	26.408	70.492	0.014186	362.35	399.81	1.5955	0.85218	1.5469	213.94	1.5691	undefined	undefined	vapor
266.98	26.556	70.928	0.014099	362.34	399.78	1.5946	0.85299	1.5516	213.86	1.5662	undefined	undefined	vapor
267.18	26.704	71.366	0.014012	362.32	399.74	1.5937	0.85380	1.5564	213.77	1.5633	undefined	undefined	vapor
267.39	26.852	71.807	0.013926	362.31	399.70	1.5927	0.85462	1.5613	213.69	1.5605	undefined	undefined	vapor
267.60	27.002	72.251	0.013841	362.29	399.66	1.5918	0.85543	1.5661	213.60	1.5576	undefined	undefined	vapor
267.81	27.151	72.697	0.013756	362.27	399.62	1.5909	0.85625	1.5711	213.52	1.5548	undefined	undefined	vapor
268.01	27.302	73.146	0.013671	362.26	399.58	1.5900	0.85707	1.5761	213.43	1.5519	undefined	undefined	vapor
268.22	27.453	73.598	0.013587	362.24	399.54	1.5890	0.85789	1.5811	213.34	1.5491	undefined	undefined	vapor
268.43	27.604	74.052	0.013504	362.22	399.50	1.5881	0.85872	1.5862	213.25	1.5463	undefined	undefined	vapor
268.64	27.756	74.509	0.013421	362.20	399.45	1.5872	0.85954	1.5913	213.16	1.5435	undefined	undefined	vapor
268.84	27.909	74.969	0.013339	362.18	399.41	1.5863	0.86037	1.5964	213.07	1.5406	undefined	undefined	vapor
269.05	28.063	75.432	0.013257	362.16	399.36	1.5853	0.86120	1.6017	212.98	1.5378	undefined	undefined	vapor
269.26	28.217	75.897	0.013176	362.14	399.32	1.5844	0.86203	1.6069	212.89	1.5351	undefined	undefined	vapor
269.47	28.371	76.365	0.013095	362.12	399.27	1.5835	0.86286	1.6122	212.80	1.5323	undefined	undefined	vapor
269.67	28.527	76.836	0.013015	362.09	399.22	1.5825	0.86369	1.6176	212.71	1.5295	undefined	undefined	vapor
269.88	28.683	77.310	0.012935	362.07	399.17	1.5816	0.86453	1.6230	212.62	1.5267	undefined	undefined	vapor
270.09	28.839	77.787	0.012856	362.04	399.12	1.5807	0.86537	1.6285	212.52	1.5239	undefined	undefined	vapor
270.30	28.996	78.267	0.012777	362.02	399.07	1.5797	0.86621	1.6340	212.43	1.5212	undefined	undefined	vapor
270.50	29.154	78.749	0.012699	361.99	399.01	1.5788	0.86705	1.6396	212.34	1.5184	undefined	undefined	vapor
270.71	29.312	79.235	0.012621	361.97	398.96	1.5779	0.86789	1.6452	212.24	1.5157	undefined	undefined	vapor
270.92	29.471	79.723	0.012543	361.94	398.91	1.5769	0.86874	1.6509	212.15	1.5130	undefined	undefined	vapor
271.13	29.631	80.215	0.012467	361.91	398.85	1.5760	0.86959	1.6567	212.05	1.5102	undefined	undefined	vapor
271.33	29.791	80.709	0.012390	361.88	398.79	1.5750	0.87044	1.6625	211.95	1.5075	undefined	undefined	vapor
271.54	29.952	81.207	0.012314	361.85	398.73	1.5741	0.87129	1.6684	211.86	1.5048	undefined	undefined	vapor
271.75	30.114	81.708	0.012239	361.82	398.68	1.5731	0.87215	1.6743	211.76	1.5021	undefined	undefined	vapor
271.96	30.276	82.212	0.012164	361.79	398.62	1.5722	0.87300	1.6803	211.66	1.4994	undefined	undefined	vapor
272.16	30.439	82.719	0.012089	361.76	398.55	1.5712	0.87386	1.6864	211.56	1.4967	undefined	undefined	vapor
272.37	30.602	83.229	0.012015	361.72	398.49	1.5703	0.87472	1.6925	211.46	1.4940	undefined	undefined	vapor
272.58	30.766	83.742	0.011941	361.69	398.43	1.5693	0.87559	1.6987	211.36	1.4913	undefined	undefined	vapor
272.79	30.931	84.258	0.011868	361.65	398.36	1.5684	0.87645	1.7049	211.26	1.4886	undefined	undefined	vapor
272.99	31.096	84.778	0.011795	361.62	398.30	1.5674	0.87732	1.7112	211.16	1.4859	undefined	undefined	vapor
273.20	31.262	85.301	0.011723	361.58	398.23	1.5665	0.87819	1.7176	211.06	1.4832	undefined	undefined	vapor
273.41	31.429	85.828	0.011651	361.55	398.16	1.5655	0.87906	1.7240	210.96	1.4806	undefined	undefined	vapor
273.62	31.596	86.357	0.011580	361.51	398.10	1.5645	0.87993	1.7306	210.85	1.4779	undefined	undefined	vapor
273.82	31.764	86.890	0.011509	361.47	398.02	1.5636	0.88081	1.7372	210.75	1.4753	undefined	undefined	vapor
274.03	31.933	87.427	0.011438	361.43	397.95	1.5626	0.88169	1.7438	210.65	1.4726	undefined	undefined	vapor
274.24	32.102	87.967	0.011368	361.39	397.88	1.5616	0.88257	1.7506	210.54	1.4700	undefined	undefined	vapor
274.45	32.272	88.510	0.011298	361.35	397.81	1.5607	0.88346	1.7574	210.44	1.4673	undefined	undefined	vapor
274.65	32.442	89.057	0.011229	361.30	397.73	1.5597	0.88434	1.7643	210.33	1.4647	undefined	undefined	vapor
274.86	32.614	89.607	0.011160	361.26	397.66	1.5587	0.88523	1.7712	210.22	1.4621	undefined	undefined	vapor
275.07	32.786	90.161	0.011091	361.22	397.58	1.5577	0.88613	1.7783	210.12	1.4594	undefined	undefined	vapor
275.28	32.958	90.718	0.011023	361.17	397.50	1.5568	0.88702	1.7854	210.01	1.4568	undefined	undefined	vapor
275.48	33.131	91.280	0.010955	361.12	397.42	1.5558	0.88792	1.7926	209.90	1.4542	undefined	undefined	vapor
275.69	33.305	91.844	0.010888	361.08	397.34	1.5548	0.88882	1.7999	209.79	1.4516	undefined	undefined	vapor
275.90	33.480	92.413	0.010821	361.03	397.26	1.5538	0.88972	1.8073	209.68	1.4490	undefined	undefined	vapor
276.11	33.655	92.985	0.010754	360.98	397.17	1.5528	0.89063	1.8148	209.57	1.4464	undefined	undefined	vapor
276.31	33.831	93.561	0.010688	360.93	397.09	1.5518	0.89153	1.8224	209.46	1.4438	undefined	undefined	vapor
276.52	34.008	94.140	0.010622	360.88	397.00	1.5509	0.89245	1.8300	209.35	1.4412	undefined	undefined	vapor
276.73	34.185	94.724	0.010557	360.83	396.92	1.5499	0.89336	1.8377	209.24	1.4386	undefined	undefined	vapor
276.94	34.363	95.311	0.010492	360.77	396.83	1.5489	0.89428	1.8456	209.13	1.4360	undefined	undefined	vapor
277.14	34.541	95.903	0.010427	360.72	396.74	1.5479	0.89520	1.8535	209.01	1.4334	undefined	undefined	vapor
277.35	34.721	96.498	0.010363	360.66	396.65	1.5469	0.89612	1.8615	208.90	1.4308	undefined	undefined	vapor
277.56	34.901	97.097	0.010299	360.61	396.55	1.5459	0.89704	1.8697	208.78	1.4282	undefined	undefined	vapor
277.77	35.081	97.701	0.010235	360.55	396.46	1.5448	0.89797	1.8779	208.67	1.4256	undefined	undefined	vapor
277.97	35.263	98.308	0.010172	360.49	396.36	1.5438	0.89890	1.8862	208.55	1.4231	undefined	undefined	vapor
278.18	35.445	98.920	0.010109	360.43	396.27	1.5428	0.89984	1.8947	208.44	1.4205	undefined	undefined	vapor
278.39	35.627	99.535	0.010047	360.37	396.17	1.5418	0.90078	1.9032	208.32	1.4179	undefined	undefined	vapor
278.60	35.811	100.16	0.0099845	360.31	396.07	1.5408	0.90172	1.9119	208.20	1.4153	undefined	undefined	vapor
278.81	35.995	100.78	0.0099227	360.25	395.97	1.5398	0.90266	1.9206	208.08	1.4128	undefined	undefined	vapor
279.01	36.180	101.41	0.0098612	360.19	395.86	1.5387	0.90361	1.9295	207.96	1.4102	undefined	undefined	vapor
279.22	36.365	102.04	0.0098000	360.12	395.76	1.5377	0.90456	1.9385	207.84	1.4077	undefined	undefined	vapor
279.43	36.551	102.68	0.0097392	360.06	395.65	1.5367	0.90552	1.9476	207.72	1.4051	undefined	undefined	vapor
279.64	36.738	103.32	0.0096787	359.99	395.55	1.5357	0.90647	1.9569	207.60	1.4025	undefined	undefined	vapor
279.84	36.926	103.97	0.0096186	359.92	395.44	1.5346	0.90744	1.9662	207.48	1.4000	undefined	undefined	vapor
280.05	37.114	104.62	0.0095588	359.85	395.33	1.5336	0.90840	1.9757	207.36	1.3974	undefined	undefined	vapor
280.26	37.303	105.27	0.0094993	359.78	395.22	1.5325	0.90937	1.9853	207.23	1.3949	undefined	undefined	vapor
280.47	37.493	105.93	0.0094401	359.71	395.10	1.5315	0.91034	1.9951	207.11	1.3923	undefined	undefined	vapor
280.67	37.683	106.60	0.0093813	359.64	394.99	1.5305	0.91132	2.0050	206.99	1.3898	undefined	undefined	vapor
280.88	37.874	107.26	0.0093228	359.56	394.87	1.5294	0.91230	2.0150	206.86	1.3872	undefined	undefined	vapor
281.09	38.066	107.94	0.0092645	359.49	394.75	1.5283	0.91328	2.0252	206.74	1.3847	undefined	undefined	vapor
281.30	38.259	108.62	0.0092066	359.41	394.64	1.5273	0.91427	2.0355	206.61	1.3821	undefined	undefined	vapor
281.50	38.452	109.30	0.0091490	359.33	394.51	1.5262	0.91526	2.0459	206.48	1.3796	undefined	undefined	vapor
281.71	38.646	109.99	0.0090918	359.25	394.39	1.5252	0.91625	2.0566	206.36	1.3771	undefined	undefined	vapor
281.92	38.841	110.68	0.0090348	359.17	394.27	1.5241	0.91725	2.0673	206.23	1.3745	undefined	undefined	vapor
282.13	39.036	111.38	0.0089781	359.09	394.14	1.5230	0.91825	2.0782	206.10	1.3720	undefined	undefined	vapor
282.33	39.233	112.09	0.0089217	359.01	394.01	1.5219	0.91926	2.0893	205.97	1.3694	undefined	undefined	vapor
282.54	39.430	112.80	0.0088656	358.93	393.88	1.5209	0.92027	2.1006	205.84	1.3669	undefined	undefined	vapor
282.75	39.627	113.51	0.0088098	358.84	393.75	1.5198	0.92129	2.1120	205.71	1.3643	undefined	undefined	vapor
282.96	39.826	114.23	0.0087543	358.75	393.62	1.5187	0.92231	2.1236	205.57	1.3618	undefined	undefined	vapor
283.16	40.025	114.95	0.0086991	358.67	393.48	1.5176	0.92333	2.1353	205.44	1.3592	undefined	undefined	vapor
283.37	40.225	115.68	0.0086442	358.58	393.35	1.5165	0.92436	2.1473	205.31	1.3567	undefined	undefined	vapor
283.58	40.425	116.42	0.0085895	358.48	393.21	1.5154	0.92539	2.1594	205.18	1.3541	undefined	undefined	vapor
283.79	40.627	117.16	0.0085351	358.39	393.07	1.5143	0.92643	2.1717	205.04	1.3516	undefined	undefined	vapor
283.99	40.829	117.91	0.0084810	358.30	392.92	1.5132	0.92747	2.1842	204.91	1.3490	undefined	undefined	vapor
284.20	41.032	118.66	0.0084272	358.20	392.78	1.5121	0.92852	2.1969	204.77	1.3465	undefined	undefined	vapor
284.41	41.235	119.42	0.0083737	358.11	392.63	1.5110	0.92957	2.2099	204.63	1.3439	undefined	undefined	vapor
284.62	41.440	120.19	0.0083204	358.01	392.49	1.5099	0.93063	2.2230	204.49	1.3413	undefined	undefined	vapor
284.82	41.645	120.96	0.0082674	357.91	392.34	1.5087	0.93169	2.2363	204.36	1.3388	undefined	undefined	vapor
285.03	41.851	121.73	0.0082146	357.81	392.18	1.5076	0.93275	2.2499	204.22	1.3362	undefined	undefined	vapor
285.24	42.057	122.52	0.0081621	357.70	392.03	1.5065	0.93383	2.2637	204.08	1.3337	undefined	undefined	vapor
285.45	42.265	123.31	0.0081099	357.60	391.87	1.5053	0.93490	2.2777	203.94	1.3311	undefined	undefined	vapor
285.65	42.473	124.10	0.0080579	357.49	391.72	1.5042	0.93598	2.2919	203.80	1.3285	undefined	undefined	vapor
285.86	42.682	124.90	0.0080062	357.38	391.56	1.5030	0.93707	2.3064	203.66	1.3259	undefined	undefined	vapor
286.07	42.891	125.71	0.0079547	357.27	391.39	1.5019	0.93816	2.3212	203.51	1.3234	undefined	undefined	vapor
286.28	43.102	126.53	0.0079035	357.16	391.23	1.5007	0.93926	2.3362	203.37	1.3208	undefined	undefined	vapor
286.48	43.313	127.35	0.0078525	357.05	391.06	1.4996	0.94036	2.3515	203.23	1.3182	undefined	undefined	vapor
286.69	43.525	128.18	0.0078017	356.94	390.89	1.4984	0.94147	2.3670	203.08	1.3156	undefined	undefined	vapor
286.90	43.738	129.01	0.0077512	356.82	390.72	1.4972	0.94259	2.3828	202.93	1.3130	undefined	undefined	vapor
287.11	43.951	129.85	0.0077010	356.70	390.55	1.4960	0.94371	2.3989	202.79	1.3104	undefined	undefined	vapor
287.31	44.166	130.70	0.0076510	356.58	390.37	1.4949	0.94483	2.4153	202.64	1.3078	undefined	undefined	vapor
287.52	44.381	131.56	0.0076012	356.46	390.19	1.4937	0.94597	2.4320	202.49	1.3052	undefined	undefined	vapor
287.73	44.597	132.42	0.0075516	356.33	390.01	1.4925	0.94710	2.4490	202.35	1.3025	undefined	undefined	vapor
287.94	44.813	133.29	0.0075023	356.21	389.83	1.4913	0.94825	2.4664	202.20	1.2999	undefined	undefined	vapor
288.14	45.031	134.17	0.0074531	356.08	389.64	1.4901	0.94940	2.4840	202.05	1.2973	undefined	undefined	vapor
288.35	45.249	135.06	0.0074042	355.95	389.46	1.4888	0.95056	2.5020	201.90	1.2946	undefined	undefined	vapor
288.56	45.468	135.95	0.0073556	355.82	389.27	1.4876	0.95172	2.5204	201.74	1.2920	undefined	undefined	vapor
288.77	45.688	136.85	0.0073071	355.69	389.07	1.4864	0.95289	2.5391	201.59	1.2893	undefined	undefined	vapor
288.97	45.909	137.76	0.0072589	355.55	388.88	1.4852	0.95407	2.5582	201.44	1.2867	undefined	undefined	vapor
289.18	46.130	138.68	0.0072109	355.42	388.68	1.4839	0.95525	2.5776	201.28	1.2840	undefined	undefined	vapor
289.39	46.353	139.61	0.0071630	355.28	388.48	1.4827	0.95644	2.5975	201.13	1.2813	undefined	undefined	vapor
289.60	46.576	140.54	0.0071154	355.13	388.27	1.4814	0.95764	2.6177	200.97	1.2786	undefined	undefined	vapor
289.80	46.800	141.48	0.0070680	354.99	388.07	1.4802	0.95885	2.6384	200.82	1.2759	undefined	undefined	vapor
290.01	47.025	142.43	0.0070208	354.84	387.86	1.4789	0.96006	2.6595	200.66	1.2732	undefined	undefined	vapor
290.22	47.250	143.39	0.0069738	354.70	387.65	1.4776	0.96128	2.6811	200.50	1.2705	undefined	undefined	vapor
290.43	47.477	144.36	0.0069270	354.55	387.43	1.4763	0.96251	2.7031	200.34	1.2678	undefined	undefined	vapor
290.63	47.704	145.34	0.0068804	354.39	387.21	1.4750	0.96374	2.7256	200.18	1.2651	undefined	undefined	vapor
290.84	47.932	146.33	0.0068339	354.24	386.99	1.4737	0.96499	2.7486	200.02	1.2623	undefined	undefined	vapor
291.05	48.161	147.33	0.0067877	354.08	386.77	1.4724	0.96624	2.7721	199.86	1.2596	undefined	undefined	vapor
291.26	48.391	148.33	0.0067417	353.92	386.54	1.4711	0.96750	2.7961	199.70	1.2568	undefined	undefined	vapor
291.46	48.621	149.35	0.0066958	353.76	386.31	1.4698	0.96877	2.8206	199.54	1.2540	undefined	undefined	vapor
291.67	48.853	150.37	0.0066501	353.59	386.08	1.4685	0.97004	2.8458	199.37	1.2512	undefined	undefined	vapor
291.88	49.085	151.41	0.0066046	353.42	385.84	1.4671	0.97133	2.8715	199.21	1.2484	undefined	undefined	vapor
292.09	49.318	152.46	0.0065592	353.25	385.60	1.4658	0.97262	2.8978	199.04	1.2456	undefined	undefined	vapor
292.29	49.552	153.51	0.0065141	353.08	385.36	1.4644	0.97393	2.9247	198.88	1.2428	undefined	undefined	vapor
292.50	49.787	154.58	0.0064691	352.91	385.11	1.4631	0.97524	2.9523	198.71	1.2399	undefined	undefined	vapor
292.71	50.022	155.66	0.0064242	352.73	384.86	1.4617	0.97656	2.9806	198.54	1.2370	undefined	undefined	vapor
292.92	50.259	156.75	0.0063796	352.55	384.61	1.4603	0.97789	3.0095	198.37	1.2342	undefined	undefined	vapor
293.12	50.496	157.85	0.0063351	352.36	384.35	1.4589	0.97923	3.0392	198.20	1.2313	undefined	undefined	vapor
293.33	50.735	158.96	0.0062907	352.18	384.09	1.4575	0.98058	3.0696	198.03	1.2284	undefined	undefined	vapor
293.54	50.974	160.09	0.0062465	351.99	383.83	1.4561	0.98195	3.1008	197.86	1.2254	undefined	undefined	vapor
293.75	51.214	161.23	0.0062025	351.79	383.56	1.4547	0.98332	3.1328	197.69	1.2225	undefined	undefined	vapor
293.96	51.455	162.38	0.0061586	351.60	383.28	1.4532	0.98470	3.1657	197.51	1.2195	undefined	undefined	vapor
294.16	51.696	163.54	0.0061148	351.40	383.01	1.4518	0.98609	3.1994	197.34	1.2165	undefined	undefined	vapor
294.37	51.939	164.71	0.0060712	351.19	382.73	1.4503	0.98750	3.2341	197.16	1.2135	undefined	undefined	vapor
294.58	52.183	165.90	0.0060277	350.99	382.44	1.4489	0.98891	3.2697	196.99	1.2105	undefined	undefined	vapor
294.79	52.427	167.10	0.0059844	350.78	382.15	1.4474	0.99034	3.3063	196.81	1.2074	undefined	undefined	vapor
294.99	52.672	168.32	0.0059412	350.57	381.86	1.4459	0.99178	3.3439	196.63	1.2044	undefined	undefined	vapor
295.20	52.918	169.55	0.0058981	350.35	381.56	1.4444	0.99323	3.3826	196.45	1.2013	undefined	undefined	vapor
295.41	53.166	170.79	0.0058552	350.13	381.26	1.4429	0.99470	3.4225	196.27	1.1982	undefined	undefined	vapor
295.62	53.414	172.05	0.0058124	349.91	380.95	1.4414	0.99617	3.4635	196.09	1.1950	undefined	undefined	vapor
295.82	53.663	173.32	0.0057696	349.68	380.64	1.4398	0.99766	3.5057	195.91	1.1918	undefined	undefined	vapor
296.03	53.912	174.61	0.0057270	349.45	380.32	1.4383	0.99916	3.5493	195.73	1.1887	undefined	undefined	vapor
296.24	54.163	175.92	0.0056846	349.21	380.00	1.4367	1.0007	3.5942	195.54	1.1854	undefined	undefined	vapor
296.45	54.415	177.24	0.0056422	348.97	379.67	1.4351	1.0022	3.6405	195.36	1.1822	undefined	undefined	vapor
296.65	54.668	178.57	0.0055999	348.73	379.34	1.4335	1.0038	3.6882	195.17	1.1789	undefined	undefined	vapor
296.86	54.921	179.93	0.0055577	348.48	379.00	1.4319	1.0053	3.7376	194.99	1.1756	undefined	undefined	vapor
297.07	55.176	181.30	0.0055156	348.23	378.66	1.4303	1.0069	3.7886	194.80	1.1723	undefined	undefined	vapor
297.28	55.431	182.69	0.0054737	347.97	378.31	1.4286	1.0085	3.8412	194.61	1.1689	undefined	undefined	vapor
297.48	55.688	184.10	0.0054317	347.71	377.96	1.4269	1.0101	3.8957	194.42	1.1655	undefined	undefined	vapor
297.69	55.945	185.53	0.0053899	347.44	377.59	1.4253	1.0117	3.9521	194.23	1.1620	undefined	undefined	vapor
297.90	56.203	186.98	0.0053482	347.17	377.23	1.4236	1.0133	4.0105	194.03	1.1586	undefined	undefined	vapor
298.11	56.462	188.45	0.0053065	346.89	376.85	1.4218	1.0150	4.0711	193.84	1.1551	undefined	undefined	vapor
298.31	56.723	189.94	0.0052649	346.61	376.47	1.4201	1.0167	4.1338	193.65	1.1515	undefined	undefined	vapor
298.52	56.984	191.45	0.0052233	346.32	376.09	1.4184	1.0184	4.1989	193.45	1.1479	undefined	undefined	vapor
298.73	57.246	192.98	0.0051818	346.03	375.69	1.4166	1.0201	4.2665	193.25	1.1443	undefined	undefined	vapor
298.94	57.509	194.54	0.0051404	345.73	375.29	1.4148	1.0218	4.3367	193.06	1.1406	undefined	undefined	vapor
299.14	57.773	196.12	0.0050990	345.43	374.89	1.4130	1.0235	4.4098	192.86	1.1369	undefined	undefined	vapor
299.35	58.039	197.72	0.0050576	345.12	374.47	1.4111	1.0253	4.4858	192.66	1.1331	undefined	undefined	vapor
299.56	58.305	199.35	0.0050163	344.80	374.05	1.4093	1.0271	4.5649	192.46	1.1293	undefined	undefined	vapor
299.77	58.572	201.01	0.0049750	344.48	373.62	1.4074	1.0289	4.6474	192.25	1.1254	undefined	undefined	vapor
299.97	58.840	202.69	0.0049337	344.15	373.18	1.4055	1.0307	4.7335	192.05	1.1215	undefined	undefined	vapor
300.18	59.109	204.40	0.0048924	343.81	372.73	1.4035	1.0326	4.8235	191.84	1.1175	undefined	undefined	vapor
300.39	59.379	206.14	0.0048511	343.47	372.27	1.4016	1.0345	4.9175	191.64	1.1135	undefined	undefined	vapor
300.60	59.651	207.91	0.0048098	343.11	371.80	1.3996	1.0364	5.0159	191.43	1.1094	undefined	undefined	vapor
300.80	59.923	209.71	0.0047685	342.75	371.33	1.3976	1.0383	5.1189	191.22	1.1052	undefined	undefined	vapor
301.01	60.196	211.54	0.0047272	342.39	370.84	1.3955	1.0403	5.2270	191.01	1.1010	undefined	undefined	vapor
301.22	60.471	213.41	0.0046859	342.01	370.35	1.3935	1.0422	5.3405	190.80	1.0967	undefined	undefined	vapor
301.43	60.746	215.31	0.0046445	341.63	369.84	1.3913	1.0443	5.4598	190.59	1.0924	undefined	undefined	vapor
301.63	61.022	217.25	0.0046030	341.23	369.32	1.3892	1.0463	5.5854	190.37	1.0879	undefined	undefined	vapor
301.84	61.300	219.23	0.0045615	340.83	368.79	1.3870	1.0484	5.7178	190.16	1.0834	undefined	undefined	vapor
302.05	61.579	221.24	0.0045199	340.42	368.25	1.3848	1.0505	5.8576	189.94	1.0788	undefined	undefined	vapor
302.26	61.858	223.30	0.0044782	339.99	367.69	1.3826	1.0526	6.0054	189.72	1.0741	undefined	undefined	vapor
302.46	62.139	225.41	0.0044365	339.56	367.12	1.3803	1.0547	6.1619	189.50	1.0694	undefined	undefined	vapor
302.67	62.421	227.55	0.0043946	339.11	366.54	1.3779	1.0569	6.3279	189.28	1.0645	undefined	undefined	vapor
302.88	62.704	229.75	0.0043525	338.65	365.95	1.3755	1.0592	6.5044	189.05	1.0595	undefined	undefined	vapor
303.09	62.988	232.00	0.0043103	338.18	365.33	1.3731	1.0615	6.6923	188.83	1.0545	undefined	undefined	vapor
303.29	63.274	234.30	0.0042680	337.70	364.70	1.3706	1.0638	6.8928	188.60	1.0493	undefined	undefined	vapor
303.50	63.560	236.66	0.0042254	337.20	364.06	1.3681	1.0661	7.1072	188.37	1.0440	undefined	undefined	vapor
303.71	63.848	239.08	0.0041827	336.69	363.39	1.3655	1.0685	7.3370	188.14	1.0385	undefined	undefined	vapor
303.92	64.136	241.57	0.0041397	336.16	362.71	1.3629	1.0710	7.5839	187.91	1.0330	undefined	undefined	vapor
304.12	64.426	244.12	0.0040964	335.62	362.01	1.3602	1.0734	7.8501	187.67	1.0273	undefined	undefined	vapor
304.33	64.717	246.74	0.0040529	335.05	361.28	1.3574	1.0760	8.1376	187.43	1.0214	undefined	undefined	vapor
304.54	65.010	249.44	0.0040090	334.47	360.54	1.3546	1.0786	8.4494	187.20	1.0154	undefined	undefined	vapor
304.75	65.303	252.22	0.0039647	333.87	359.76	1.3516	1.0812	8.7886	186.95	1.0092	undefined	undefined	vapor
304.95	65.598	255.10	0.0039201	333.25	358.97	1.3486	1.0839	9.1589	186.71	1.0029	undefined	undefined	vapor
305.16	65.894	258.06	0.0038750	332.60	358.14	1.3456	1.0867	9.5650	186.46	0.99630	undefined	undefined	vapor
305.37	66.191	261.14	0.0038294	331.93	357.28	1.3424	1.0895	10.012	186.22	0.98952	undefined	undefined	vapor
305.58	66.490	264.32	0.0037833	331.23	356.39	1.3391	1.0924	10.507	185.96	0.98251	undefined	undefined	vapor
305.78	66.790	267.63	0.0037365	330.51	355.46	1.3357	1.0954	11.058	185.71	0.97524	undefined	undefined	vapor
305.99	67.091	271.07	0.0036891	329.75	354.50	1.3322	1.0984	11.674	185.45	0.96770	undefined	undefined	vapor
306.20	67.394	274.66	0.0036409	328.95	353.49	1.3285	1.1016	12.369	185.19	0.95985	undefined	undefined	vapor
306.41	67.697	278.42	0.0035917	328.11	352.43	1.3247	1.1048	13.158	184.93	0.95167	undefined	undefined	vapor
306.61	68.003	282.36	0.0035416	327.23	351.32	1.3207	1.1081	14.063	184.66	0.94311	undefined	undefined	vapor
306.82	68.309	286.50	0.0034904	326.31	350.15	1.3165	1.1115	15.109	184.39	0.93414	undefined	undefined	vapor
307.03	68.618	290.88	0.0034378	325.32	348.91	1.3122	1.1151	16.334	184.11	0.92469	undefined	undefined	vapor
307.24	68.927	295.54	0.0033837	324.27	347.59	1.3075	1.1187	17.787	183.83	0.91471	undefined	undefined	vapor
307.44	69.238	300.50	0.0033277	323.15	346.19	1.3026	1.1225	19.538	183.55	0.90411	undefined	undefined	vapor
307.65	69.551	305.84	0.0032697	321.94	344.68	1.2974	1.1265	21.690	183.26	0.89278	undefined	undefined	vapor
307.86	69.865	311.62	0.0032090	320.63	343.04	1.2917	1.1306	24.396	182.97	0.88060	undefined	undefined	vapor
308.07	70.181	317.95	0.0031451	319.18	341.26	1.2856	1.1349	27.902	182.67	0.86737	undefined	undefined	vapor
308.27	70.499	324.97	0.0030772	317.58	339.28	1.2789	1.1394	32.620	182.36	0.85284	undefined	undefined	vapor
308.48	70.818	332.89	0.0030040	315.78	337.05	1.2713	1.1441	39.303	182.05	0.83664	undefined	undefined	vapor
308.69	71.139	342.05	0.0029236	313.69	334.49	1.2627	1.1490	49.477	181.74	0.81818	undefined	undefined	vapor
308.90	71.463	353.05	0.0028325	311.18	331.43	1.2525	1.1542	66.775	181.43	0.79643	undefined	undefined	vapor
309.10	71.788	367.13	0.0027239	307.99	327.55	1.2396	1.1594	102.35	181.14	0.76935	undefined	undefined	vapor
309.31	72.116	387.69	0.0025794	303.39	321.99	1.2214	1.1642	213.73	180.98	0.73144	undefined	undefined	vapor
309.52	72.447	452.01	0.0022123	289.57	305.60	1.1682	undefined	undefined	undefined	0.62530	undefined	undefined	vapor