(footprint "LM2587" (version 20211014) (generator pcbnew)
  (layer "F.Cu")
  (tedit 638E4BF2)
  (attr smd)
  (fp_text reference "REF**" (at 0 -0.9 unlocked) (layer "F.SilkS")
    (effects (font (size 1 1) (thickness 0.15)))
    (tstamp f63edaf9-6b1f-4482-bf23-9bb790b54e0f)
  )
  (fp_text value "LM2587" (at 0 0.6 unlocked) (layer "F.Fab")
    (effects (font (size 1 1) (thickness 0.15)))
    (tstamp 3762868c-1c09-491e-85d7-99f92159ae69)
  )
  (fp_text user "${REFERENCE}" (at 0.15 -21.25 unlocked) (layer "F.Fab")
    (effects (font (size 1 1) (thickness 0.15)))
    (tstamp 5c6e310f-2307-45be-b549-b61292ad70d7)
  )
  (fp_line (start -26.5 -19) (end -26.5 19) (layer "F.SilkS") (width 0.12) (tstamp 30dbb8a1-8117-428b-9603-593e1cd6f0b8))
  (fp_line (start 26.5 19) (end 26.5 -19) (layer "F.SilkS") (width 0.12) (tstamp 923cb571-19be-4be6-8532-02c9d244b0d5))
  (fp_line (start -26.5 19) (end 26.5 19) (layer "F.SilkS") (width 0.12) (tstamp bbc240bd-1c05-40bf-ae3d-d9774793f790))
  (fp_line (start -26.5 -19) (end 26.5 -19) (layer "F.SilkS") (width 0.12) (tstamp d87ba029-b853-429f-a59f-50cf96e23820))
)
