(footprint "SOP65P640X120-17N" (version 20211014) (generator pcbnew)
  (layer "F.Cu")
  (tedit 0)
  (descr "PWP0016J")
  (tags "Integrated Circuit")
  (attr smd)
  (fp_text reference "IC**" (at 0 0) (layer "F.SilkS")
    (effects (font (size 1.27 1.27) (thickness 0.254)))
    (tstamp b3d89762-54ee-4dc0-8c86-98a5d2a2dca5)
  )
  (fp_text value "SOP65P640X120-17N" (at 0 0) (layer "F.SilkS") hide
    (effects (font (size 1.27 1.27) (thickness 0.254)))
    (tstamp 55dcb42c-b26a-49b8-8a1f-cc80851d2e4d)
  )
  (fp_text user "${REFERENCE}" (at 0 0) (layer "F.Fab")
    (effects (font (size 1.27 1.27) (thickness 0.254)))
    (tstamp 05bdee95-c42e-4b6f-9645-2ec41619b2fe)
  )
  (fp_line (start -3.675 -2.85) (end -2.2 -2.85) (layer "F.SilkS") (width 0.2) (tstamp 36786f1c-5181-4b16-85f0-7a9b5e48989f))
  (fp_line (start 3.925 -2.8) (end 3.925 2.8) (layer "F.CrtYd") (width 0.05) (tstamp 0b2da3ef-2445-490e-b668-8ae41309ee36))
  (fp_line (start -3.925 2.8) (end -3.925 -2.8) (layer "F.CrtYd") (width 0.05) (tstamp 10a5cee8-0f6f-4aac-80c1-915f5fcf52f0))
  (fp_line (start -3.925 -2.8) (end 3.925 -2.8) (layer "F.CrtYd") (width 0.05) (tstamp 15fcf661-f7ee-4981-92aa-29fa30316a60))
  (fp_line (start 3.925 2.8) (end -3.925 2.8) (layer "F.CrtYd") (width 0.05) (tstamp c2288b71-0313-4831-b20b-64c01771a6a6))
  (fp_line (start 2.2 -2.5) (end 2.2 2.5) (layer "F.Fab") (width 0.1) (tstamp 0afa5357-c57e-42cd-b476-72d99f39fe9f))
  (fp_line (start -2.2 2.5) (end -2.2 -2.5) (layer "F.Fab") (width 0.1) (tstamp 2652ca87-c786-4061-81b7-9315b84b5d2c))
  (fp_line (start -2.2 -1.85) (end -1.55 -2.5) (layer "F.Fab") (width 0.1) (tstamp 3a13a33d-0399-4bf3-800a-72a2421cb176))
  (fp_line (start -2.2 -2.5) (end 2.2 -2.5) (layer "F.Fab") (width 0.1) (tstamp f138c51d-0ee0-424a-a154-6e86a60a846b))
  (fp_line (start 2.2 2.5) (end -2.2 2.5) (layer "F.Fab") (width 0.1) (tstamp f8deac2f-522c-4605-b44f-70351a68e5b0))
  (pad "1" smd rect (at -2.938 -2.275 90) (size 0.45 1.475) (layers "F.Cu" "F.Paste" "F.Mask") (tstamp 5e27c7e3-130d-477a-b693-9d7d6d05e3e3))
  (pad "2" smd rect (at -2.938 -1.625 90) (size 0.45 1.475) (layers "F.Cu" "F.Paste" "F.Mask") (tstamp c50a4250-2225-4797-b4a1-1bc3d1138c0f))
  (pad "3" smd rect (at -2.938 -0.975 90) (size 0.45 1.475) (layers "F.Cu" "F.Paste" "F.Mask") (tstamp 11d75bf4-5480-4a2f-baa3-58a51cac0470))
  (pad "4" smd rect (at -2.938 -0.325 90) (size 0.45 1.475) (layers "F.Cu" "F.Paste" "F.Mask") (tstamp 0fe73d7c-983e-4368-b1af-2c7091659c0b))
  (pad "5" smd rect (at -2.938 0.325 90) (size 0.45 1.475) (layers "F.Cu" "F.Paste" "F.Mask") (tstamp 05bcb62f-e639-408b-893f-71715cd8f94a))
  (pad "6" smd rect (at -2.938 0.975 90) (size 0.45 1.475) (layers "F.Cu" "F.Paste" "F.Mask") (tstamp 446bf57c-8a66-4199-8c1c-73dc66bbce20))
  (pad "7" smd rect (at -2.938 1.625 90) (size 0.45 1.475) (layers "F.Cu" "F.Paste" "F.Mask") (tstamp e8a669b7-c663-4fa5-9b1f-ce9eb01dc726))
  (pad "8" smd rect (at -2.938 2.275 90) (size 0.45 1.475) (layers "F.Cu" "F.Paste" "F.Mask") (tstamp b867fb16-61a5-4031-9766-9c1c9e8171a2))
  (pad "9" smd rect (at 2.938 2.275 90) (size 0.45 1.475) (layers "F.Cu" "F.Paste" "F.Mask") (tstamp c1d15993-12e6-4c0d-a72e-2f76d98a62f2))
  (pad "10" smd rect (at 2.938 1.625 90) (size 0.45 1.475) (layers "F.Cu" "F.Paste" "F.Mask") (tstamp 4b91a28b-e778-4691-8d2b-bb09bc10e8e8))
  (pad "11" smd rect (at 2.938 0.975 90) (size 0.45 1.475) (layers "F.Cu" "F.Paste" "F.Mask") (tstamp 52194c94-e7df-49ff-beb1-04a1b4f2344e))
  (pad "12" smd rect (at 2.938 0.325 90) (size 0.45 1.475) (layers "F.Cu" "F.Paste" "F.Mask") (tstamp ac975f7b-5c1b-42e6-a54b-1829692bd60c))
  (pad "13" smd rect (at 2.938 -0.325 90) (size 0.45 1.475) (layers "F.Cu" "F.Paste" "F.Mask") (tstamp 6af91ec1-f5c6-4c49-998d-22cb7b1bdc03))
  (pad "14" smd rect (at 2.938 -0.975 90) (size 0.45 1.475) (layers "F.Cu" "F.Paste" "F.Mask") (tstamp e92c974a-b07f-4799-a79e-f281f85dbc1a))
  (pad "15" smd rect (at 2.938 -1.625 90) (size 0.45 1.475) (layers "F.Cu" "F.Paste" "F.Mask") (tstamp 9d12ed3c-0713-4da7-86c7-5331347f3457))
  (pad "16" smd rect (at 2.938 -2.275 90) (size 0.45 1.475) (layers "F.Cu" "F.Paste" "F.Mask") (tstamp aac506cf-4156-47e4-9980-1111a3bb6bcc))
  (pad "17" smd rect (at 0 0) (size 2.46 3.55) (layers "F.Cu" "F.Paste" "F.Mask") (tstamp df0a2432-7a90-46bd-b54d-8bf995c9c0f2))
  (model "DRV8803PWP.stp"
    (offset (xyz 0 0 0))
    (scale (xyz 1 1 1))
    (rotate (xyz 0 0 0))
  )
)
