(footprint "90131112" (version 20211014) (generator pcbnew)
  (layer "F.Cu")
  (tedit 0)
  (descr "90130-1112")
  (tags "Connector")
  (attr through_hole)
  (fp_text reference "J**" (at 0 0) (layer "F.SilkS")
    (effects (font (size 1.27 1.27) (thickness 0.254)))
    (tstamp 39597e81-f70e-461a-8b54-a3cbec89ae00)
  )
  (fp_text value "90131112" (at 0 0) (layer "F.SilkS") hide
    (effects (font (size 1.27 1.27) (thickness 0.254)))
    (tstamp d4e95aa0-57e4-47b6-a6b2-4749d2491cdb)
  )
  (fp_text user "${REFERENCE}" (at 0 0) (layer "F.Fab")
    (effects (font (size 1.27 1.27) (thickness 0.254)))
    (tstamp 790a19b0-516d-4651-b0b4-2f431397247f)
  )
  (fp_line (start 15.34 -3.605) (end 15.34 6.445) (layer "F.SilkS") (width 0.2) (tstamp 250c8859-53d9-4b16-9e33-bcef2d0d08db))
  (fp_line (start 15.34 6.445) (end -2.44 6.445) (layer "F.SilkS") (width 0.2) (tstamp a2e977b9-6800-45b4-ae87-35d4429567ec))
  (fp_line (start -2.44 6.445) (end -2.44 0) (layer "F.SilkS") (width 0.2) (tstamp ecb1077d-c343-42c9-9672-52914a1f9f16))
  (fp_line (start 0 -3.605) (end 15.34 -3.605) (layer "F.SilkS") (width 0.2) (tstamp f9f8e3b3-1388-4946-813f-1a5d5e0d1869))
  (fp_line (start -2.69 6.695) (end -2.69 -3.855) (layer "F.CrtYd") (width 0.05) (tstamp 1a32102d-4d08-4a90-b777-29f41d092d6c))
  (fp_line (start -2.69 -3.855) (end 15.59 -3.855) (layer "F.CrtYd") (width 0.05) (tstamp 86337d21-21ff-41d9-b410-84c294e6d4c7))
  (fp_line (start 15.59 6.695) (end -2.69 6.695) (layer "F.CrtYd") (width 0.05) (tstamp b19b6cb2-1dcd-4bd7-9b24-4b717ad5e944))
  (fp_line (start 15.59 -3.855) (end 15.59 6.695) (layer "F.CrtYd") (width 0.05) (tstamp be3c23a4-c711-4e7e-b832-1f8432ee1a89))
  (fp_line (start 15.34 -3.605) (end 15.34 6.445) (layer "F.Fab") (width 0.1) (tstamp 4717d0fe-4403-41d8-b34e-f32ad0c89ac4))
  (fp_line (start -2.44 -3.605) (end 15.34 -3.605) (layer "F.Fab") (width 0.1) (tstamp 57827e05-5bc2-4fd8-89d5-a292512dab24))
  (fp_line (start 15.34 6.445) (end -2.44 6.445) (layer "F.Fab") (width 0.1) (tstamp 73265981-a663-420e-888a-cc68bcfa91fd))
  (fp_line (start -2.44 6.445) (end -2.44 -3.605) (layer "F.Fab") (width 0.1) (tstamp ca732df0-841c-46b2-96b9-d77d13584bfd))
  (pad "1" thru_hole rect (at 0 0) (size 1.65 1.65) (drill 1.1) (layers *.Cu *.Mask) (tstamp 502baeba-5eb0-4abb-aa89-c5aa74a6ea7f))
  (pad "2" thru_hole circle (at 0 2.54) (size 1.65 1.65) (drill 1.1) (layers *.Cu *.Mask) (tstamp 561ecb3f-ead7-4771-b6c0-d34cd21c92d3))
  (pad "3" thru_hole circle (at 2.54 0) (size 1.65 1.65) (drill 1.1) (layers *.Cu *.Mask) (tstamp a1ebed7a-a9d4-44c5-815d-29f5bd7a1e04))
  (pad "4" thru_hole circle (at 2.54 2.54) (size 1.65 1.65) (drill 1.1) (layers *.Cu *.Mask) (tstamp b5647ba5-029c-4236-bd62-3bae1d163b2c))
  (pad "5" thru_hole circle (at 5.08 0) (size 1.65 1.65) (drill 1.1) (layers *.Cu *.Mask) (tstamp 9f9e43f1-b8a6-44c2-ac1e-7dffea579c90))
  (pad "6" thru_hole circle (at 5.08 2.54) (size 1.65 1.65) (drill 1.1) (layers *.Cu *.Mask) (tstamp d79bf46a-b22c-4b45-aae3-08c4a2e809dd))
  (pad "7" thru_hole circle (at 7.62 0) (size 1.65 1.65) (drill 1.1) (layers *.Cu *.Mask) (tstamp b8207972-6e65-4219-8942-8eacaca882e0))
  (pad "8" thru_hole circle (at 7.62 2.54) (size 1.65 1.65) (drill 1.1) (layers *.Cu *.Mask) (tstamp 6fb83118-ad28-42d7-96d2-7cafd7b0e464))
  (pad "9" thru_hole circle (at 10.16 0) (size 1.65 1.65) (drill 1.1) (layers *.Cu *.Mask) (tstamp 6241da48-a043-44e0-a826-013c06f564e0))
  (pad "10" thru_hole circle (at 10.16 2.54) (size 1.65 1.65) (drill 1.1) (layers *.Cu *.Mask) (tstamp f2be5d42-df5c-4a4a-8834-2bf8607644b3))
  (pad "11" thru_hole circle (at 12.7 0) (size 1.65 1.65) (drill 1.1) (layers *.Cu *.Mask) (tstamp 90fa28c9-f9fd-49f1-8866-c2b4919ee438))
  (pad "12" thru_hole circle (at 12.7 2.54) (size 1.65 1.65) (drill 1.1) (layers *.Cu *.Mask) (tstamp 7f9079fb-4bb5-49c4-a614-f2b01b46359a))
  (model "90130-1112.stp"
    (offset (xyz 6.360000038 -1.289999942 5.349999824))
    (scale (xyz 1 1 1))
    (rotate (xyz -90 0 0))
  )
)
