EESchema Schematic File Version 4
EELAYER 30 0
EELAYER END
$Descr A4 11693 8268
encoding utf-8
Sheet 8 8
Title ""
Date ""
Rev ""
Comp ""
Comment1 ""
Comment2 ""
Comment3 ""
Comment4 ""
$EndDescr
$Comp
L Device:R_Small R?
U 1 1 606BC4B1
P 4235 4367
AR Path="/606BC4B1" Ref="R?"  Part="1" 
AR Path="/606B9024/606BC4B1" Ref="R19"  Part="1" 
AR Path="/6088E838/606BC4B1" Ref="R?"  Part="1" 
AR Path="/608B4A3E/606BC4B1" Ref="R17"  Part="1" 
AR Path="/607250D5/606BC4B1" Ref="R?"  Part="1" 
AR Path="/607DB3A8/606BC4B1" Ref="R14"  Part="1" 
F 0 "R14" V 4039 4367 50  0000 C CNN
F 1 "1K" V 4130 4367 50  0000 C CNN
F 2 "Resistor_SMD:R_0603_1608Metric" H 4235 4367 50  0001 C CNN
F 3 "~" H 4235 4367 50  0001 C CNN
	1    4235 4367
	0    1    1    0   
$EndComp
$Comp
L Device:R_Small R?
U 1 1 606BC4B7
P 7261 3578
AR Path="/606BC4B7" Ref="R?"  Part="1" 
AR Path="/606B9024/606BC4B7" Ref="R29"  Part="1" 
AR Path="/6088E838/606BC4B7" Ref="R?"  Part="1" 
AR Path="/608B4A3E/606BC4B7" Ref="R31"  Part="1" 
AR Path="/607250D5/606BC4B7" Ref="R?"  Part="1" 
AR Path="/607DB3A8/606BC4B7" Ref="R15"  Part="1" 
F 0 "R15" V 7065 3578 50  0000 C CNN
F 1 "1K" V 7156 3578 50  0000 C CNN
F 2 "Resistor_SMD:R_0603_1608Metric" H 7261 3578 50  0001 C CNN
F 3 "~" H 7261 3578 50  0001 C CNN
	1    7261 3578
	0    1    1    0   
$EndComp
$Comp
L Device:R_Small R?
U 1 1 606BC4BD
P 7261 4404
AR Path="/606BC4BD" Ref="R?"  Part="1" 
AR Path="/606B9024/606BC4BD" Ref="R30"  Part="1" 
AR Path="/6088E838/606BC4BD" Ref="R?"  Part="1" 
AR Path="/608B4A3E/606BC4BD" Ref="R32"  Part="1" 
AR Path="/607250D5/606BC4BD" Ref="R?"  Part="1" 
AR Path="/607DB3A8/606BC4BD" Ref="R20"  Part="1" 
F 0 "R20" V 7065 4404 50  0000 C CNN
F 1 "1K" V 7156 4404 50  0000 C CNN
F 2 "Resistor_SMD:R_0603_1608Metric" H 7261 4404 50  0001 C CNN
F 3 "~" H 7261 4404 50  0001 C CNN
	1    7261 4404
	0    1    1    0   
$EndComp
$Comp
L power:GND #PWR?
U 1 1 606BC4C3
P 5757 4712
AR Path="/606BC4C3" Ref="#PWR?"  Part="1" 
AR Path="/606B9024/606BC4C3" Ref="#PWR0138"  Part="1" 
AR Path="/6088E838/606BC4C3" Ref="#PWR0135"  Part="1" 
AR Path="/608B4A3E/606BC4C3" Ref="#PWR0137"  Part="1" 
AR Path="/607250D5/606BC4C3" Ref="#PWR?"  Part="1" 
AR Path="/607DB3A8/606BC4C3" Ref="#PWR0101"  Part="1" 
F 0 "#PWR0101" H 5757 4462 50  0001 C CNN
F 1 "GND" H 5762 4539 50  0000 C CNN
F 2 "" H 5757 4712 50  0001 C CNN
F 3 "" H 5757 4712 50  0001 C CNN
	1    5757 4712
	1    0    0    -1  
$EndComp
$Comp
L Device:R_Small R?
U 1 1 606BC4CF
P 4222 3616
AR Path="/606BC4CF" Ref="R?"  Part="1" 
AR Path="/606B9024/606BC4CF" Ref="R18"  Part="1" 
AR Path="/6088E838/606BC4CF" Ref="R?"  Part="1" 
AR Path="/608B4A3E/606BC4CF" Ref="R16"  Part="1" 
AR Path="/607250D5/606BC4CF" Ref="R?"  Part="1" 
AR Path="/607DB3A8/606BC4CF" Ref="R4"  Part="1" 
F 0 "R4" V 4026 3616 50  0000 C CNN
F 1 "1K" V 4117 3616 50  0000 C CNN
F 2 "Resistor_SMD:R_0603_1608Metric" H 4222 3616 50  0001 C CNN
F 3 "~" H 4222 3616 50  0001 C CNN
	1    4222 3616
	0    1    1    0   
$EndComp
Wire Wire Line
	4545 3616 4322 3616
Wire Wire Line
	4545 4367 4335 4367
Wire Wire Line
	6905 3578 7161 3578
Wire Wire Line
	6905 4404 7161 4404
Wire Wire Line
	5757 4604 5757 4712
Connection ~ 5757 4604
Wire Wire Line
	5711 3301 5711 3378
Wire Wire Line
	4845 4604 4845 4567
$Comp
L power:+5V #PWR0135
U 1 1 608BFC16
P 5711 3301
AR Path="/606B9024/608BFC16" Ref="#PWR0135"  Part="1" 
AR Path="/608B4A3E/608BFC16" Ref="#PWR0140"  Part="1" 
AR Path="/607250D5/608BFC16" Ref="#PWR?"  Part="1" 
AR Path="/607DB3A8/608BFC16" Ref="#PWR0102"  Part="1" 
F 0 "#PWR0102" H 5711 3151 50  0001 C CNN
F 1 "+5V" H 5726 3474 50  0000 C CNN
F 2 "" H 5711 3301 50  0001 C CNN
F 3 "" H 5711 3301 50  0001 C CNN
	1    5711 3301
	1    0    0    -1  
$EndComp
Wire Wire Line
	4845 3378 4845 3416
$Comp
L Transistor_FET:C2M0025120D Q11
U 1 1 6092BFA3
P 4745 4367
AR Path="/608B4A3E/6092BFA3" Ref="Q11"  Part="1" 
AR Path="/606B9024/6092BFA3" Ref="Q5"  Part="1" 
AR Path="/607250D5/6092BFA3" Ref="Q?"  Part="1" 
AR Path="/607DB3A8/6092BFA3" Ref="Q14"  Part="1" 
F 0 "Q14" H 4949 4413 50  0000 L CNN
F 1 "C2M0025120D" H 4949 4322 50  0000 L CNN
F 2 "Package_TO_SOT_THT:TO-247-3_Vertical" H 4745 4367 50  0001 C CIN
F 3 "https://www.wolfspeed.com/media/downloads/161/C2M0025120D.pdf" H 4745 4367 50  0001 L CNN
	1    4745 4367
	1    0    0    -1  
$EndComp
$Comp
L Transistor_FET:C2M0025120D Q13
U 1 1 60930FD4
P 6705 4404
AR Path="/608B4A3E/60930FD4" Ref="Q13"  Part="1" 
AR Path="/606B9024/60930FD4" Ref="Q9"  Part="1" 
AR Path="/607250D5/60930FD4" Ref="Q?"  Part="1" 
AR Path="/607DB3A8/60930FD4" Ref="Q16"  Part="1" 
F 0 "Q16" H 6910 4450 50  0000 L CNN
F 1 "C2M0025120D" H 6910 4359 50  0000 L CNN
F 2 "Package_TO_SOT_THT:TO-247-3_Vertical" H 6705 4404 50  0001 C CIN
F 3 "https://www.wolfspeed.com/media/downloads/161/C2M0025120D.pdf" H 6705 4404 50  0001 L CNN
	1    6705 4404
	-1   0    0    -1  
$EndComp
$Comp
L Transistor_FET:FQP27P06 Q12
U 1 1 6093E5ED
P 6705 3578
AR Path="/608B4A3E/6093E5ED" Ref="Q12"  Part="1" 
AR Path="/606B9024/6093E5ED" Ref="Q7"  Part="1" 
AR Path="/607250D5/6093E5ED" Ref="Q?"  Part="1" 
AR Path="/607DB3A8/6093E5ED" Ref="Q15"  Part="1" 
F 0 "Q15" H 6910 3532 50  0000 L CNN
F 1 "FQP27P06" H 6910 3623 50  0000 L CNN
F 2 "Package_TO_SOT_THT:TO-220-3_Vertical" H 6905 3503 50  0001 L CIN
F 3 "https://www.onsemi.com/pub/Collateral/FQP27P06-D.PDF" H 6705 3578 50  0001 L CNN
	1    6705 3578
	-1   0    0    1   
$EndComp
$Comp
L Transistor_FET:FQP27P06 Q10
U 1 1 6094355B
P 4745 3616
AR Path="/608B4A3E/6094355B" Ref="Q10"  Part="1" 
AR Path="/606B9024/6094355B" Ref="Q2"  Part="1" 
AR Path="/607250D5/6094355B" Ref="Q?"  Part="1" 
AR Path="/607DB3A8/6094355B" Ref="Q3"  Part="1" 
F 0 "Q3" H 4949 3570 50  0000 L CNN
F 1 "FQP27P06" H 4949 3661 50  0000 L CNN
F 2 "Package_TO_SOT_THT:TO-220-3_Vertical" H 4945 3541 50  0001 L CIN
F 3 "https://www.onsemi.com/pub/Collateral/FQP27P06-D.PDF" H 4745 3616 50  0001 L CNN
	1    4745 3616
	1    0    0    1   
$EndComp
Wire Wire Line
	3552 3616 4122 3616
Wire Wire Line
	7361 3578 8022 3578
Wire Wire Line
	3552 4367 4135 4367
Wire Wire Line
	3552 3616 3552 3942
Wire Wire Line
	3552 3942 3225 3942
Wire Wire Line
	3225 3942 3225 3941
Connection ~ 3552 3942
Wire Wire Line
	3552 3942 3552 4367
Text HLabel 3225 3941 0    50   Input ~ 0
LEFT2
Wire Wire Line
	8022 3578 8022 3965
Wire Wire Line
	7361 4404 8022 4404
Wire Wire Line
	8022 3965 8187 3965
Connection ~ 8022 3965
Wire Wire Line
	8022 3965 8022 4404
Text HLabel 8187 3965 2    50   Input ~ 0
RIGHT2
Connection ~ 5711 3378
Wire Wire Line
	4845 3378 5711 3378
Wire Wire Line
	5711 3378 6605 3378
Wire Wire Line
	5757 4604 6605 4604
Wire Wire Line
	4845 4604 5757 4604
Wire Wire Line
	4845 3816 4845 3984
Wire Wire Line
	4845 3984 4845 4167
Connection ~ 4845 3984
Wire Wire Line
	6605 3983 6605 4204
Wire Wire Line
	6605 3778 6605 3983
Connection ~ 6605 3983
Wire Wire Line
	5810 3983 6605 3983
$Comp
L Connector:Conn_01x02_Male J2
U 1 1 608A665C
P 5710 3783
AR Path="/606B9024/608A665C" Ref="J2"  Part="1" 
AR Path="/6088E838/608A665C" Ref="J2"  Part="1" 
AR Path="/608B4A3E/608A665C" Ref="J4"  Part="1" 
AR Path="/607250D5/608A665C" Ref="J?"  Part="1" 
AR Path="/607DB3A8/608A665C" Ref="J3"  Part="1" 
F 0 "J3" V 5772 3595 50  0000 R CNN
F 1 "Conn_01x02_Male" V 5863 3595 50  0000 R CNN
F 2 "Connector_PinHeader_1.27mm:PinHeader_1x02_P1.27mm_Vertical" H 5710 3783 50  0001 C CNN
F 3 "~" H 5710 3783 50  0001 C CNN
	1    5710 3783
	0    -1   1    0   
$EndComp
Wire Wire Line
	5710 3984 5710 3983
Wire Wire Line
	4845 3984 5710 3984
$EndSCHEMATC
