(module PQ_with_20_Pin_conn (layer F.Cu) (tedit 60A46E34)
  (fp_text reference REF** (at 0.254 -19.812) (layer F.SilkS)
    (effects (font (size 1 1) (thickness 0.15)))
  )
  (fp_text value PQ_with_20_Pin_conn (at 0 25.4) (layer F.Fab)
    (effects (font (size 1 1) (thickness 0.15)))
  )
  (fp_line (start -18.528 -5.7461) (end -16.468 -5.7461) (layer F.SilkS) (width 0.12))
  (fp_line (start -18.968 -8.2461) (end -18.968 12.7539) (layer F.CrtYd) (width 0.05))
  (fp_line (start -13.968 12.7539) (end -13.968 -8.2461) (layer F.CrtYd) (width 0.05))
  (fp_line (start -14.468 12.2539) (end -18.468 12.2539) (layer F.Fab) (width 0.1))
  (fp_line (start -16.468 -5.7461) (end -16.468 -7.8061) (layer F.SilkS) (width 0.12))
  (fp_line (start -18.968 12.7539) (end -13.968 12.7539) (layer F.CrtYd) (width 0.05))
  (fp_line (start -14.468 -7.7461) (end -14.468 12.2539) (layer F.Fab) (width 0.1))
  (fp_line (start -14.408 -7.8061) (end -14.408 12.3139) (layer F.SilkS) (width 0.12))
  (fp_line (start -18.528 -7.8061) (end -17.468 -7.8061) (layer F.SilkS) (width 0.12))
  (fp_line (start -18.528 12.3139) (end -14.408 12.3139) (layer F.SilkS) (width 0.12))
  (fp_line (start -16.468 -7.8061) (end -14.408 -7.8061) (layer F.SilkS) (width 0.12))
  (fp_line (start -18.468 -6.7461) (end -17.468 -7.7461) (layer F.Fab) (width 0.1))
  (fp_line (start -18.468 12.2539) (end -18.468 -6.7461) (layer F.Fab) (width 0.1))
  (fp_line (start -17.468 -7.7461) (end -14.468 -7.7461) (layer F.Fab) (width 0.1))
  (fp_line (start -18.528 -5.7461) (end -18.528 12.3139) (layer F.SilkS) (width 0.12))
  (fp_line (start -13.968 -8.2461) (end -18.968 -8.2461) (layer F.CrtYd) (width 0.05))
  (fp_line (start -18.528 -6.7461) (end -18.528 -7.8061) (layer F.SilkS) (width 0.12))
  (fp_line (start -20.188 23.158) (end 21.812 23.158) (layer F.Fab) (width 0.1))
  (fp_line (start -20.188 -18.842) (end -20.188 23.158) (layer F.Fab) (width 0.1))
  (fp_line (start 21.812 23.158) (end 21.812 -18.842) (layer F.Fab) (width 0.1))
  (fp_line (start 21.812 -18.842) (end -20.188 -18.842) (layer F.Fab) (width 0.1))
  (fp_line (start 18.812 23.158) (end -17.188 23.158) (layer F.SilkS) (width 0.12))
  (fp_line (start -19.188 -12.842) (end -19.188 17.158) (layer F.SilkS) (width 0.12))
  (fp_line (start 21.812 -15.842) (end 21.812 20.158) (layer F.SilkS) (width 0.12))
  (fp_line (start 18.812 -18.842) (end -17.188 -18.842) (layer F.SilkS) (width 0.12))
  (fp_line (start -20.188 20.158) (end -20.188 18.158) (layer F.SilkS) (width 0.12))
  (fp_line (start -20.188 -15.842) (end -20.188 -13.842) (layer F.SilkS) (width 0.12))
  (fp_arc (start -20.188 17.158) (end -19.188 17.158) (angle 90) (layer F.SilkS) (width 0.12))
  (fp_arc (start 18.812 20.158) (end 21.812 20.158) (angle 90) (layer F.SilkS) (width 0.12))
  (fp_arc (start -17.188 20.158) (end -17.188 23.158) (angle 90) (layer F.SilkS) (width 0.12))
  (fp_arc (start -20.188 -12.842) (end -20.188 -13.842) (angle 89.9) (layer F.SilkS) (width 0.12))
  (fp_arc (start 18.812 -15.842) (end 18.812 -18.842) (angle 90) (layer F.SilkS) (width 0.12))
  (fp_arc (start -17.188 -15.842) (end -20.188 -15.842) (angle 90) (layer F.SilkS) (width 0.12))
  (pad "" np_thru_hole circle (at -17.188 -15.842 270) (size 5 5) (drill 2.5) (layers *.Cu *.Mask)
    (solder_mask_margin 0.5))
  (pad "" np_thru_hole circle (at 18.812 -15.842 270) (size 5 5) (drill 2.5) (layers *.Cu *.Mask)
    (solder_mask_margin 0.5))
  (pad "" np_thru_hole circle (at -17.188 20.158 270) (size 5 5) (drill 2.5) (layers *.Cu *.Mask)
    (solder_mask_margin 0.5))
  (pad "" np_thru_hole circle (at 18.812 20.158 270) (size 5 5) (drill 2.5) (layers *.Cu *.Mask)
    (solder_mask_margin 0.5))
  (pad 9 thru_hole oval (at -17.468 1.2539) (size 1.35 1.35) (drill 0.8) (layers *.Cu *.Mask))
  (pad 13 thru_hole oval (at -17.468 5.2539) (size 1.35 1.35) (drill 0.8) (layers *.Cu *.Mask))
  (pad 8 thru_hole oval (at -15.468 -0.7461) (size 1.35 1.35) (drill 0.8) (layers *.Cu *.Mask))
  (pad 3 thru_hole oval (at -17.468 -4.7461) (size 1.35 1.35) (drill 0.8) (layers *.Cu *.Mask))
  (pad 10 thru_hole oval (at -15.468 1.2539) (size 1.35 1.35) (drill 0.8) (layers *.Cu *.Mask))
  (pad 12 thru_hole oval (at -15.468 3.2539) (size 1.35 1.35) (drill 0.8) (layers *.Cu *.Mask))
  (pad 16 thru_hole oval (at -15.468 7.2539) (size 1.35 1.35) (drill 0.8) (layers *.Cu *.Mask))
  (pad 14 thru_hole oval (at -15.468 5.2539) (size 1.35 1.35) (drill 0.8) (layers *.Cu *.Mask))
  (pad 17 thru_hole oval (at -17.468 9.2539) (size 1.35 1.35) (drill 0.8) (layers *.Cu *.Mask))
  (pad 19 thru_hole oval (at -17.468 11.2539) (size 1.35 1.35) (drill 0.8) (layers *.Cu *.Mask))
  (pad 7 thru_hole oval (at -17.468 -0.7461) (size 1.35 1.35) (drill 0.8) (layers *.Cu *.Mask))
  (pad 1 thru_hole rect (at -17.468 -6.7461) (size 1.35 1.35) (drill 0.8) (layers *.Cu *.Mask))
  (pad 15 thru_hole oval (at -17.468 7.2539) (size 1.35 1.35) (drill 0.8) (layers *.Cu *.Mask))
  (pad 20 thru_hole oval (at -15.468 11.2539) (size 1.35 1.35) (drill 0.8) (layers *.Cu *.Mask))
  (pad 2 thru_hole oval (at -15.468 -6.7461) (size 1.35 1.35) (drill 0.8) (layers *.Cu *.Mask))
  (pad 4 thru_hole oval (at -15.468 -4.7461) (size 1.35 1.35) (drill 0.8) (layers *.Cu *.Mask))
  (pad 11 thru_hole oval (at -17.468 3.2539) (size 1.35 1.35) (drill 0.8) (layers *.Cu *.Mask))
  (pad 5 thru_hole oval (at -17.468 -2.7461) (size 1.35 1.35) (drill 0.8) (layers *.Cu *.Mask))
  (pad 6 thru_hole oval (at -15.468 -2.7461) (size 1.35 1.35) (drill 0.8) (layers *.Cu *.Mask))
  (pad 18 thru_hole oval (at -15.468 9.2539) (size 1.35 1.35) (drill 0.8) (layers *.Cu *.Mask))
)
