EESchema Schematic File Version 4
EELAYER 30 0
EELAYER END
$Descr A4 11693 8268
encoding utf-8
Sheet 4 11
Title ""
Date ""
Rev ""
Comp ""
Comment1 ""
Comment2 ""
Comment3 ""
Comment4 ""
$EndDescr
Wire Wire Line
	6602 5196 6602 4846
Wire Wire Line
	5902 5196 6602 5196
Wire Wire Line
	6052 4996 6052 4846
Wire Wire Line
	5902 4996 6052 4996
$Comp
L power:+3.3V #PWR0158
U 1 1 5FF227F3
P 6602 4546
F 0 "#PWR0158" H 6602 4396 50  0001 C CNN
F 1 "+3.3V" H 6617 4719 50  0000 C CNN
F 2 "" H 6602 4546 50  0001 C CNN
F 3 "" H 6602 4546 50  0001 C CNN
	1    6602 4546
	1    0    0    -1  
$EndComp
$Comp
L power:+3.3V #PWR0159
U 1 1 5FF227F9
P 6052 4546
F 0 "#PWR0159" H 6052 4396 50  0001 C CNN
F 1 "+3.3V" H 6067 4719 50  0000 C CNN
F 2 "" H 6052 4546 50  0001 C CNN
F 3 "" H 6052 4546 50  0001 C CNN
	1    6052 4546
	1    0    0    -1  
$EndComp
Wire Wire Line
	6052 4546 6052 4646
Wire Wire Line
	6602 4646 6602 4546
$Comp
L Device:R_Small R25
U 1 1 5FF22801
P 6602 4746
F 0 "R25" H 6661 4792 50  0000 L CNN
F 1 "2k2" H 6661 4701 50  0000 L CNN
F 2 "Resistor_SMD:R_0603_1608Metric" H 6602 4746 50  0001 C CNN
F 3 "~" H 6602 4746 50  0001 C CNN
	1    6602 4746
	1    0    0    -1  
$EndComp
$Comp
L Device:R_Small R26
U 1 1 5FF22807
P 6052 4746
F 0 "R26" H 6111 4792 50  0000 L CNN
F 1 "2k2" H 6111 4701 50  0000 L CNN
F 2 "Resistor_SMD:R_0603_1608Metric" H 6052 4746 50  0001 C CNN
F 3 "~" H 6052 4746 50  0001 C CNN
	1    6052 4746
	1    0    0    -1  
$EndComp
$Comp
L power:GND #PWR0160
U 1 1 5FF2280D
P 9004 3934
F 0 "#PWR0160" H 9004 3684 50  0001 C CNN
F 1 "GND" H 9009 3761 50  0000 C CNN
F 2 "" H 9004 3934 50  0001 C CNN
F 3 "" H 9004 3934 50  0001 C CNN
	1    9004 3934
	1    0    0    -1  
$EndComp
Wire Wire Line
	9004 3834 9004 3934
$Comp
L Device:R_Small R28
U 1 1 5FF22814
P 9004 3734
F 0 "R28" H 9063 3780 50  0000 L CNN
F 1 "1k5" H 9063 3689 50  0000 L CNN
F 2 "Resistor_SMD:R_0603_1608Metric" H 9004 3734 50  0001 C CNN
F 3 "~" H 9004 3734 50  0001 C CNN
	1    9004 3734
	1    0    0    -1  
$EndComp
Wire Wire Line
	9004 3534 9004 3634
Wire Wire Line
	9004 3184 9004 3334
Wire Wire Line
	9054 3184 9004 3184
Text GLabel 9054 3184 2    50   Input ~ 0
LED_STATUS
$Comp
L Device:LED_Small D6
U 1 1 5FF2281E
P 9004 3434
F 0 "D6" V 9050 3364 50  0000 R CNN
F 1 "BLUE" V 8959 3364 50  0000 R CNN
F 2 "LED_SMD:LED_0603_1608Metric_Castellated" V 9004 3434 50  0001 C CNN
F 3 "~" V 9004 3434 50  0001 C CNN
	1    9004 3434
	0    -1   -1   0   
$EndComp
Text Notes 8020 3535 2    50   ~ 0
Cload = 2 * (CL - Cstray)
Connection ~ 6167 3479
Wire Wire Line
	6167 2779 6167 3479
Wire Wire Line
	6167 3879 6167 3979
Wire Wire Line
	6167 3479 6167 3679
Connection ~ 8251 4466
Wire Wire Line
	8251 4366 8251 4466
$Comp
L power:+3.3VA #PWR0161
U 1 1 5FF2282B
P 8251 4366
F 0 "#PWR0161" H 8251 4216 50  0001 C CNN
F 1 "+3.3VA" H 8266 4539 50  0000 C CNN
F 2 "" H 8251 4366 50  0001 C CNN
F 3 "" H 8251 4366 50  0001 C CNN
	1    8251 4366
	1    0    0    -1  
$EndComp
Wire Wire Line
	7901 4816 7901 4716
Connection ~ 7901 4816
Wire Wire Line
	8251 4816 8251 4716
Wire Wire Line
	7901 4816 8251 4816
Wire Wire Line
	7901 4866 7901 4816
$Comp
L power:GND #PWR0162
U 1 1 5FF22836
P 7901 4866
F 0 "#PWR0162" H 7901 4616 50  0001 C CNN
F 1 "GND" H 7906 4693 50  0000 C CNN
F 2 "" H 7901 4866 50  0001 C CNN
F 3 "" H 7901 4866 50  0001 C CNN
	1    7901 4866
	1    0    0    -1  
$EndComp
Wire Wire Line
	7901 4466 8251 4466
Connection ~ 7901 4466
Wire Wire Line
	7901 4466 7901 4516
Wire Wire Line
	8251 4466 8251 4516
Wire Wire Line
	7751 4466 7901 4466
$Comp
L Device:C_Small C21
U 1 1 5FF22841
P 8251 4616
F 0 "C21" H 8343 4662 50  0000 L CNN
F 1 "10n" H 8343 4571 50  0000 L CNN
F 2 "Capacitor_SMD:C_0805_2012Metric" H 8251 4616 50  0001 C CNN
F 3 "~" H 8251 4616 50  0001 C CNN
	1    8251 4616
	1    0    0    -1  
$EndComp
$Comp
L Device:C_Small C22
U 1 1 5FF22847
P 7901 4616
F 0 "C22" H 7993 4662 50  0000 L CNN
F 1 "1u" H 7993 4571 50  0000 L CNN
F 2 "Capacitor_SMD:C_1206_3216Metric" H 7901 4616 50  0001 C CNN
F 3 "~" H 7901 4616 50  0001 C CNN
	1    7901 4616
	1    0    0    -1  
$EndComp
Wire Wire Line
	7351 4466 7551 4466
Wire Wire Line
	7351 4366 7351 4466
$Comp
L power:+3.3V #PWR?
U 1 1 5FF2284F
P 7351 4366
AR Path="/5FF2284F" Ref="#PWR?"  Part="1" 
AR Path="/5FE8E640/5FF2284F" Ref="#PWR0163"  Part="1" 
F 0 "#PWR0163" H 7351 4216 50  0001 C CNN
F 1 "+3.3V" H 7366 4539 50  0000 C CNN
F 2 "" H 7351 4366 50  0001 C CNN
F 3 "" H 7351 4366 50  0001 C CNN
	1    7351 4366
	1    0    0    -1  
$EndComp
$Comp
L Device:L_Small L3
U 1 1 5FF22855
P 7651 4466
F 0 "L3" V 7836 4466 50  0000 C CNN
F 1 "39n" V 7745 4466 50  0000 C CNN
F 2 "Inductor_SMD:L_0402_1005Metric" H 7651 4466 50  0001 C CNN
F 3 "~" H 7651 4466 50  0001 C CNN
	1    7651 4466
	0    -1   -1   0   
$EndComp
Wire Wire Line
	7593 6025 8043 6025
Connection ~ 7593 6025
Wire Wire Line
	7593 5925 7593 6025
Wire Wire Line
	8043 6025 8393 6025
Connection ~ 8043 6025
Wire Wire Line
	8043 5925 8043 6025
Wire Wire Line
	8393 6025 8743 6025
Connection ~ 8393 6025
Wire Wire Line
	8393 5925 8393 6025
Wire Wire Line
	8743 6025 9143 6025
Connection ~ 8743 6025
Wire Wire Line
	8743 6025 8743 5925
Wire Wire Line
	7193 6025 7193 5925
Connection ~ 7193 6025
Wire Wire Line
	9143 6025 9143 5925
Wire Wire Line
	7193 6025 7593 6025
Wire Wire Line
	7193 6075 7193 6064
$Comp
L power:GND #PWR0164
U 1 1 5FF2286C
P 7193 6075
F 0 "#PWR0164" H 7193 5825 50  0001 C CNN
F 1 "GND" H 7198 5902 50  0000 C CNN
F 2 "" H 7193 6075 50  0001 C CNN
F 3 "" H 7193 6075 50  0001 C CNN
	1    7193 6075
	1    0    0    -1  
$EndComp
Connection ~ 8743 5675
Wire Wire Line
	9143 5675 9143 5725
Wire Wire Line
	8743 5675 9143 5675
Connection ~ 8393 5675
Wire Wire Line
	8743 5675 8743 5725
Wire Wire Line
	8393 5675 8743 5675
Connection ~ 8043 5675
Wire Wire Line
	8393 5675 8393 5725
Wire Wire Line
	8043 5675 8393 5675
Connection ~ 7593 5675
Wire Wire Line
	8043 5675 8043 5725
Wire Wire Line
	7593 5675 8043 5675
Wire Wire Line
	7193 5675 7193 5725
Connection ~ 7193 5675
Wire Wire Line
	7593 5675 7593 5725
Wire Wire Line
	7193 5675 7593 5675
Wire Wire Line
	7193 5575 7193 5675
$Comp
L power:+3.3V #PWR0167
U 1 1 5FF22883
P 7193 5575
F 0 "#PWR0167" H 7193 5425 50  0001 C CNN
F 1 "+3.3V" H 7208 5748 50  0000 C CNN
F 2 "" H 7193 5575 50  0001 C CNN
F 3 "" H 7193 5575 50  0001 C CNN
	1    7193 5575
	1    0    0    -1  
$EndComp
Wire Wire Line
	3829 2718 3729 2718
Connection ~ 3529 2718
Wire Wire Line
	3529 2718 3429 2718
Connection ~ 3629 2718
Wire Wire Line
	3629 2718 3529 2718
Connection ~ 3729 2718
Wire Wire Line
	3729 2718 3629 2718
Wire Wire Line
	3429 2568 3429 2718
Connection ~ 3429 2718
Wire Wire Line
	2379 3468 2379 3568
$Comp
L power:GND #PWR0168
U 1 1 5FF22894
P 3529 6418
F 0 "#PWR0168" H 3529 6168 50  0001 C CNN
F 1 "GND" H 3534 6245 50  0000 C CNN
F 2 "" H 3529 6418 50  0001 C CNN
F 3 "" H 3529 6418 50  0001 C CNN
	1    3529 6418
	1    0    0    -1  
$EndComp
Wire Wire Line
	3529 6418 3529 6368
Wire Wire Line
	3529 6418 3629 6418
Wire Wire Line
	3629 6418 3629 6368
Wire Wire Line
	3629 6418 3729 6418
Wire Wire Line
	3729 6418 3729 6368
Connection ~ 3629 6418
Text GLabel 2528 2738 0    50   Input ~ 0
NRESET
Text GLabel 2929 3168 0    50   Input ~ 0
BOOT0
$Comp
L Device:C_Small C11
U 1 1 5FF228A3
P 2379 3668
F 0 "C11" H 2471 3714 50  0000 L CNN
F 1 "2u2" H 2471 3623 50  0000 L CNN
F 2 "Capacitor_SMD:C_0805_2012Metric" H 2379 3668 50  0001 C CNN
F 3 "~" H 2379 3668 50  0001 C CNN
	1    2379 3668
	1    0    0    -1  
$EndComp
Wire Wire Line
	2379 3768 2379 3868
$Comp
L power:GND #PWR0169
U 1 1 5FF228AA
P 2379 3868
F 0 "#PWR0169" H 2379 3618 50  0001 C CNN
F 1 "GND" H 2384 3695 50  0000 C CNN
F 2 "" H 2379 3868 50  0001 C CNN
F 3 "" H 2379 3868 50  0001 C CNN
	1    2379 3868
	1    0    0    -1  
$EndComp
Wire Wire Line
	2079 3368 2307 3368
Text GLabel 2929 4168 0    50   Input ~ 0
HSE_IN
Text GLabel 2929 4268 0    50   Input ~ 0
HSE_OUT
NoConn ~ 4329 3368
NoConn ~ 4329 3468
NoConn ~ 4329 4468
NoConn ~ 4329 4668
NoConn ~ 4329 4768
NoConn ~ 4329 4868
NoConn ~ 4329 5068
NoConn ~ 4329 5168
NoConn ~ 2929 6168
NoConn ~ 2929 6068
NoConn ~ 2929 5968
NoConn ~ 2929 5868
NoConn ~ 2929 5768
NoConn ~ 2929 5668
NoConn ~ 2929 5168
NoConn ~ 2929 5068
NoConn ~ 2929 4768
NoConn ~ 2929 4668
NoConn ~ 2929 4468
$Comp
L Device:C_Small C14
U 1 1 5FF228D7
P 9143 5825
F 0 "C14" H 9235 5871 50  0000 L CNN
F 1 "100n" H 9235 5780 50  0000 L CNN
F 2 "Capacitor_SMD:C_0805_2012Metric" H 9143 5825 50  0001 C CNN
F 3 "~" H 9143 5825 50  0001 C CNN
	1    9143 5825
	1    0    0    -1  
$EndComp
$Comp
L Device:C_Small C15
U 1 1 5FF228DD
P 8743 5825
F 0 "C15" H 8835 5871 50  0000 L CNN
F 1 "100n" H 8835 5780 50  0000 L CNN
F 2 "Capacitor_SMD:C_0805_2012Metric" H 8743 5825 50  0001 C CNN
F 3 "~" H 8743 5825 50  0001 C CNN
	1    8743 5825
	1    0    0    -1  
$EndComp
$Comp
L Device:C_Small C17
U 1 1 5FF228E3
P 8393 5825
F 0 "C17" H 8485 5871 50  0000 L CNN
F 1 "100n" H 8485 5780 50  0000 L CNN
F 2 "Capacitor_SMD:C_0805_2012Metric" H 8393 5825 50  0001 C CNN
F 3 "~" H 8393 5825 50  0001 C CNN
	1    8393 5825
	1    0    0    -1  
$EndComp
$Comp
L Device:C_Small C18
U 1 1 5FF228E9
P 8043 5825
F 0 "C18" H 8135 5871 50  0000 L CNN
F 1 "100n" H 8135 5780 50  0000 L CNN
F 2 "Capacitor_SMD:C_0805_2012Metric" H 8043 5825 50  0001 C CNN
F 3 "~" H 8043 5825 50  0001 C CNN
	1    8043 5825
	1    0    0    -1  
$EndComp
$Comp
L Device:C_Small C19
U 1 1 5FF228EF
P 7593 5825
F 0 "C19" H 7685 5871 50  0000 L CNN
F 1 "100n" H 7685 5780 50  0000 L CNN
F 2 "Capacitor_SMD:C_0805_2012Metric" H 7593 5825 50  0001 C CNN
F 3 "~" H 7593 5825 50  0001 C CNN
	1    7593 5825
	1    0    0    -1  
$EndComp
$Comp
L Device:C_Small C20
U 1 1 5FF228F5
P 7193 5825
F 0 "C20" H 7285 5871 50  0000 L CNN
F 1 "4u7" H 7285 5780 50  0000 L CNN
F 2 "Capacitor_SMD:C_1206_3216Metric" H 7193 5825 50  0001 C CNN
F 3 "~" H 7193 5825 50  0001 C CNN
	1    7193 5825
	1    0    0    -1  
$EndComp
$Comp
L power:GND #PWR0170
U 1 1 5FF228FB
P 2079 3868
F 0 "#PWR0170" H 2079 3618 50  0001 C CNN
F 1 "GND" H 2084 3695 50  0000 C CNN
F 2 "" H 2079 3868 50  0001 C CNN
F 3 "" H 2079 3868 50  0001 C CNN
	1    2079 3868
	1    0    0    -1  
$EndComp
Wire Wire Line
	2079 3768 2079 3868
Wire Wire Line
	2079 3568 2079 3368
$Comp
L Device:C_Small C12
U 1 1 5FF22903
P 2079 3668
F 0 "C12" H 2171 3714 50  0000 L CNN
F 1 "2u2" H 2171 3623 50  0000 L CNN
F 2 "Capacitor_SMD:C_0805_2012Metric" H 2079 3668 50  0001 C CNN
F 3 "~" H 2079 3668 50  0001 C CNN
	1    2079 3668
	1    0    0    -1  
$EndComp
$Comp
L Device:Crystal_GND24_Small Y1
U 1 1 5FF22915
P 6517 3479
F 0 "Y1" H 6661 3525 50  0000 L CNN
F 1 "16MHz" H 6661 3434 50  0000 L CNN
F 2 "Crystal:Crystal_SMD_3225-4Pin_3.2x2.5mm" H 6517 3479 50  0001 C CNN
F 3 "~" H 6517 3479 50  0001 C CNN
	1    6517 3479
	1    0    0    -1  
$EndComp
$Comp
L Device:C_Small C16
U 1 1 5FF2291B
P 6817 3779
F 0 "C16" H 6909 3825 50  0000 L CNN
F 1 "12p" H 6909 3734 50  0000 L CNN
F 2 "Capacitor_SMD:C_0402_1005Metric" H 6817 3779 50  0001 C CNN
F 3 "~" H 6817 3779 50  0001 C CNN
	1    6817 3779
	1    0    0    -1  
$EndComp
$Comp
L Device:C_Small C13
U 1 1 5FF22921
P 6167 3779
F 0 "C13" H 6259 3825 50  0000 L CNN
F 1 "12p" H 6259 3734 50  0000 L CNN
F 2 "Capacitor_SMD:C_0402_1005Metric" H 6167 3779 50  0001 C CNN
F 3 "~" H 6167 3779 50  0001 C CNN
	1    6167 3779
	1    0    0    -1  
$EndComp
Wire Wire Line
	6617 3479 6817 3479
Wire Wire Line
	6817 3479 6817 3679
Wire Wire Line
	6417 3479 6167 3479
$Comp
L power:GND #PWR0173
U 1 1 5FF2292A
P 6517 3979
F 0 "#PWR0173" H 6517 3729 50  0001 C CNN
F 1 "GND" H 6522 3806 50  0000 C CNN
F 2 "" H 6517 3979 50  0001 C CNN
F 3 "" H 6517 3979 50  0001 C CNN
	1    6517 3979
	1    0    0    -1  
$EndComp
Wire Wire Line
	6817 3879 6817 3979
Wire Wire Line
	6817 3979 6517 3979
Wire Wire Line
	6167 3979 6517 3979
Connection ~ 6517 3979
Wire Wire Line
	6517 3579 6517 3629
Wire Wire Line
	6517 3379 6517 3229
Wire Wire Line
	6517 3229 6667 3229
Wire Wire Line
	6667 3229 6667 3629
Wire Wire Line
	6667 3629 6517 3629
Connection ~ 6517 3629
Wire Wire Line
	6517 3629 6517 3979
$Comp
L Device:R_Small R27
U 1 1 5FF2293B
P 6817 3129
F 0 "R27" H 6876 3175 50  0000 L CNN
F 1 "47" H 6876 3084 50  0000 L CNN
F 2 "Resistor_SMD:R_0402_1005Metric" H 6817 3129 50  0001 C CNN
F 3 "~" H 6817 3129 50  0001 C CNN
	1    6817 3129
	1    0    0    -1  
$EndComp
Wire Wire Line
	6817 3229 6817 3479
Connection ~ 6817 3479
Text GLabel 6967 2779 2    50   Input ~ 0
HSE_IN
Text GLabel 7017 2979 2    50   Input ~ 0
HSE_OUT
Wire Wire Line
	7017 2979 6817 2979
Wire Wire Line
	6817 2979 6817 3029
Wire Wire Line
	6967 2779 6167 2779
Wire Wire Line
	3829 2768 3829 2718
Wire Wire Line
	3729 2768 3729 2718
Wire Wire Line
	3629 2768 3629 2718
Wire Wire Line
	3529 2768 3529 2718
Wire Wire Line
	3429 2718 3429 2768
$Comp
L power:PWR_FLAG #FLG0105
U 1 1 5FE9DF42
P 3929 2568
F 0 "#FLG0105" H 3929 2643 50  0001 C CNN
F 1 "PWR_FLAG" V 3929 2695 50  0000 L CNN
F 2 "" H 3929 2568 50  0001 C CNN
F 3 "~" H 3929 2568 50  0001 C CNN
	1    3929 2568
	0    1    1    0   
$EndComp
NoConn ~ 2929 4968
NoConn ~ 2929 4868
$Comp
L power:PWR_FLAG #FLG0104
U 1 1 5FECA4D0
P 2825 3535
F 0 "#FLG0104" H 2825 3610 50  0001 C CNN
F 1 "PWR_FLAG" H 2825 3708 50  0000 C CNN
F 2 "" H 2825 3535 50  0001 C CNN
F 3 "~" H 2825 3535 50  0001 C CNN
	1    2825 3535
	-1   0    0    1   
$EndComp
$Comp
L power:PWR_FLAG #FLG0106
U 1 1 5FECACF2
P 2307 3254
F 0 "#FLG0106" H 2307 3329 50  0001 C CNN
F 1 "PWR_FLAG" H 2307 3427 50  0000 C CNN
F 2 "" H 2307 3254 50  0001 C CNN
F 3 "~" H 2307 3254 50  0001 C CNN
	1    2307 3254
	1    0    0    -1  
$EndComp
Wire Wire Line
	2307 3254 2307 3368
Connection ~ 2307 3368
Wire Wire Line
	2825 3535 2825 3468
Connection ~ 2825 3468
Wire Wire Line
	2825 3468 2379 3468
NoConn ~ 4329 3568
NoConn ~ 4329 3668
Wire Wire Line
	2929 3368 2307 3368
Wire Wire Line
	2929 3468 2825 3468
NoConn ~ 2929 5268
Text HLabel 4329 5568 2    50   Output ~ 0
CAN1_Tx
Text HLabel 4329 5468 2    50   Output ~ 0
CAN1_Rx
Text HLabel 4329 5268 2    50   Output ~ 0
I2C1_SCL
Text HLabel 4329 5368 2    50   Output ~ 0
I2C1_SDA
Text HLabel 4329 4968 2    50   Output ~ 0
SWO
Text HLabel 4329 4368 2    50   Output ~ 0
SWCLK
Text HLabel 4329 4268 2    50   BiDi ~ 0
SWDIO
Text HLabel 4329 4168 2    50   BiDi ~ 0
USB_D+
Text HLabel 4329 4068 2    50   BiDi ~ 0
USB_D-
Text HLabel 5902 5196 0    50   Output ~ 0
I2C1_SCL
Text HLabel 5902 4996 0    50   Output ~ 0
I2C1_SDA
Wire Wire Line
	3929 2568 3929 2768
Text HLabel 2929 2968 0    50   Input ~ 0
NRESET
$Comp
L power:+3.3VA #PWR0126
U 1 1 5FF39EF4
P 3929 2568
F 0 "#PWR0126" H 3929 2418 50  0001 C CNN
F 1 "+3.3VA" H 3944 2741 50  0000 C CNN
F 2 "" H 3929 2568 50  0001 C CNN
F 3 "" H 3929 2568 50  0001 C CNN
	1    3929 2568
	1    0    0    -1  
$EndComp
$Comp
L power:+3.3V #PWR0127
U 1 1 5FF3DE7E
P 3429 2568
F 0 "#PWR0127" H 3429 2418 50  0001 C CNN
F 1 "+3.3V" H 3444 2741 50  0000 C CNN
F 2 "" H 3429 2568 50  0001 C CNN
F 3 "" H 3429 2568 50  0001 C CNN
	1    3429 2568
	1    0    0    -1  
$EndComp
Connection ~ 3929 2568
NoConn ~ 4329 5868
NoConn ~ 4329 5968
$Comp
L MCU_ST_STM32F4:STM32F405RGTx U2
U 1 1 5FF2294E
P 3629 4568
F 0 "U2" H 3629 2679 50  0000 C CNN
F 1 "STM32F405RGTx" H 4031 2591 50  0000 C CNN
F 2 "Package_QFP:LQFP-64_10x10mm_P0.5mm" H 3029 2868 50  0001 R CNN
F 3 "http://www.st.com/st-web-ui/static/active/en/resource/technical/document/datasheet/DM00037051.pdf" H 3629 4568 50  0001 C CNN
	1    3629 4568
	1    0    0    -1  
$EndComp
Text HLabel 4329 2968 2    50   Input ~ 0
ADC1_IN0
Text HLabel 4329 3068 2    50   Input ~ 0
ADC1_IN1
Text HLabel 4329 3168 2    50   Input ~ 0
ADC_IN2
Text HLabel 4329 5668 2    50   Input ~ 0
I2C2_SCL
Text HLabel 4329 5768 2    50   Input ~ 0
I2C2_SDA
Text HLabel 2929 5368 0    50   Input ~ 0
Pyro1
Text HLabel 2929 5468 0    50   Input ~ 0
Pyro2
Text HLabel 4329 6168 2    50   Input ~ 0
Pyro3
Text HLabel 4329 6068 2    50   Input ~ 0
Pyro4
Text HLabel 2929 5568 0    50   Input ~ 0
DC_Motor_4
Text HLabel 4329 3868 2    50   Input ~ 0
DC_Motor_2
Text HLabel 4329 3768 2    50   Input ~ 0
DC_Motor_3
Text HLabel 4329 3968 2    50   Input ~ 0
DC_Motor_1
Text GLabel 4329 3268 2    50   Input ~ 0
LED_STATUS
$Comp
L power:PWR_FLAG #FLG0101
U 1 1 607DE1ED
P 7193 6064
F 0 "#FLG0101" H 7193 6139 50  0001 C CNN
F 1 "PWR_FLAG" V 7193 6191 50  0000 L CNN
F 2 "" H 7193 6064 50  0001 C CNN
F 3 "~" H 7193 6064 50  0001 C CNN
	1    7193 6064
	0    -1   -1   0   
$EndComp
Connection ~ 7193 6064
Wire Wire Line
	7193 6064 7193 6025
$EndSCHEMATC
