(module BGA-96_8.0x14.0mm_Layout2x3x16_P0.8mm (layer F.Cu) (tedit 5ED6BDDB)
  (descr "BGA-96, http://www.mouser.com/ds/2/198/43-46TR16640B-81280BL-706483.pdf")
  (tags BGA-96)
  (attr smd)
  (fp_text reference REF** (at 0 -9.05) (layer F.SilkS)
    (effects (font (size 1 1) (thickness 0.15)))
  )
  (fp_text value BGA-96_8.0x14.0mm_Layout2x3x16_P0.8mm (at 0 8.9) (layer F.Fab)
    (effects (font (size 1 1) (thickness 0.15)))
  )
  (fp_line (start -4.1 -7.3) (end -4.8 -7.3) (layer F.SilkS) (width 0.12))
  (fp_line (start -4.8 -7.3) (end -4.8 -6.6) (layer F.SilkS) (width 0.12))
  (fp_line (start 4.6 -7.1) (end -4.6 -7.1) (layer F.SilkS) (width 0.12))
  (fp_line (start -4.6 -7.1) (end -4.6 7.1) (layer F.SilkS) (width 0.12))
  (fp_line (start -4.6 7.1) (end 4.6 7.1) (layer F.SilkS) (width 0.12))
  (fp_line (start 4.6 7.1) (end 4.6 -7.1) (layer F.SilkS) (width 0.12))
  (fp_line (start -4.5 7) (end 4.5 7) (layer F.Fab) (width 0.1))
  (fp_line (start 4.5 7) (end 4.5 -7) (layer F.Fab) (width 0.1))
  (fp_line (start 4.5 -7) (end -4 -7) (layer F.Fab) (width 0.1))
  (fp_line (start -4 -7) (end -4.5 -6.5) (layer F.Fab) (width 0.1))
  (fp_line (start -4.5 -6.5) (end -4.5 7) (layer F.Fab) (width 0.1))
  (fp_line (start -5.5 -8) (end 5.5 -8) (layer F.CrtYd) (width 0.05))
  (fp_line (start -5.5 -8) (end -5.5 8) (layer F.CrtYd) (width 0.05))
  (fp_line (start 5.5 8) (end 5.5 -8) (layer F.CrtYd) (width 0.05))
  (fp_line (start 5.5 8) (end -5.5 8) (layer F.CrtYd) (width 0.05))
  (fp_text user %R (at 0 0) (layer F.Fab)
    (effects (font (size 1 1) (thickness 0.15)))
  )
  (pad A1 smd circle (at -3.2 -6) (size 0.4 0.4) (layers F.Cu F.Paste F.Mask))
  (pad A2 smd circle (at -2.4 -6) (size 0.4 0.4) (layers F.Cu F.Paste F.Mask))
  (pad A3 smd circle (at -1.6 -6) (size 0.4 0.4) (layers F.Cu F.Paste F.Mask))
  (pad A7 smd circle (at 1.6 -6) (size 0.4 0.4) (layers F.Cu F.Paste F.Mask))
  (pad A8 smd circle (at 2.4 -6) (size 0.4 0.4) (layers F.Cu F.Paste F.Mask))
  (pad A9 smd circle (at 3.2 -6) (size 0.4 0.4) (layers F.Cu F.Paste F.Mask))
  (pad B1 smd circle (at -3.2 -5.2) (size 0.4 0.4) (layers F.Cu F.Paste F.Mask))
  (pad B2 smd circle (at -2.4 -5.2) (size 0.4 0.4) (layers F.Cu F.Paste F.Mask))
  (pad B3 smd circle (at -1.6 -5.2) (size 0.4 0.4) (layers F.Cu F.Paste F.Mask))
  (pad B7 smd circle (at 1.6 -5.2) (size 0.4 0.4) (layers F.Cu F.Paste F.Mask))
  (pad B8 smd circle (at 2.4 -5.2) (size 0.4 0.4) (layers F.Cu F.Paste F.Mask))
  (pad B9 smd circle (at 3.2 -5.2) (size 0.4 0.4) (layers F.Cu F.Paste F.Mask))
  (pad C1 smd circle (at -3.2 -4.4) (size 0.4 0.4) (layers F.Cu F.Paste F.Mask))
  (pad C2 smd circle (at -2.4 -4.4) (size 0.4 0.4) (layers F.Cu F.Paste F.Mask))
  (pad C3 smd circle (at -1.6 -4.4) (size 0.4 0.4) (layers F.Cu F.Paste F.Mask))
  (pad C7 smd circle (at 1.6 -4.4) (size 0.4 0.4) (layers F.Cu F.Paste F.Mask))
  (pad C8 smd circle (at 2.4 -4.4) (size 0.4 0.4) (layers F.Cu F.Paste F.Mask))
  (pad C9 smd circle (at 3.2 -4.4) (size 0.4 0.4) (layers F.Cu F.Paste F.Mask))
  (pad D1 smd circle (at -3.2 -3.6) (size 0.4 0.4) (layers F.Cu F.Paste F.Mask))
  (pad D2 smd circle (at -2.4 -3.6) (size 0.4 0.4) (layers F.Cu F.Paste F.Mask))
  (pad D3 smd circle (at -1.6 -3.6) (size 0.4 0.4) (layers F.Cu F.Paste F.Mask))
  (pad D7 smd circle (at 1.6 -3.6) (size 0.4 0.4) (layers F.Cu F.Paste F.Mask))
  (pad D8 smd circle (at 2.4 -3.6) (size 0.4 0.4) (layers F.Cu F.Paste F.Mask))
  (pad D9 smd circle (at 3.2 -3.6) (size 0.4 0.4) (layers F.Cu F.Paste F.Mask))
  (pad E1 smd circle (at -3.2 -2.8) (size 0.4 0.4) (layers F.Cu F.Paste F.Mask))
  (pad E2 smd circle (at -2.4 -2.8) (size 0.4 0.4) (layers F.Cu F.Paste F.Mask))
  (pad E3 smd circle (at -1.6 -2.8) (size 0.4 0.4) (layers F.Cu F.Paste F.Mask))
  (pad E7 smd circle (at 1.6 -2.8) (size 0.4 0.4) (layers F.Cu F.Paste F.Mask))
  (pad E8 smd circle (at 2.4 -2.8) (size 0.4 0.4) (layers F.Cu F.Paste F.Mask))
  (pad E9 smd circle (at 3.2 -2.8) (size 0.4 0.4) (layers F.Cu F.Paste F.Mask))
  (pad F1 smd circle (at -3.2 -2) (size 0.4 0.4) (layers F.Cu F.Paste F.Mask))
  (pad F2 smd circle (at -2.4 -2) (size 0.4 0.4) (layers F.Cu F.Paste F.Mask))
  (pad F3 smd circle (at -1.6 -2) (size 0.4 0.4) (layers F.Cu F.Paste F.Mask))
  (pad F7 smd circle (at 1.6 -2) (size 0.4 0.4) (layers F.Cu F.Paste F.Mask))
  (pad F8 smd circle (at 2.4 -2) (size 0.4 0.4) (layers F.Cu F.Paste F.Mask))
  (pad F9 smd circle (at 3.2 -2) (size 0.4 0.4) (layers F.Cu F.Paste F.Mask))
  (pad G1 smd circle (at -3.2 -1.2) (size 0.4 0.4) (layers F.Cu F.Paste F.Mask))
  (pad G2 smd circle (at -2.4 -1.2) (size 0.4 0.4) (layers F.Cu F.Paste F.Mask))
  (pad G3 smd circle (at -1.6 -1.2) (size 0.4 0.4) (layers F.Cu F.Paste F.Mask))
  (pad G7 smd circle (at 1.6 -1.2) (size 0.4 0.4) (layers F.Cu F.Paste F.Mask))
  (pad G8 smd circle (at 2.4 -1.2) (size 0.4 0.4) (layers F.Cu F.Paste F.Mask))
  (pad G9 smd circle (at 3.2 -1.2) (size 0.4 0.4) (layers F.Cu F.Paste F.Mask))
  (pad H1 smd circle (at -3.2 -0.4) (size 0.4 0.4) (layers F.Cu F.Paste F.Mask))
  (pad H2 smd circle (at -2.4 -0.4) (size 0.4 0.4) (layers F.Cu F.Paste F.Mask))
  (pad H3 smd circle (at -1.6 -0.4) (size 0.4 0.4) (layers F.Cu F.Paste F.Mask))
  (pad H7 smd circle (at 1.6 -0.4) (size 0.4 0.4) (layers F.Cu F.Paste F.Mask))
  (pad H8 smd circle (at 2.4 -0.4) (size 0.4 0.4) (layers F.Cu F.Paste F.Mask))
  (pad H9 smd circle (at 3.2 -0.4) (size 0.4 0.4) (layers F.Cu F.Paste F.Mask))
  (pad J1 smd circle (at -3.2 0.4) (size 0.4 0.4) (layers F.Cu F.Paste F.Mask))
  (pad J2 smd circle (at -2.4 0.4) (size 0.4 0.4) (layers F.Cu F.Paste F.Mask))
  (pad J3 smd circle (at -1.6 0.4) (size 0.4 0.4) (layers F.Cu F.Paste F.Mask))
  (pad J7 smd circle (at 1.6 0.4) (size 0.4 0.4) (layers F.Cu F.Paste F.Mask))
  (pad J8 smd circle (at 2.4 0.4) (size 0.4 0.4) (layers F.Cu F.Paste F.Mask))
  (pad J9 smd circle (at 3.2 0.4) (size 0.4 0.4) (layers F.Cu F.Paste F.Mask))
  (pad K1 smd circle (at -3.2 1.2) (size 0.4 0.4) (layers F.Cu F.Paste F.Mask))
  (pad K2 smd circle (at -2.4 1.2) (size 0.4 0.4) (layers F.Cu F.Paste F.Mask))
  (pad K3 smd circle (at -1.6 1.2) (size 0.4 0.4) (layers F.Cu F.Paste F.Mask))
  (pad K7 smd circle (at 1.6 1.2) (size 0.4 0.4) (layers F.Cu F.Paste F.Mask))
  (pad K8 smd circle (at 2.4 1.2) (size 0.4 0.4) (layers F.Cu F.Paste F.Mask))
  (pad K9 smd circle (at 3.2 1.2) (size 0.4 0.4) (layers F.Cu F.Paste F.Mask))
  (pad L1 smd circle (at -3.2 2) (size 0.4 0.4) (layers F.Cu F.Paste F.Mask))
  (pad L2 smd circle (at -2.4 2) (size 0.4 0.4) (layers F.Cu F.Paste F.Mask))
  (pad L3 smd circle (at -1.6 2) (size 0.4 0.4) (layers F.Cu F.Paste F.Mask))
  (pad L7 smd circle (at 1.6 2) (size 0.4 0.4) (layers F.Cu F.Paste F.Mask))
  (pad L8 smd circle (at 2.4 2) (size 0.4 0.4) (layers F.Cu F.Paste F.Mask))
  (pad L9 smd circle (at 3.2 2) (size 0.4 0.4) (layers F.Cu F.Paste F.Mask))
  (pad M1 smd circle (at -3.2 2.8) (size 0.4 0.4) (layers F.Cu F.Paste F.Mask))
  (pad M2 smd circle (at -2.4 2.8) (size 0.4 0.4) (layers F.Cu F.Paste F.Mask))
  (pad M3 smd circle (at -1.6 2.8) (size 0.4 0.4) (layers F.Cu F.Paste F.Mask))
  (pad M7 smd circle (at 1.6 2.8) (size 0.4 0.4) (layers F.Cu F.Paste F.Mask))
  (pad M8 smd circle (at 2.4 2.8) (size 0.4 0.4) (layers F.Cu F.Paste F.Mask))
  (pad M9 smd circle (at 3.2 2.8) (size 0.4 0.4) (layers F.Cu F.Paste F.Mask))
  (pad N1 smd circle (at -3.2 3.6) (size 0.4 0.4) (layers F.Cu F.Paste F.Mask))
  (pad N2 smd circle (at -2.4 3.6) (size 0.4 0.4) (layers F.Cu F.Paste F.Mask))
  (pad N3 smd circle (at -1.6 3.6) (size 0.4 0.4) (layers F.Cu F.Paste F.Mask))
  (pad N7 smd circle (at 1.6 3.6) (size 0.4 0.4) (layers F.Cu F.Paste F.Mask))
  (pad N8 smd circle (at 2.4 3.6) (size 0.4 0.4) (layers F.Cu F.Paste F.Mask))
  (pad N9 smd circle (at 3.2 3.6) (size 0.4 0.4) (layers F.Cu F.Paste F.Mask))
  (pad P1 smd circle (at -3.2 4.4) (size 0.4 0.4) (layers F.Cu F.Paste F.Mask))
  (pad P2 smd circle (at -2.4 4.4) (size 0.4 0.4) (layers F.Cu F.Paste F.Mask))
  (pad P3 smd circle (at -1.6 4.4) (size 0.4 0.4) (layers F.Cu F.Paste F.Mask))
  (pad P7 smd circle (at 1.6 4.4) (size 0.4 0.4) (layers F.Cu F.Paste F.Mask))
  (pad P8 smd circle (at 2.4 4.4) (size 0.4 0.4) (layers F.Cu F.Paste F.Mask))
  (pad P9 smd circle (at 3.2 4.4) (size 0.4 0.4) (layers F.Cu F.Paste F.Mask))
  (pad R1 smd circle (at -3.2 5.2) (size 0.4 0.4) (layers F.Cu F.Paste F.Mask))
  (pad R2 smd circle (at -2.4 5.2) (size 0.4 0.4) (layers F.Cu F.Paste F.Mask))
  (pad R3 smd circle (at -1.6 5.2) (size 0.4 0.4) (layers F.Cu F.Paste F.Mask))
  (pad R7 smd circle (at 1.6 5.2) (size 0.4 0.4) (layers F.Cu F.Paste F.Mask))
  (pad R8 smd circle (at 2.4 5.2) (size 0.4 0.4) (layers F.Cu F.Paste F.Mask))
  (pad R9 smd circle (at 3.2 5.2) (size 0.4 0.4) (layers F.Cu F.Paste F.Mask))
  (pad T1 smd circle (at -3.2 6) (size 0.4 0.4) (layers F.Cu F.Paste F.Mask))
  (pad T2 smd circle (at -2.4 6) (size 0.4 0.4) (layers F.Cu F.Paste F.Mask))
  (pad T3 smd circle (at -1.6 6) (size 0.4 0.4) (layers F.Cu F.Paste F.Mask))
  (pad T7 smd circle (at 1.6 6) (size 0.4 0.4) (layers F.Cu F.Paste F.Mask))
  (pad T8 smd circle (at 2.4 6) (size 0.4 0.4) (layers F.Cu F.Paste F.Mask))
  (pad T9 smd circle (at 3.2 6) (size 0.4 0.4) (layers F.Cu F.Paste F.Mask))
  (model ${LSF_KICAD_LIB}/lsf-kicad-lib.3dshapes/BGA-96_8.0x14.0mm_Layout2x3x16_P0.8mm.wrl
    (at (xyz 0 0 0))
    (scale (xyz 1 1 1))
    (rotate (xyz 0 0 0))
  )
)
