(module BMI-S-x06 (layer F.Cu) (tedit 5C3E011C)
  (descr http://partkeepr.hsgr.awmn/api/part_attachments/259/getFile)
  (tags "RF Shield")
  (attr smd)
  (fp_text reference REF** (at 0 0.0025) (layer F.SilkS)
    (effects (font (size 1 1) (thickness 0.15)))
  )
  (fp_text value BMI-S-x06 (at 0 2.0025) (layer F.Fab)
    (effects (font (size 1 1) (thickness 0.15)))
  )
  (fp_text user %R (at 0 0.0025) (layer F.Fab)
    (effects (font (size 1 1) (thickness 0.15)))
  )
  (fp_line (start -17.2 -18.7975) (end 17.2 -18.7975) (layer F.Fab) (width 0.1))
  (fp_line (start 17.2 -18.7975) (end 17.2 18.8025) (layer F.Fab) (width 0.1))
  (fp_line (start 17.2 18.8025) (end -17.2 18.8025) (layer F.Fab) (width 0.1))
  (fp_line (start -17.2 18.8025) (end -17.2 -18.7975) (layer F.Fab) (width 0.1))
  (fp_line (start 17.4 -19) (end -17.4 -19) (layer F.CrtYd) (width 0.05))
  (fp_line (start -17.4 -19) (end -17.4 19) (layer F.CrtYd) (width 0.05))
  (fp_line (start -17.4 19) (end 17.4 19) (layer F.CrtYd) (width 0.05))
  (fp_line (start 17.4 19) (end 17.4 -19) (layer F.CrtYd) (width 0.05))
  (pad 1 smd rect (at -16.74 15.9575) (size 1 5.72) (layers F.Cu F.Paste F.Mask))
  (pad 1 smd rect (at -16.74 9.0075) (size 1 3.8) (layers F.Cu F.Paste F.Mask))
  (pad 1 smd rect (at -16.74 2.9975) (size 1 3.8) (layers F.Cu F.Paste F.Mask))
  (pad 1 smd rect (at -16.74 -2.9925) (size 1 3.8) (layers F.Cu F.Paste F.Mask))
  (pad 1 smd rect (at -16.74 -8.9925) (size 1 3.8) (layers F.Cu F.Paste F.Mask))
  (pad 1 smd rect (at 16.74 9.0075) (size 1 3.8) (layers F.Cu F.Paste F.Mask))
  (pad 1 smd rect (at 16.74 2.9975) (size 1 3.8) (layers F.Cu F.Paste F.Mask))
  (pad 1 smd rect (at 16.74 -2.9925) (size 1 3.8) (layers F.Cu F.Paste F.Mask))
  (pad 1 smd rect (at 16.74 -8.9925) (size 1 3.8) (layers F.Cu F.Paste F.Mask))
  (pad 1 smd rect (at 16.74 15.9575) (size 1 5.72) (layers F.Cu F.Paste F.Mask))
  (pad 1 smd rect (at 16.74 -15.9575) (size 1 5.72) (layers F.Cu F.Paste F.Mask))
  (pad 1 smd rect (at -16.74 -15.9575) (size 1 5.72) (layers F.Cu F.Paste F.Mask))
  (pad 1 smd rect (at -9 18.3175) (size 3.8 1) (layers F.Cu F.Paste F.Mask))
  (pad 1 smd rect (at -3 18.3175) (size 3.8 1) (layers F.Cu F.Paste F.Mask))
  (pad 1 smd rect (at 3 18.3175) (size 3.8 1) (layers F.Cu F.Paste F.Mask))
  (pad 1 smd rect (at 9 18.3175) (size 3.8 1) (layers F.Cu F.Paste F.Mask))
  (pad 1 smd rect (at -9 -18.3125) (size 3.8 1) (layers F.Cu F.Paste F.Mask))
  (pad 1 smd rect (at -3 -18.3125) (size 3.8 1) (layers F.Cu F.Paste F.Mask))
  (pad 1 smd rect (at 3 -18.3125) (size 3.8 1) (layers F.Cu F.Paste F.Mask))
  (pad 1 smd rect (at 9 -18.3125) (size 3.8 1) (layers F.Cu F.Paste F.Mask))
  (pad 1 smd rect (at -15.17 -18.3175) (size 4.14 1) (layers F.Cu F.Paste F.Mask))
  (pad 1 smd rect (at 15.17 -18.3175) (size 4.14 1) (layers F.Cu F.Paste F.Mask))
  (pad 1 smd rect (at -15.17 18.3175) (size 4.14 1) (layers F.Cu F.Paste F.Mask))
  (pad 1 smd rect (at 15.17 18.3175) (size 4.14 1) (layers F.Cu F.Paste F.Mask))
  (model ${LSF_KICAD_LIB}/lsf-kicad-lib.3dshapes/BMI-S-x06.wrl
    (at (xyz 0 0 0))
    (scale (xyz 1 1 1))
    (rotate (xyz 0 0 0))
  )
)
