(module hrs-df11c-4dp-2v (layer F.Cu) (tedit 5C3F976B)
  (descr https://www.hirose.com/product/en/download_file/key_name/DF11C-4DP-2V%2857%29/category/Catalog/doc_file_id/31688/?file_category_id=5&item_id=05430682157&is_series=)
  (tags "Header DF11")
  (attr smd)
  (fp_text reference REF** (at 0.5 0) (layer F.SilkS)
    (effects (font (size 1 1) (thickness 0.15)))
  )
  (fp_text value hrs-df11c-4dp-2v (at 0 6) (layer F.Fab)
    (effects (font (size 1 1) (thickness 0.15)))
  )
  (fp_line (start 4 -3) (end -4 -3) (layer F.SilkS) (width 0.12))
  (fp_line (start -4 -3) (end -4 3) (layer F.SilkS) (width 0.12))
  (fp_line (start -4 3) (end 4 3) (layer F.SilkS) (width 0.12))
  (fp_line (start 4 3) (end 4 -3) (layer F.SilkS) (width 0.12))
  (fp_line (start 2.5 -1.5) (end 2 -1.5) (layer F.SilkS) (width 0.12))
  (fp_line (start 2 -1.5) (end 2 0) (layer F.SilkS) (width 0.12))
  (fp_line (start 2 0) (end 2.5 0) (layer F.SilkS) (width 0.12))
  (fp_line (start -2.5 -1.5) (end -2 -1.5) (layer F.SilkS) (width 0.12))
  (fp_line (start -2 -1.5) (end -2 0) (layer F.SilkS) (width 0.12))
  (fp_line (start -2 0) (end -2.5 0) (layer F.SilkS) (width 0.12))
  (fp_line (start -2.5 -3) (end -2.5 3) (layer F.SilkS) (width 0.12))
  (fp_line (start 2.5 -3) (end 2.5 3) (layer F.SilkS) (width 0.12))
  (fp_line (start 6.4 -5.2) (end 6.4 5.2) (layer F.CrtYd) (width 0.05))
  (fp_line (start 6.4 5.2) (end -6.4 5.2) (layer F.CrtYd) (width 0.05))
  (fp_line (start -6.4 5.2) (end -6.4 -5.2) (layer F.CrtYd) (width 0.05))
  (fp_line (start -6.4 -5.2) (end 6.4 -5.2) (layer F.CrtYd) (width 0.05))
  (fp_text user %R (at 0.5 0) (layer F.Fab)
    (effects (font (size 1 1) (thickness 0.15)))
  )
  (fp_line (start 4 -3) (end -4 -3) (layer F.Fab) (width 0.1))
  (fp_line (start -4 -3) (end -4 3) (layer F.Fab) (width 0.1))
  (fp_line (start -4 3) (end 4 3) (layer F.Fab) (width 0.1))
  (fp_line (start 4 3) (end 4 -3) (layer F.Fab) (width 0.1))
  (pad 2 smd rect (at 1 -4.15) (size 1.1 2) (layers F.Cu F.Paste F.Mask))
  (pad 4 smd rect (at -1 -4.15) (size 1.1 2) (layers F.Cu F.Paste F.Mask))
  (pad 1 smd rect (at 1 4.15) (size 1.1 2) (layers F.Cu F.Paste F.Mask))
  (pad 3 smd rect (at -1 4.15) (size 1.1 2) (layers F.Cu F.Paste F.Mask))
  (pad "" smd rect (at 5.35 0) (size 2 2.8) (layers F.Cu F.Paste F.Mask))
  (pad "" smd rect (at -5.35 0) (size 2 2.8) (layers F.Cu F.Paste F.Mask))
  (model ${LSF_KICAD_LIB}/lsf-kicad-lib.3dshapes/hrs-df11c-4dp-2v.wrl
    (at (xyz 0 0 0))
    (scale (xyz 1 1 1))
    (rotate (xyz 0 0 0))
  )
)
