(module MQ-7 (layer F.Cu) (tedit 5DD08A8B)
  (descr https://www.sparkfun.com/datasheets/Sensors/Biometric/MQ-7.pdf)
  (tags "Sensor CO")
  (fp_text reference REF** (at 3.258757 -3.641243) (layer F.SilkS)
    (effects (font (size 1 1) (thickness 0.15)))
  )
  (fp_text value MQ-7 (at 3.358757 10.258757) (layer F.Fab)
    (effects (font (size 1 1) (thickness 0.15)))
  )
  (fp_circle (center 3.34 3.36) (end 3.34 12.36) (layer F.CrtYd) (width 0.05))
  (fp_circle (center 3.34 3.34) (end 3.34 12.34) (layer F.SilkS) (width 0.12))
  (fp_circle (center 3.358757 3.358757) (end 3.358757 11.858757) (layer F.Fab) (width 0.1))
  (fp_text user %R (at 3.258757 -3.641243) (layer F.Fab)
    (effects (font (size 1 1) (thickness 0.15)))
  )
  (pad A thru_hole rect (at 0 0) (size 2.5 2.5) (drill 1.1) (layers *.Cu *.Mask))
  (pad H1 thru_hole oval (at -1.391243 3.358757) (size 2.5 2.5) (drill 1.1) (layers *.Cu *.Mask))
  (pad A thru_hole oval (at 0 6.717514) (size 2.5 2.5) (drill 1.1) (layers *.Cu *.Mask))
  (pad B thru_hole oval (at 6.717514 6.717514) (size 2.5 2.5) (drill 1.1) (layers *.Cu *.Mask))
  (pad H2 thru_hole oval (at 8.108757 3.358757) (size 2.5 2.5) (drill 1.1) (layers *.Cu *.Mask))
  (pad B thru_hole oval (at 6.717514 0) (size 2.5 2.5) (drill 1.1) (layers *.Cu *.Mask))
  (model ${LSF_KICAD_LIB}/lsf-kicad-lib.3dshapes/MQ-7.wrl
    (at (xyz 0 0 0))
    (scale (xyz 1 1 1))
    (rotate (xyz 0 0 0))
  )
)
