EESchema Schematic File Version 4
EELAYER 30 0
EELAYER END
$Descr A4 11693 8268
encoding utf-8
Sheet 10 10
Title ""
Date ""
Rev ""
Comp ""
Comment1 ""
Comment2 ""
Comment3 ""
Comment4 ""
$EndDescr
Wire Wire Line
	3722 5034 3743 5034
Wire Wire Line
	3722 5035 3722 5034
Wire Wire Line
	3412 5035 3722 5035
$Comp
L Device:R_Small R?
U 1 1 5FEEDE73
P 3843 5034
AR Path="/5FEEDE73" Ref="R?"  Part="1" 
AR Path="/5FEBE0C4/5FEEDE73" Ref="R7"  Part="1" 
AR Path="/5FFBDDA9/5FEEDE73" Ref="R13"  Part="1" 
F 0 "R13" V 3647 5034 50  0000 C CNN
F 1 "R_Small" V 3738 5034 50  0000 C CNN
F 2 "Resistor_SMD:R_0603_1608Metric" H 3843 5034 50  0001 C CNN
F 3 "~" H 3843 5034 50  0001 C CNN
	1    3843 5034
	0    1    1    0   
$EndComp
$Comp
L pspice:DIODE D?
U 1 1 5FEEDE7B
P 4246 4424
AR Path="/5FEEDE7B" Ref="D?"  Part="1" 
AR Path="/5FEBE0C4/5FEEDE7B" Ref="D1"  Part="1" 
AR Path="/5FFBDDA9/5FEEDE7B" Ref="D3"  Part="1" 
F 0 "D3" V 4292 4296 50  0000 R CNN
F 1 "DIODE" V 4201 4296 50  0000 R CNN
F 2 "Diode_SMD:D_SOD-323" H 4246 4424 50  0001 C CNN
F 3 "~" H 4246 4424 50  0001 C CNN
	1    4246 4424
	0    -1   -1   0   
$EndComp
$Comp
L Device:LED LED?
U 1 1 5FEEDE81
P 3262 5035
AR Path="/5FEEDE81" Ref="LED?"  Part="1" 
AR Path="/5FEBE0C4/5FEEDE81" Ref="LED1"  Part="1" 
AR Path="/5FFBDDA9/5FEEDE81" Ref="LED2"  Part="1" 
F 0 "LED2" H 3255 4780 50  0000 C CNN
F 1 "LED" H 3255 4871 50  0000 C CNN
F 2 "LED_SMD:LED_0603_1608Metric_Castellated" H 3262 5035 50  0001 C CNN
F 3 "~" H 3262 5035 50  0001 C CNN
	1    3262 5035
	-1   0    0    1   
$EndComp
Wire Wire Line
	3112 5035 2906 5035
$Comp
L power:GND #PWR?
U 1 1 5FEEDE88
P 4243 5234
AR Path="/5FEEDE88" Ref="#PWR?"  Part="1" 
AR Path="/5FEBE0C4/5FEEDE88" Ref="#PWR0109"  Part="1" 
AR Path="/5FFBDDA9/5FEEDE88" Ref="#PWR0126"  Part="1" 
F 0 "#PWR0126" H 4243 4984 50  0001 C CNN
F 1 "GND" H 4248 5061 50  0000 C CNN
F 2 "" H 4243 5234 50  0001 C CNN
F 3 "" H 4243 5234 50  0001 C CNN
	1    4243 5234
	1    0    0    -1  
$EndComp
$Comp
L power:+3.3V #PWR?
U 1 1 5FEEDE8E
P 4272 3776
AR Path="/5FEEDE8E" Ref="#PWR?"  Part="1" 
AR Path="/5FEBE0C4/5FEEDE8E" Ref="#PWR0110"  Part="1" 
AR Path="/5FFBDDA9/5FEEDE8E" Ref="#PWR0130"  Part="1" 
F 0 "#PWR0130" H 4272 3626 50  0001 C CNN
F 1 "+3.3V" H 4287 3949 50  0000 C CNN
F 2 "" H 4272 3776 50  0001 C CNN
F 3 "" H 4272 3776 50  0001 C CNN
	1    4272 3776
	1    0    0    -1  
$EndComp
$Comp
L SensorBoard-rescue:Relay_srd-05vdc-sl-c-Relay_srd-05vdc-sl-c RELAY?
U 1 1 5FEEDE94
P 5338 4418
AR Path="/5FEEDE94" Ref="RELAY?"  Part="1" 
AR Path="/5FEBE0C4/5FEEDE94" Ref="RELAY1"  Part="1" 
AR Path="/5FFBDDA9/5FEEDE94" Ref="RELAY2"  Part="1" 
F 0 "RELAY2" H 5338 4933 50  0000 C CNN
F 1 "Relay_srd-05vdc-sl-c" H 5338 4842 50  0000 C CNN
F 2 "RELAY:RELAY_SRD-05VDC-SL-C" H 5338 5018 50  0001 C CNN
F 3 "" H 5338 5018 50  0001 C CNN
	1    5338 4418
	1    0    0    -1  
$EndComp
Text GLabel 2906 5035 0    50   Input ~ 0
IGNITION_SIGNAL
$Comp
L Connector:Screw_Terminal_01x02 J1
U 1 1 5FD83AEB
P 7076 4528
AR Path="/5FEBE0C4/5FD83AEB" Ref="J1"  Part="1" 
AR Path="/5FFBDDA9/5FD83AEB" Ref="J5"  Part="1" 
F 0 "J5" H 7156 4520 50  0000 L CNN
F 1 "Screw_Terminal_01x02" H 7156 4429 50  0000 L CNN
F 2 "TerminalBlock_Phoenix:TerminalBlock_Phoenix_MKDS-1,5-2-5.08_1x02_P5.08mm_Horizontal" H 7076 4528 50  0001 C CNN
F 3 "~" H 7076 4528 50  0001 C CNN
	1    7076 4528
	1    0    0    -1  
$EndComp
$Comp
L power:GND #PWR0111
U 1 1 5FE0A65F
P 6225 4524
AR Path="/5FEBE0C4/5FE0A65F" Ref="#PWR0111"  Part="1" 
AR Path="/5FFBDDA9/5FE0A65F" Ref="#PWR0131"  Part="1" 
F 0 "#PWR0131" H 6225 4274 50  0001 C CNN
F 1 "GND" H 6230 4351 50  0000 C CNN
F 2 "" H 6225 4524 50  0001 C CNN
F 3 "" H 6225 4524 50  0001 C CNN
	1    6225 4524
	-1   0    0    1   
$EndComp
Wire Wire Line
	6876 4528 6225 4528
Wire Wire Line
	6225 4528 6225 4524
NoConn ~ 5738 4418
$Comp
L Transistor_BJT:2N2219 Q?
U 1 1 5FEEDE6A
P 4143 5034
AR Path="/5FEEDE6A" Ref="Q?"  Part="1" 
AR Path="/5FEBE0C4/5FEEDE6A" Ref="Q1"  Part="1" 
AR Path="/5FFBDDA9/5FEEDE6A" Ref="Q2"  Part="1" 
F 0 "Q2" H 4333 5080 50  0000 L CNN
F 1 "2N2219" H 4333 4989 50  0000 L CNN
F 2 "Package_TO_SOT_THT:TO-39-3" H 4343 4959 50  0001 L CIN
F 3 "http://www.onsemi.com/pub_link/Collateral/2N2219-D.PDF" H 4143 5034 50  0001 L CNN
	1    4143 5034
	1    0    0    -1  
$EndComp
Wire Wire Line
	4243 4834 4243 4689
Wire Wire Line
	4243 4624 4246 4624
Wire Wire Line
	4272 4224 4246 4224
Wire Wire Line
	4272 3776 4272 4128
Wire Wire Line
	4272 4128 4938 4128
Wire Wire Line
	4938 4128 4938 4168
Connection ~ 4272 4128
Wire Wire Line
	4272 4128 4272 4224
Wire Wire Line
	4243 4689 4938 4689
Wire Wire Line
	4938 4689 4938 4668
Connection ~ 4243 4689
Wire Wire Line
	4243 4689 4243 4624
NoConn ~ 5738 4168
Wire Wire Line
	5738 4668 5867 4668
Wire Wire Line
	5867 4668 5867 4671
Wire Wire Line
	6845 4671 6845 4628
Wire Wire Line
	6845 4628 6876 4628
Wire Wire Line
	5867 4671 6845 4671
$EndSCHEMATC
