(module hrs-df11-4dp-2dsa (layer F.Cu) (tedit 5C3E4555)
  (descr https://www.hirose.com/product/en/download_file/key_name/DF11-4DP-2DSA%2801%29/category/Catalog/doc_file_id/31688/?file_category_id=5&item_id=05430517501&is_series=)
  (tags Header)
  (fp_text reference REF** (at -2 -4.5) (layer F.SilkS)
    (effects (font (size 1 1) (thickness 0.15)))
  )
  (fp_text value hrs-df11-4dp-2dsa (at -1 2.5) (layer F.Fab)
    (effects (font (size 1 1) (thickness 0.15)))
  )
  (fp_line (start 2 -2.5) (end 1.5 -2.5) (layer F.SilkS) (width 0.12))
  (fp_line (start 1.5 -2.5) (end 1.5 -1) (layer F.SilkS) (width 0.12))
  (fp_line (start 1.5 -1) (end 2 -1) (layer F.SilkS) (width 0.12))
  (fp_line (start -4 -2.5) (end -3.5 -2.5) (layer F.SilkS) (width 0.12))
  (fp_line (start -3.5 -2.5) (end -3.5 -1) (layer F.SilkS) (width 0.12))
  (fp_line (start -3.5 -1) (end -4 -1) (layer F.SilkS) (width 0.12))
  (fp_line (start 2 -3.5) (end 2 1.5) (layer F.SilkS) (width 0.12))
  (fp_line (start 2 1.5) (end -4 1.5) (layer F.SilkS) (width 0.12))
  (fp_line (start -4 1.5) (end -4 -3.5) (layer F.SilkS) (width 0.12))
  (fp_line (start -4 -3.5) (end 2 -3.5) (layer F.SilkS) (width 0.12))
  (fp_text user %R (at -2 -4.5) (layer F.Fab)
    (effects (font (size 1 1) (thickness 0.15)))
  )
  (fp_line (start -4.1 -3.6) (end 2.1 -3.6) (layer F.CrtYd) (width 0.05))
  (fp_line (start 2.1 -3.6) (end 2.1 1.6) (layer F.CrtYd) (width 0.05))
  (fp_line (start 2.1 1.6) (end -4.1 1.6) (layer F.CrtYd) (width 0.05))
  (fp_line (start -4.1 1.6) (end -4.1 -3.6) (layer F.CrtYd) (width 0.05))
  (fp_line (start -4 -3.5) (end 2 -3.5) (layer F.Fab) (width 0.1))
  (fp_line (start 2 -3.5) (end 2 1.5) (layer F.Fab) (width 0.1))
  (fp_line (start 2 1.5) (end -4 1.5) (layer F.Fab) (width 0.1))
  (fp_line (start -4 1.5) (end -4 -3.5) (layer F.Fab) (width 0.1))
  (pad 1 thru_hole rect (at 0 0) (size 1.3 1.3) (drill 0.8) (layers *.Cu *.Mask))
  (pad 2 thru_hole circle (at 0 -2) (size 1.3 1.3) (drill 0.8) (layers *.Cu *.Mask))
  (pad 3 thru_hole circle (at -2 0) (size 1.3 1.3) (drill 0.8) (layers *.Cu *.Mask))
  (pad 4 thru_hole circle (at -2 -2) (size 1.3 1.3) (drill 0.8) (layers *.Cu *.Mask))
  (model ${LSF_KICAD_LIB}/lsf-kicad-lib.3dshapes/hrs-df11-4dp-2dsa.wrl
    (at (xyz 0 0 0))
    (scale (xyz 1 1 1))
    (rotate (xyz 0 0 0))
  )
)
