EESchema Schematic File Version 4
EELAYER 30 0
EELAYER END
$Descr A4 11693 8268
encoding utf-8
Sheet 4 13
Title ""
Date ""
Rev ""
Comp ""
Comment1 ""
Comment2 ""
Comment3 ""
Comment4 ""
$EndDescr
$Comp
L Device:R_Small R1
U 1 1 60560151
P 4750 3900
AR Path="/60551091/60560151" Ref="R1"  Part="1" 
AR Path="/6055E6DD/60560151" Ref="R?"  Part="1" 
AR Path="/60F9B7F6/60560151" Ref="R10"  Part="1" 
AR Path="/60FA1AA9/60560151" Ref="R13"  Part="1" 
AR Path="/60FA7E41/60560151" Ref="R16"  Part="1" 
F 0 "R16" H 4809 3946 50  0000 L CNN
F 1 "R_Small" H 4809 3855 50  0000 L CNN
F 2 "Resistor_SMD:R_0603_1608Metric" H 4750 3900 50  0001 C CNN
F 3 "~" H 4750 3900 50  0001 C CNN
	1    4750 3900
	0    -1   -1   0   
$EndComp
$Comp
L power:GND #PWR012
U 1 1 60560154
P 5150 4550
AR Path="/60551091/60560154" Ref="#PWR012"  Part="1" 
AR Path="/6055E6DD/60560154" Ref="#PWR?"  Part="1" 
AR Path="/60F9B7F6/60560154" Ref="#PWR0110"  Part="1" 
AR Path="/60FA1AA9/60560154" Ref="#PWR0114"  Part="1" 
AR Path="/60FA7E41/60560154" Ref="#PWR0118"  Part="1" 
F 0 "#PWR0118" H 5150 4300 50  0001 C CNN
F 1 "GND" H 5155 4377 50  0000 C CNN
F 2 "" H 5150 4550 50  0001 C CNN
F 3 "" H 5150 4550 50  0001 C CNN
	1    5150 4550
	1    0    0    -1  
$EndComp
$Comp
L power:GND #PWR013
U 1 1 60560156
P 5700 4400
AR Path="/60551091/60560156" Ref="#PWR013"  Part="1" 
AR Path="/6055E6DD/60560156" Ref="#PWR?"  Part="1" 
AR Path="/60F9B7F6/60560156" Ref="#PWR0112"  Part="1" 
AR Path="/60FA1AA9/60560156" Ref="#PWR0116"  Part="1" 
AR Path="/60FA7E41/60560156" Ref="#PWR0120"  Part="1" 
F 0 "#PWR0120" H 5700 4150 50  0001 C CNN
F 1 "GND" H 5705 4227 50  0000 C CNN
F 2 "" H 5700 4400 50  0001 C CNN
F 3 "" H 5700 4400 50  0001 C CNN
	1    5700 4400
	1    0    0    -1  
$EndComp
$Comp
L power:GND #PWR015
U 1 1 60588125
P 6850 4250
AR Path="/60551091/60588125" Ref="#PWR015"  Part="1" 
AR Path="/6055E6DD/60588125" Ref="#PWR?"  Part="1" 
AR Path="/60F9B7F6/60588125" Ref="#PWR0113"  Part="1" 
AR Path="/60FA1AA9/60588125" Ref="#PWR0117"  Part="1" 
AR Path="/60FA7E41/60588125" Ref="#PWR0121"  Part="1" 
F 0 "#PWR0121" H 6850 4000 50  0001 C CNN
F 1 "GND" H 6855 4077 50  0000 C CNN
F 2 "" H 6850 4250 50  0001 C CNN
F 3 "" H 6850 4250 50  0001 C CNN
	1    6850 4250
	1    0    0    -1  
$EndComp
$Comp
L Connector:Screw_Terminal_01x02 J10
U 1 1 60FB9ED2
P 7100 4050
AR Path="/60551091/60FB9ED2" Ref="J10"  Part="1" 
AR Path="/60FB9ED2" Ref="J?"  Part="1" 
AR Path="/60AB28B1/60FB9ED2" Ref="J?"  Part="1" 
AR Path="/60F9B7F6/60FB9ED2" Ref="J9"  Part="1" 
AR Path="/60FA1AA9/60FB9ED2" Ref="J8"  Part="1" 
AR Path="/60FA7E41/60FB9ED2" Ref="J11"  Part="1" 
F 0 "J11" H 7180 4042 50  0000 L CNN
F 1 "Screw_Terminal_01x02" H 7180 3951 50  0000 L CNN
F 2 "Screw terminal:Screw_Terminal_2.54mm" H 7100 4050 50  0001 C CNN
F 3 "~" H 7100 4050 50  0001 C CNN
	1    7100 4050
	1    0    0    -1  
$EndComp
Text HLabel 4450 3900 0    50   Input ~ 0
SIGNAL
$Comp
L Device:R_Small R3
U 1 1 60560153
P 5700 3450
AR Path="/60551091/60560153" Ref="R3"  Part="1" 
AR Path="/6055E6DD/60560153" Ref="R?"  Part="1" 
AR Path="/60F9B7F6/60560153" Ref="R12"  Part="1" 
AR Path="/60FA1AA9/60560153" Ref="R15"  Part="1" 
AR Path="/60FA7E41/60560153" Ref="R18"  Part="1" 
F 0 "R18" H 5759 3496 50  0000 L CNN
F 1 "10kOhm" H 5759 3405 50  0000 L CNN
F 2 "Resistor_SMD:R_0603_1608Metric" H 5700 3450 50  0001 C CNN
F 3 "~" H 5700 3450 50  0001 C CNN
	1    5700 3450
	1    0    0    -1  
$EndComp
$Comp
L power:+10V #PWR014
U 1 1 60560155
P 5700 3150
AR Path="/60551091/60560155" Ref="#PWR014"  Part="1" 
AR Path="/6055E6DD/60560155" Ref="#PWR?"  Part="1" 
AR Path="/60F9B7F6/60560155" Ref="#PWR0111"  Part="1" 
AR Path="/60FA1AA9/60560155" Ref="#PWR0115"  Part="1" 
AR Path="/60FA7E41/60560155" Ref="#PWR0119"  Part="1" 
F 0 "#PWR0119" H 5700 3000 50  0001 C CNN
F 1 "+10V" H 5715 3323 50  0000 C CNN
F 2 "" H 5700 3150 50  0001 C CNN
F 3 "" H 5700 3150 50  0001 C CNN
	1    5700 3150
	1    0    0    -1  
$EndComp
Wire Wire Line
	5700 3250 6600 3250
Wire Wire Line
	5700 3150 5700 3250
Wire Wire Line
	5700 3550 5700 3650
$Comp
L MotorControllerShield:DMP3099L-7 U4
U 1 1 60A9921F
P 6600 3650
AR Path="/60551091/60A9921F" Ref="U4"  Part="1" 
AR Path="/60F9B7F6/60A9921F" Ref="U8"  Part="1" 
AR Path="/60FA1AA9/60A9921F" Ref="U9"  Part="1" 
AR Path="/60FA7E41/60A9921F" Ref="U10"  Part="1" 
F 0 "U10" H 6495 3696 50  0000 R CNN
F 1 "DMP3099L-7" H 7142 3870 50  0000 R CNN
F 2 "Package_TO_SOT_SMD:SOT-23" H 6600 3650 50  0001 C CNN
F 3 "" H 6600 3650 50  0001 C CNN
	1    6600 3650
	-1   0    0    -1  
$EndComp
Wire Wire Line
	6300 3650 5700 3650
Connection ~ 5700 3650
Wire Wire Line
	5700 3650 5700 3700
Wire Wire Line
	6600 3850 6600 4050
Wire Wire Line
	6600 4050 6900 4050
Wire Wire Line
	6900 4150 6850 4150
Wire Wire Line
	6850 4150 6850 4250
Wire Wire Line
	5400 3900 5150 3900
Wire Wire Line
	4650 3900 4450 3900
Wire Wire Line
	5150 4150 5150 3900
Connection ~ 5150 3900
Wire Wire Line
	5150 3900 4850 3900
Wire Wire Line
	5150 4350 5150 4550
Wire Wire Line
	5700 4100 5700 4400
Wire Wire Line
	5700 3250 5700 3350
Wire Wire Line
	6600 3250 6600 3450
$Comp
L Device:R_Small R2
U 1 1 60560152
P 5150 4250
AR Path="/60551091/60560152" Ref="R2"  Part="1" 
AR Path="/6055E6DD/60560152" Ref="R?"  Part="1" 
AR Path="/60F9B7F6/60560152" Ref="R11"  Part="1" 
AR Path="/60FA1AA9/60560152" Ref="R14"  Part="1" 
AR Path="/60FA7E41/60560152" Ref="R17"  Part="1" 
F 0 "R17" H 5209 4296 50  0000 L CNN
F 1 "R_Small" H 5209 4205 50  0000 L CNN
F 2 "Resistor_SMD:R_0603_1608Metric" H 5150 4250 50  0000 C CNN
F 3 "~" H 5150 4250 50  0001 C CNN
	1    5150 4250
	1    0    0    -1  
$EndComp
Connection ~ 5700 3250
$Comp
L Transistor_BJT:BC847W Q1
U 1 1 60DCB28D
P 5600 3900
AR Path="/60551091/60DCB28D" Ref="Q1"  Part="1" 
AR Path="/60FA7E41/60DCB28D" Ref="Q2"  Part="1" 
AR Path="/60F9B7F6/60DCB28D" Ref="Q4"  Part="1" 
AR Path="/60FA1AA9/60DCB28D" Ref="Q3"  Part="1" 
F 0 "Q2" H 5791 3946 50  0000 L CNN
F 1 "BC 847BW H6327" H 5791 3855 50  0000 L CNN
F 2 "Package_TO_SOT_SMD:SOT-323_SC-70" H 5800 3825 50  0001 L CIN
F 3 "http://www.infineon.com/dgdl/Infineon-BC847SERIES_BC848SERIES_BC849SERIES_BC850SERIES-DS-v01_01-en.pdf?fileId=db3a304314dca389011541d4630a1657" H 5600 3900 50  0001 L CNN
	1    5600 3900
	1    0    0    -1  
$EndComp
$EndSCHEMATC
