EESchema Schematic File Version 4
EELAYER 30 0
EELAYER END
$Descr A4 11693 8268
encoding utf-8
Sheet 7 13
Title ""
Date ""
Rev ""
Comp ""
Comment1 ""
Comment2 ""
Comment3 ""
Comment4 ""
$EndDescr
Text HLabel 9175 4050 0    50   Input ~ 0
CO2_2_RIGHT
Text HLabel 9175 4150 0    50   Input ~ 0
CO2_2_LEFT
Text HLabel 9200 3150 0    50   Input ~ 0
3WAY_RIGHT
Text HLabel 9200 3250 0    50   Input ~ 0
3WAY_LEFT
Text HLabel 2700 3050 0    50   Input ~ 0
THRUST_LEFT
Text HLabel 2700 2950 0    50   Input ~ 0
THRUST_RIGHT
Text HLabel 2675 3950 0    50   Input ~ 0
PURGE_LEFT
Text HLabel 2675 3850 0    50   Input ~ 0
PURGE_RIGHT
NoConn ~ 4075 3450
NoConn ~ 4075 3350
$Comp
L MotorControllerShield:MC33926_DUAL U?
U 1 1 60D595E2
P 3600 3275
AR Path="/60D595E2" Ref="U?"  Part="1" 
AR Path="/60D554BE/60D595E2" Ref="U1"  Part="1" 
F 0 "U1" H 4144 2546 50  0000 L CNN
F 1 "MC33926_DUAL" H 4144 2455 50  0000 L CNN
F 2 "motorcontrollershield:Pololu_Dual_MC33926_powerMOD" H 3250 3225 50  0001 C CNN
F 3 "" H 3250 3225 50  0001 C CNN
	1    3600 3275
	1    0    0    -1  
$EndComp
NoConn ~ 3075 4250
Wire Wire Line
	2000 4050 2000 4025
Wire Wire Line
	3000 2750 3075 2750
NoConn ~ 3075 3550
NoConn ~ 3075 3450
NoConn ~ 3075 2650
NoConn ~ 3075 2550
$Comp
L power:+5V #PWR?
U 1 1 60D595B6
P 2000 4025
AR Path="/60D595B6" Ref="#PWR?"  Part="1" 
AR Path="/60D554BE/60D595B6" Ref="#PWR0142"  Part="1" 
F 0 "#PWR0142" H 2000 3875 50  0001 C CNN
F 1 "+5V" H 1876 4047 50  0000 C CNN
F 2 "" H 2000 4025 50  0001 C CNN
F 3 "" H 2000 4025 50  0001 C CNN
	1    2000 4025
	1    0    0    -1  
$EndComp
$Comp
L power:GND #PWR?
U 1 1 60D595B0
P 2400 4150
AR Path="/60D595B0" Ref="#PWR?"  Part="1" 
AR Path="/60D554BE/60D595B0" Ref="#PWR0141"  Part="1" 
F 0 "#PWR0141" H 2400 3900 50  0001 C CNN
F 1 "GND" H 2324 4023 50  0000 C CNN
F 2 "" H 2400 4150 50  0001 C CNN
F 3 "" H 2400 4150 50  0001 C CNN
	1    2400 4150
	1    0    0    -1  
$EndComp
Wire Wire Line
	2775 3650 2775 4900
Wire Wire Line
	3675 4450 3675 4900
Wire Wire Line
	3775 4450 3775 4775
Wire Wire Line
	2850 4775 2850 3750
Wire Wire Line
	3075 3350 2925 3350
Wire Wire Line
	3575 2250 3000 2250
Wire Wire Line
	3000 2250 3000 2750
Wire Wire Line
	3575 2250 3575 2400
Wire Wire Line
	3675 2175 2925 2175
Wire Wire Line
	2925 2175 2925 2850
Wire Wire Line
	2925 2850 3075 2850
Wire Wire Line
	3675 2175 3675 2400
Wire Wire Line
	3775 2100 2850 2100
Wire Wire Line
	2850 2100 2850 3150
Wire Wire Line
	3775 2100 3775 2400
Wire Wire Line
	3875 2025 2775 2025
Wire Wire Line
	2775 2025 2775 3250
Wire Wire Line
	3875 2025 3875 2400
Wire Wire Line
	2775 3250 3075 3250
Wire Wire Line
	2850 3150 3075 3150
Wire Wire Line
	2700 2950 3075 2950
Wire Wire Line
	2700 3050 3075 3050
Wire Wire Line
	3575 4450 3575 4525
Wire Wire Line
	2925 3350 2925 4525
Wire Wire Line
	2925 4525 3575 4525
Wire Wire Line
	2775 3650 3075 3650
Wire Wire Line
	2775 4900 3675 4900
Wire Wire Line
	2850 3750 3075 3750
Wire Wire Line
	2850 4775 3775 4775
Wire Wire Line
	2675 3850 3075 3850
Wire Wire Line
	2675 3950 3075 3950
Wire Wire Line
	2000 4050 3075 4050
Wire Wire Line
	2400 4150 3075 4150
Text HLabel 5775 3975 0    50   Input ~ 0
CO2_1_RIGHT
Text HLabel 5775 4075 0    50   Input ~ 0
CO2_1_LEFT
Text HLabel 5800 3175 0    50   Input ~ 0
GR_LEFT
Text HLabel 5800 3075 0    50   Input ~ 0
QR_RIGHT
NoConn ~ 7175 3575
NoConn ~ 7175 3475
$Comp
L MotorControllerShield:MC33926_DUAL U?
U 1 1 60E57CF6
P 6700 3400
AR Path="/60E57CF6" Ref="U?"  Part="1" 
AR Path="/60D554BE/60E57CF6" Ref="U2"  Part="1" 
F 0 "U2" H 7244 2671 50  0000 L CNN
F 1 "MC33926_DUAL" H 7244 2580 50  0000 L CNN
F 2 "motorcontrollershield:Pololu_Dual_MC33926_powerMOD" H 6350 3350 50  0001 C CNN
F 3 "" H 6350 3350 50  0001 C CNN
	1    6700 3400
	1    0    0    -1  
$EndComp
NoConn ~ 6175 4375
Wire Wire Line
	5100 4175 5100 4150
Wire Wire Line
	6100 2875 6175 2875
NoConn ~ 6175 3675
NoConn ~ 6175 3575
NoConn ~ 6175 2775
NoConn ~ 6175 2675
$Comp
L power:+5V #PWR?
U 1 1 60E57D03
P 5100 4150
AR Path="/60E57D03" Ref="#PWR?"  Part="1" 
AR Path="/60D554BE/60E57D03" Ref="#PWR0143"  Part="1" 
F 0 "#PWR0143" H 5100 4000 50  0001 C CNN
F 1 "+5V" H 4976 4172 50  0000 C CNN
F 2 "" H 5100 4150 50  0001 C CNN
F 3 "" H 5100 4150 50  0001 C CNN
	1    5100 4150
	1    0    0    -1  
$EndComp
$Comp
L power:GND #PWR?
U 1 1 60E57D09
P 5500 4275
AR Path="/60E57D09" Ref="#PWR?"  Part="1" 
AR Path="/60D554BE/60E57D09" Ref="#PWR0144"  Part="1" 
F 0 "#PWR0144" H 5500 4025 50  0001 C CNN
F 1 "GND" H 5424 4148 50  0000 C CNN
F 2 "" H 5500 4275 50  0001 C CNN
F 3 "" H 5500 4275 50  0001 C CNN
	1    5500 4275
	1    0    0    -1  
$EndComp
Wire Wire Line
	5875 3775 5875 5025
Wire Wire Line
	6775 4575 6775 5025
Wire Wire Line
	6875 4575 6875 4900
Wire Wire Line
	5950 4900 5950 3875
Wire Wire Line
	6175 3475 6025 3475
Wire Wire Line
	6675 2375 6100 2375
Wire Wire Line
	6100 2375 6100 2875
Wire Wire Line
	6675 2375 6675 2525
Wire Wire Line
	6775 2300 6025 2300
Wire Wire Line
	6025 2300 6025 2975
Wire Wire Line
	6025 2975 6175 2975
Wire Wire Line
	6775 2300 6775 2525
Wire Wire Line
	6875 2225 5950 2225
Wire Wire Line
	5950 2225 5950 3275
Wire Wire Line
	6875 2225 6875 2525
Wire Wire Line
	6975 2150 5875 2150
Wire Wire Line
	5875 2150 5875 3375
Wire Wire Line
	6975 2150 6975 2525
Wire Wire Line
	5875 3375 6175 3375
Wire Wire Line
	5950 3275 6175 3275
Wire Wire Line
	5800 3075 6175 3075
Wire Wire Line
	5800 3175 6175 3175
Wire Wire Line
	6675 4575 6675 4650
Wire Wire Line
	6025 3475 6025 4650
Wire Wire Line
	6025 4650 6675 4650
Wire Wire Line
	5875 3775 6175 3775
Wire Wire Line
	5875 5025 6775 5025
Wire Wire Line
	5950 3875 6175 3875
Wire Wire Line
	5950 4900 6875 4900
Wire Wire Line
	5775 3975 6175 3975
Wire Wire Line
	5775 4075 6175 4075
Wire Wire Line
	5100 4175 6175 4175
Wire Wire Line
	5500 4275 6175 4275
NoConn ~ 10575 3650
NoConn ~ 10575 3550
$Comp
L MotorControllerShield:MC33926_DUAL U?
U 1 1 60E7467E
P 10100 3475
AR Path="/60E7467E" Ref="U?"  Part="1" 
AR Path="/60D554BE/60E7467E" Ref="U15"  Part="1" 
F 0 "U15" H 10644 2746 50  0000 L CNN
F 1 "MC33926_DUAL" H 10644 2655 50  0000 L CNN
F 2 "motorcontrollershield:Pololu_Dual_MC33926_powerMOD" H 9750 3425 50  0001 C CNN
F 3 "" H 9750 3425 50  0001 C CNN
	1    10100 3475
	1    0    0    -1  
$EndComp
NoConn ~ 9575 4450
Wire Wire Line
	8500 4250 8500 4225
Wire Wire Line
	9500 2950 9575 2950
NoConn ~ 9575 3750
NoConn ~ 9575 3650
NoConn ~ 9575 2850
NoConn ~ 9575 2750
$Comp
L power:+5V #PWR?
U 1 1 60E7468B
P 8500 4225
AR Path="/60E7468B" Ref="#PWR?"  Part="1" 
AR Path="/60D554BE/60E7468B" Ref="#PWR0145"  Part="1" 
F 0 "#PWR0145" H 8500 4075 50  0001 C CNN
F 1 "+5V" H 8376 4247 50  0000 C CNN
F 2 "" H 8500 4225 50  0001 C CNN
F 3 "" H 8500 4225 50  0001 C CNN
	1    8500 4225
	1    0    0    -1  
$EndComp
$Comp
L power:GND #PWR?
U 1 1 60E74691
P 8900 4350
AR Path="/60E74691" Ref="#PWR?"  Part="1" 
AR Path="/60D554BE/60E74691" Ref="#PWR0146"  Part="1" 
F 0 "#PWR0146" H 8900 4100 50  0001 C CNN
F 1 "GND" H 8824 4223 50  0000 C CNN
F 2 "" H 8900 4350 50  0001 C CNN
F 3 "" H 8900 4350 50  0001 C CNN
	1    8900 4350
	1    0    0    -1  
$EndComp
Wire Wire Line
	9275 3850 9275 5100
Wire Wire Line
	10175 4650 10175 5100
Wire Wire Line
	10275 4650 10275 4975
Wire Wire Line
	9350 4975 9350 3950
Wire Wire Line
	9575 3550 9425 3550
Wire Wire Line
	10075 2450 9500 2450
Wire Wire Line
	9500 2450 9500 2950
Wire Wire Line
	10075 2450 10075 2600
Wire Wire Line
	10175 2375 9425 2375
Wire Wire Line
	9425 2375 9425 3050
Wire Wire Line
	9425 3050 9575 3050
Wire Wire Line
	10175 2375 10175 2600
Wire Wire Line
	10275 2300 9350 2300
Wire Wire Line
	9350 2300 9350 3350
Wire Wire Line
	10275 2300 10275 2600
Wire Wire Line
	10375 2225 9275 2225
Wire Wire Line
	9275 2225 9275 3450
Wire Wire Line
	10375 2225 10375 2600
Wire Wire Line
	9275 3450 9575 3450
Wire Wire Line
	9350 3350 9575 3350
Wire Wire Line
	9200 3150 9575 3150
Wire Wire Line
	9200 3250 9575 3250
Wire Wire Line
	10075 4650 10075 4725
Wire Wire Line
	9425 3550 9425 4725
Wire Wire Line
	9425 4725 10075 4725
Wire Wire Line
	9275 3850 9575 3850
Wire Wire Line
	9275 5100 10175 5100
Wire Wire Line
	9350 3950 9575 3950
Wire Wire Line
	9350 4975 10275 4975
Wire Wire Line
	9175 4050 9575 4050
Wire Wire Line
	9175 4150 9575 4150
Wire Wire Line
	8500 4250 9575 4250
Wire Wire Line
	8900 4350 9575 4350
$EndSCHEMATC
