EESchema Schematic File Version 4
EELAYER 30 0
EELAYER END
$Descr A4 11693 8268
encoding utf-8
Sheet 9 13
Title ""
Date ""
Rev ""
Comp ""
Comment1 ""
Comment2 ""
Comment3 ""
Comment4 ""
$EndDescr
$Comp
L Device:R_Small R?
U 1 1 60C7252A
P 5875 4075
AR Path="/60551091/60C7252A" Ref="R?"  Part="1" 
AR Path="/6055E6DD/60C7252A" Ref="R?"  Part="1" 
AR Path="/60C7252A" Ref="R?"  Part="1" 
AR Path="/60E548FA/60C7252A" Ref="R?"  Part="1" 
AR Path="/60EB75CA/60C7252A" Ref="R?"  Part="1" 
AR Path="/60EDF494/60C7252A" Ref="R?"  Part="1" 
AR Path="/60C7013A/60C7252A" Ref="R4"  Part="1" 
AR Path="/60CEBABC/60C7252A" Ref="R?"  Part="1" 
AR Path="/60CED2C5/60C7252A" Ref="R?"  Part="1" 
AR Path="/60CEEA82/60C7252A" Ref="R?"  Part="1" 
AR Path="/60D0F3BC/60C7252A" Ref="R6"  Part="1" 
AR Path="/60D12CCB/60C7252A" Ref="R8"  Part="1" 
AR Path="/60D1496C/60C7252A" Ref="R19"  Part="1" 
AR Path="/60D72C1D/60C7252A" Ref="R21"  Part="1" 
AR Path="/60E0ADF0/60C7252A" Ref="R6"  Part="1" 
AR Path="/60E1043A/60C7252A" Ref="R23"  Part="1" 
AR Path="/60E1209C/60C7252A" Ref="R21"  Part="1" 
AR Path="/60E2CE7E/60C7252A" Ref="R19"  Part="1" 
AR Path="/60E3B510/60C7252A" Ref="R8"  Part="1" 
AR Path="/60E5C973/60C7252A" Ref="R25"  Part="1" 
F 0 "R19" H 5934 4121 50  0000 L CNN
F 1 "10kOhm" H 5934 4030 50  0000 L CNN
F 2 "Resistor_SMD:R_0603_1608Metric" H 5875 4075 50  0001 C CNN
F 3 "~" H 5875 4075 50  0001 C CNN
	1    5875 4075
	0    1    1    0   
$EndComp
$Comp
L power:+5V #PWR?
U 1 1 60C72530
P 5325 3225
AR Path="/60C72530" Ref="#PWR?"  Part="1" 
AR Path="/60AB28B1/60C72530" Ref="#PWR?"  Part="1" 
AR Path="/60E548FA/60C72530" Ref="#PWR?"  Part="1" 
AR Path="/60EB75CA/60C72530" Ref="#PWR?"  Part="1" 
AR Path="/60EDF494/60C72530" Ref="#PWR?"  Part="1" 
AR Path="/60C7013A/60C72530" Ref="#PWR0101"  Part="1" 
AR Path="/60CEBABC/60C72530" Ref="#PWR?"  Part="1" 
AR Path="/60CED2C5/60C72530" Ref="#PWR?"  Part="1" 
AR Path="/60CEEA82/60C72530" Ref="#PWR?"  Part="1" 
AR Path="/60D0F3BC/60C72530" Ref="#PWR0104"  Part="1" 
AR Path="/60D12CCB/60C72530" Ref="#PWR0107"  Part="1" 
AR Path="/60D1496C/60C72530" Ref="#PWR0122"  Part="1" 
AR Path="/60D72C1D/60C72530" Ref="#PWR0132"  Part="1" 
AR Path="/60E0ADF0/60C72530" Ref="#PWR0104"  Part="1" 
AR Path="/60E1043A/60C72530" Ref="#PWR0135"  Part="1" 
AR Path="/60E1209C/60C72530" Ref="#PWR0132"  Part="1" 
AR Path="/60E2CE7E/60C72530" Ref="#PWR0122"  Part="1" 
AR Path="/60E3B510/60C72530" Ref="#PWR0107"  Part="1" 
AR Path="/60E5C973/60C72530" Ref="#PWR0138"  Part="1" 
F 0 "#PWR0122" H 5325 3075 50  0001 C CNN
F 1 "+5V" H 5340 3398 50  0000 C CNN
F 2 "" H 5325 3225 50  0001 C CNN
F 3 "" H 5325 3225 50  0001 C CNN
	1    5325 3225
	1    0    0    -1  
$EndComp
$Comp
L MotorControllerShield:INA125U U?
U 1 1 60C72536
P 5800 3625
AR Path="/60C72536" Ref="U?"  Part="1" 
AR Path="/60E548FA/60C72536" Ref="U?"  Part="1" 
AR Path="/60EB75CA/60C72536" Ref="U?"  Part="1" 
AR Path="/60EDF494/60C72536" Ref="U?"  Part="1" 
AR Path="/60C7013A/60C72536" Ref="U5"  Part="1" 
AR Path="/60CEBABC/60C72536" Ref="U?"  Part="1" 
AR Path="/60CED2C5/60C72536" Ref="U?"  Part="1" 
AR Path="/60CEEA82/60C72536" Ref="U?"  Part="1" 
AR Path="/60D0F3BC/60C72536" Ref="U6"  Part="1" 
AR Path="/60D12CCB/60C72536" Ref="U7"  Part="1" 
AR Path="/60D1496C/60C72536" Ref="U11"  Part="1" 
AR Path="/60D72C1D/60C72536" Ref="U12"  Part="1" 
AR Path="/60E0ADF0/60C72536" Ref="U6"  Part="1" 
AR Path="/60E1043A/60C72536" Ref="U13"  Part="1" 
AR Path="/60E1209C/60C72536" Ref="U12"  Part="1" 
AR Path="/60E2CE7E/60C72536" Ref="U11"  Part="1" 
AR Path="/60E3B510/60C72536" Ref="U7"  Part="1" 
AR Path="/60E5C973/60C72536" Ref="U14"  Part="1" 
F 0 "U11" H 5862 4115 50  0000 C CNN
F 1 "INA125U" H 5862 4024 50  0000 C CNN
F 2 "motorcontrollershield:SOP16_3.9_9.9" H 5575 3700 50  0001 C CNN
F 3 "" H 5575 3700 50  0001 C CNN
	1    5800 3625
	1    0    0    -1  
$EndComp
Wire Wire Line
	5425 3375 5325 3375
Wire Wire Line
	5325 3375 5325 3450
Wire Wire Line
	5325 3450 5425 3450
Wire Wire Line
	5325 3375 5325 3225
Connection ~ 5325 3375
Wire Wire Line
	5425 3525 5150 3525
Wire Wire Line
	5150 3525 5150 3550
Wire Wire Line
	5425 3600 5350 3600
Wire Wire Line
	5350 3600 5350 3675
Wire Wire Line
	5350 3675 5425 3675
Wire Wire Line
	5350 3675 4975 3675
Connection ~ 5350 3675
$Comp
L power:GND #PWR?
U 1 1 60C72548
P 5150 3550
AR Path="/60C72548" Ref="#PWR?"  Part="1" 
AR Path="/60C7013A/60C72548" Ref="#PWR0102"  Part="1" 
AR Path="/60CEBABC/60C72548" Ref="#PWR?"  Part="1" 
AR Path="/60CED2C5/60C72548" Ref="#PWR?"  Part="1" 
AR Path="/60CEEA82/60C72548" Ref="#PWR?"  Part="1" 
AR Path="/60D0F3BC/60C72548" Ref="#PWR0105"  Part="1" 
AR Path="/60D12CCB/60C72548" Ref="#PWR0108"  Part="1" 
AR Path="/60D1496C/60C72548" Ref="#PWR0123"  Part="1" 
AR Path="/60D72C1D/60C72548" Ref="#PWR0133"  Part="1" 
AR Path="/60E0ADF0/60C72548" Ref="#PWR0105"  Part="1" 
AR Path="/60E1043A/60C72548" Ref="#PWR0136"  Part="1" 
AR Path="/60E1209C/60C72548" Ref="#PWR0133"  Part="1" 
AR Path="/60E2CE7E/60C72548" Ref="#PWR0123"  Part="1" 
AR Path="/60E3B510/60C72548" Ref="#PWR0108"  Part="1" 
AR Path="/60E5C973/60C72548" Ref="#PWR0139"  Part="1" 
F 0 "#PWR0123" H 5150 3300 50  0001 C CNN
F 1 "GND" H 5155 3377 50  0000 C CNN
F 2 "" H 5150 3550 50  0001 C CNN
F 3 "" H 5150 3550 50  0001 C CNN
	1    5150 3550
	1    0    0    -1  
$EndComp
Wire Wire Line
	5425 3750 4775 3750
Wire Wire Line
	5425 3900 5275 3900
Wire Wire Line
	5275 3900 5275 4075
Wire Wire Line
	5275 4075 5775 4075
Wire Wire Line
	5975 4075 6425 4075
Wire Wire Line
	6425 4075 6425 3900
Wire Wire Line
	6425 3900 6300 3900
$Comp
L Device:R_Small R?
U 1 1 60C72558
P 6725 3825
AR Path="/60551091/60C72558" Ref="R?"  Part="1" 
AR Path="/6055E6DD/60C72558" Ref="R?"  Part="1" 
AR Path="/60C72558" Ref="R?"  Part="1" 
AR Path="/60E548FA/60C72558" Ref="R?"  Part="1" 
AR Path="/60EB75CA/60C72558" Ref="R?"  Part="1" 
AR Path="/60EDF494/60C72558" Ref="R?"  Part="1" 
AR Path="/60C7013A/60C72558" Ref="R5"  Part="1" 
AR Path="/60CEBABC/60C72558" Ref="R?"  Part="1" 
AR Path="/60CED2C5/60C72558" Ref="R?"  Part="1" 
AR Path="/60CEEA82/60C72558" Ref="R?"  Part="1" 
AR Path="/60D0F3BC/60C72558" Ref="R7"  Part="1" 
AR Path="/60D12CCB/60C72558" Ref="R9"  Part="1" 
AR Path="/60D1496C/60C72558" Ref="R20"  Part="1" 
AR Path="/60D72C1D/60C72558" Ref="R22"  Part="1" 
AR Path="/60E0ADF0/60C72558" Ref="R7"  Part="1" 
AR Path="/60E1043A/60C72558" Ref="R24"  Part="1" 
AR Path="/60E1209C/60C72558" Ref="R22"  Part="1" 
AR Path="/60E2CE7E/60C72558" Ref="R20"  Part="1" 
AR Path="/60E3B510/60C72558" Ref="R9"  Part="1" 
AR Path="/60E5C973/60C72558" Ref="R26"  Part="1" 
F 0 "R20" H 6784 3871 50  0000 L CNN
F 1 "10kOhm" H 6784 3780 50  0000 L CNN
F 2 "Resistor_SMD:R_0603_1608Metric" H 6725 3825 50  0001 C CNN
F 3 "~" H 6725 3825 50  0001 C CNN
	1    6725 3825
	0    -1   -1   0   
$EndComp
$Comp
L power:GND #PWR?
U 1 1 60C7255E
P 7100 3675
AR Path="/60C7255E" Ref="#PWR?"  Part="1" 
AR Path="/60C7013A/60C7255E" Ref="#PWR0103"  Part="1" 
AR Path="/60CEBABC/60C7255E" Ref="#PWR?"  Part="1" 
AR Path="/60CED2C5/60C7255E" Ref="#PWR?"  Part="1" 
AR Path="/60CEEA82/60C7255E" Ref="#PWR?"  Part="1" 
AR Path="/60D0F3BC/60C7255E" Ref="#PWR0106"  Part="1" 
AR Path="/60D12CCB/60C7255E" Ref="#PWR0109"  Part="1" 
AR Path="/60D1496C/60C7255E" Ref="#PWR0124"  Part="1" 
AR Path="/60D72C1D/60C7255E" Ref="#PWR0134"  Part="1" 
AR Path="/60E0ADF0/60C7255E" Ref="#PWR0106"  Part="1" 
AR Path="/60E1043A/60C7255E" Ref="#PWR0137"  Part="1" 
AR Path="/60E1209C/60C7255E" Ref="#PWR0134"  Part="1" 
AR Path="/60E2CE7E/60C7255E" Ref="#PWR0124"  Part="1" 
AR Path="/60E3B510/60C7255E" Ref="#PWR0109"  Part="1" 
AR Path="/60E5C973/60C7255E" Ref="#PWR0140"  Part="1" 
F 0 "#PWR0124" H 7100 3425 50  0001 C CNN
F 1 "GND" H 7105 3502 50  0000 C CNN
F 2 "" H 7100 3675 50  0001 C CNN
F 3 "" H 7100 3675 50  0001 C CNN
	1    7100 3675
	1    0    0    -1  
$EndComp
Wire Wire Line
	7100 3675 6950 3675
Wire Wire Line
	6825 3825 6950 3825
Wire Wire Line
	6950 3825 6950 3675
Connection ~ 6950 3675
Wire Wire Line
	6950 3675 6300 3675
Wire Wire Line
	6625 3825 6525 3825
Wire Wire Line
	6525 3825 6525 4025
Wire Wire Line
	6525 4025 6625 4025
Connection ~ 6525 3825
Wire Wire Line
	6525 3825 6300 3825
Wire Wire Line
	6300 3750 6525 3750
Wire Wire Line
	6525 3750 6525 3825
Text HLabel 4775 3750 0    50   Input ~ 0
INPUT_+
NoConn ~ 6300 3375
NoConn ~ 6300 3450
NoConn ~ 6300 3600
Text HLabel 6625 4025 2    50   Output ~ 0
OUTPUT
Text HLabel 4775 3825 0    50   Input ~ 0
INPUT_-
Wire Wire Line
	4775 3825 5425 3825
Wire Wire Line
	4975 3050 6375 3050
Wire Wire Line
	6375 3050 6375 3525
Wire Wire Line
	6375 3525 6300 3525
Wire Wire Line
	4975 3050 4975 3675
$EndSCHEMATC
