EESchema Schematic File Version 4
EELAYER 30 0
EELAYER END
$Descr A4 11693 8268
encoding utf-8
Sheet 2 14
Title ""
Date ""
Rev ""
Comp ""
Comment1 ""
Comment2 ""
Comment3 ""
Comment4 ""
$EndDescr
$Comp
L Device:CP C?
U 1 1 60B37FC1
P 3476 3593
AR Path="/60B37FC1" Ref="C?"  Part="1" 
AR Path="/60B32878/60B37FC1" Ref="C?"  Part="1" 
AR Path="/60AB28B1/60B37FC1" Ref="C1"  Part="1" 
F 0 "C1" H 3594 3639 50  0000 L CNN
F 1 "0.33uF" H 3594 3548 50  0000 L CNN
F 2 "Capacitor_SMD:C_1206_3216Metric_Pad1.42x1.75mm_HandSolder" H 3514 3443 50  0001 C CNN
F 3 "~" H 3476 3593 50  0001 C CNN
	1    3476 3593
	1    0    0    -1  
$EndComp
Wire Wire Line
	3476 3400 3476 3443
Wire Wire Line
	4372 3400 4372 3438
Wire Wire Line
	3313 3400 3476 3400
Connection ~ 3476 3400
Wire Wire Line
	3476 3400 3714 3400
$Comp
L power:+10V #PWR?
U 1 1 60B37FCC
P 3313 3400
AR Path="/60B37FCC" Ref="#PWR?"  Part="1" 
AR Path="/60B32878/60B37FCC" Ref="#PWR?"  Part="1" 
AR Path="/60AB28B1/60B37FCC" Ref="#PWR05"  Part="1" 
F 0 "#PWR05" H 3313 3250 50  0001 C CNN
F 1 "+10V" H 3328 3573 50  0000 C CNN
F 2 "" H 3313 3400 50  0001 C CNN
F 3 "" H 3313 3400 50  0001 C CNN
	1    3313 3400
	1    0    0    -1  
$EndComp
$Comp
L power:+5V #PWR?
U 1 1 60B37FD2
P 4536 3400
AR Path="/60B37FD2" Ref="#PWR?"  Part="1" 
AR Path="/60B32878/60B37FD2" Ref="#PWR?"  Part="1" 
AR Path="/60AB28B1/60B37FD2" Ref="#PWR07"  Part="1" 
F 0 "#PWR07" H 4536 3250 50  0001 C CNN
F 1 "+5V" H 4633 3461 50  0000 C CNN
F 2 "" H 4536 3400 50  0001 C CNN
F 3 "" H 4536 3400 50  0001 C CNN
	1    4536 3400
	1    0    0    -1  
$EndComp
Wire Wire Line
	4314 3400 4372 3400
Connection ~ 4372 3400
Wire Wire Line
	4372 3400 4536 3400
Wire Wire Line
	3476 3743 4014 3743
Wire Wire Line
	4014 3700 4014 3742
$Comp
L Regulator_Linear:L7805 U?
U 1 1 60B37FDD
P 4014 3400
AR Path="/60B37FDD" Ref="U?"  Part="1" 
AR Path="/60B32878/60B37FDD" Ref="U?"  Part="1" 
AR Path="/60AB28B1/60B37FDD" Ref="U3"  Part="1" 
F 0 "U3" H 4014 3642 50  0000 C CNN
F 1 "L7805" H 4014 3551 50  0000 C CNN
F 2 "motorcontrollershield:L7805" H 4039 3250 50  0001 L CIN
F 3 "http://www.st.com/content/ccc/resource/technical/document/datasheet/41/4f/b3/b0/12/d4/47/88/CD00000444.pdf/files/CD00000444.pdf/jcr:content/translations/en.CD00000444.pdf" H 4014 3350 50  0001 C CNN
	1    4014 3400
	1    0    0    -1  
$EndComp
Wire Wire Line
	4014 3742 4372 3742
Wire Wire Line
	4372 3742 4372 3738
Connection ~ 4014 3742
Wire Wire Line
	4014 3742 4014 3743
Wire Wire Line
	4013 3777 4013 3744
$Comp
L power:GND #PWR?
U 1 1 60B37FEE
P 4013 3777
AR Path="/60B37FEE" Ref="#PWR?"  Part="1" 
AR Path="/60B32878/60B37FEE" Ref="#PWR?"  Part="1" 
AR Path="/60AB28B1/60B37FEE" Ref="#PWR06"  Part="1" 
F 0 "#PWR06" H 4013 3527 50  0001 C CNN
F 1 "GND" H 4018 3604 50  0000 C CNN
F 2 "" H 4013 3777 50  0001 C CNN
F 3 "" H 4013 3777 50  0001 C CNN
	1    4013 3777
	1    0    0    -1  
$EndComp
$Comp
L power:GND #PWR?
U 1 1 60B41404
P 5150 3550
AR Path="/60B41404" Ref="#PWR?"  Part="1" 
AR Path="/60B32878/60B41404" Ref="#PWR?"  Part="1" 
AR Path="/60AB28B1/60B41404" Ref="#PWR09"  Part="1" 
F 0 "#PWR09" H 5150 3300 50  0001 C CNN
F 1 "GND" H 5155 3377 50  0000 C CNN
F 2 "" H 5150 3550 50  0001 C CNN
F 3 "" H 5150 3550 50  0001 C CNN
	1    5150 3550
	1    0    0    -1  
$EndComp
$Comp
L power:+10V #PWR?
U 1 1 60B413FE
P 5150 3300
AR Path="/60B413FE" Ref="#PWR?"  Part="1" 
AR Path="/60B32878/60B413FE" Ref="#PWR?"  Part="1" 
AR Path="/60AB28B1/60B413FE" Ref="#PWR08"  Part="1" 
F 0 "#PWR08" H 5150 3150 50  0001 C CNN
F 1 "+10V" H 5165 3473 50  0000 C CNN
F 2 "" H 5150 3300 50  0001 C CNN
F 3 "" H 5150 3300 50  0001 C CNN
	1    5150 3300
	1    0    0    -1  
$EndComp
$Comp
L power:GND #PWR?
U 1 1 60C340DE
P 6900 3600
AR Path="/60C340DE" Ref="#PWR?"  Part="1" 
AR Path="/60AB28B1/60C340DE" Ref="#PWR011"  Part="1" 
F 0 "#PWR011" H 6900 3350 50  0001 C CNN
F 1 "GND" H 6905 3427 50  0000 C CNN
F 2 "" H 6900 3600 50  0001 C CNN
F 3 "" H 6900 3600 50  0001 C CNN
	1    6900 3600
	1    0    0    -1  
$EndComp
$Comp
L power:+5V #PWR?
U 1 1 60C340E6
P 6900 3200
AR Path="/60C340E6" Ref="#PWR?"  Part="1" 
AR Path="/60AB28B1/60C340E6" Ref="#PWR010"  Part="1" 
F 0 "#PWR010" H 6900 3050 50  0001 C CNN
F 1 "+5V" H 6915 3373 50  0000 C CNN
F 2 "" H 6900 3200 50  0001 C CNN
F 3 "" H 6900 3200 50  0001 C CNN
	1    6900 3200
	1    0    0    -1  
$EndComp
$Comp
L Connector_Generic:Conn_01x02 J?
U 1 1 60FF1029
P 5450 3350
AR Path="/60FF1029" Ref="J?"  Part="1" 
AR Path="/60AB28B1/60FF1029" Ref="J7"  Part="1" 
F 0 "J7" H 5530 3342 50  0000 L CNN
F 1 "Conn_01x02" H 5530 3251 50  0000 L CNN
F 2 "Connector_Molex:Molex_PicoBlade_53398-0271_1x02-1MP_P1.25mm_Vertical" H 5450 3350 50  0001 C CNN
F 3 "~" H 5450 3350 50  0001 C CNN
	1    5450 3350
	1    0    0    -1  
$EndComp
$Comp
L Device:CP C?
U 1 1 60C281FA
P 4372 3588
AR Path="/60C281FA" Ref="C?"  Part="1" 
AR Path="/60B32878/60C281FA" Ref="C?"  Part="1" 
AR Path="/60AB28B1/60C281FA" Ref="C2"  Part="1" 
F 0 "C2" H 4490 3634 50  0000 L CNN
F 1 "0.1uF" H 4490 3543 50  0000 L CNN
F 2 "Capacitor_SMD:C_1206_3216Metric_Pad1.42x1.75mm_HandSolder" H 4410 3438 50  0001 C CNN
F 3 "~" H 4372 3588 50  0001 C CNN
	1    4372 3588
	1    0    0    -1  
$EndComp
$Comp
L Connector_Generic:Conn_01x02 J?
U 1 1 60D3C54D
P 5450 4350
AR Path="/60D3C54D" Ref="J?"  Part="1" 
AR Path="/60AB28B1/60D3C54D" Ref="J17"  Part="1" 
F 0 "J17" H 5530 4342 50  0000 L CNN
F 1 "MSP300_POWER_01x02" H 5530 4251 50  0000 L CNN
F 2 "Connector_Molex:Molex_PicoBlade_53398-0271_1x02-1MP_P1.25mm_Vertical" H 5450 4350 50  0001 C CNN
F 3 "~" H 5450 4350 50  0001 C CNN
	1    5450 4350
	1    0    0    -1  
$EndComp
Wire Wire Line
	5150 3300 5150 3350
Wire Wire Line
	5150 3350 5250 3350
Wire Wire Line
	5250 3450 5150 3450
Wire Wire Line
	5150 3450 5150 3550
$Comp
L power:GND #PWR?
U 1 1 60D3F5BE
P 5150 4550
AR Path="/60D3F5BE" Ref="#PWR?"  Part="1" 
AR Path="/60B32878/60D3F5BE" Ref="#PWR?"  Part="1" 
AR Path="/60AB28B1/60D3F5BE" Ref="#PWR0125"  Part="1" 
F 0 "#PWR0125" H 5150 4300 50  0001 C CNN
F 1 "GND" H 5155 4377 50  0000 C CNN
F 2 "" H 5150 4550 50  0001 C CNN
F 3 "" H 5150 4550 50  0001 C CNN
	1    5150 4550
	1    0    0    -1  
$EndComp
$Comp
L power:+5V #PWR?
U 1 1 60D3F862
P 5150 4250
AR Path="/60D3F862" Ref="#PWR?"  Part="1" 
AR Path="/60AB28B1/60D3F862" Ref="#PWR0126"  Part="1" 
F 0 "#PWR0126" H 5150 4100 50  0001 C CNN
F 1 "+5V" H 5165 4423 50  0000 C CNN
F 2 "" H 5150 4250 50  0001 C CNN
F 3 "" H 5150 4250 50  0001 C CNN
	1    5150 4250
	1    0    0    -1  
$EndComp
Wire Wire Line
	5150 4250 5150 4350
Wire Wire Line
	5150 4350 5250 4350
Wire Wire Line
	5250 4450 5150 4450
Wire Wire Line
	5150 4450 5150 4550
$Comp
L Connector_Generic:Conn_01x02 J?
U 1 1 60D44606
P 7000 4350
AR Path="/60D44606" Ref="J?"  Part="1" 
AR Path="/60AB28B1/60D44606" Ref="J18"  Part="1" 
F 0 "J18" H 7080 4342 50  0000 L CNN
F 1 "POTEN_POWER_01x02" H 7080 4251 50  0000 L CNN
F 2 "Connector_Molex:Molex_PicoBlade_53398-0271_1x02-1MP_P1.25mm_Vertical" H 7000 4350 50  0001 C CNN
F 3 "~" H 7000 4350 50  0001 C CNN
	1    7000 4350
	1    0    0    -1  
$EndComp
$Comp
L Connector_Generic:Conn_01x03 J12
U 1 1 60D61C17
P 6600 3400
F 0 "J12" H 6518 3075 50  0000 C CNN
F 1 "Conn_01x03" H 6518 3166 50  0000 C CNN
F 2 "Connector_PinHeader_2.00mm:PinHeader_1x03_P2.00mm_Vertical" H 6600 3400 50  0001 C CNN
F 3 "~" H 6600 3400 50  0001 C CNN
	1    6600 3400
	-1   0    0    1   
$EndComp
$Comp
L power:+3.3V #PWR0127
U 1 1 60D64241
P 7100 3200
F 0 "#PWR0127" H 7100 3050 50  0001 C CNN
F 1 "+3.3V" H 7115 3373 50  0000 C CNN
F 2 "" H 7100 3200 50  0001 C CNN
F 3 "" H 7100 3200 50  0001 C CNN
	1    7100 3200
	1    0    0    -1  
$EndComp
Wire Wire Line
	6800 3300 6900 3300
Wire Wire Line
	6900 3300 6900 3200
Wire Wire Line
	6800 3400 7100 3400
Wire Wire Line
	7100 3400 7100 3200
Wire Wire Line
	6800 3500 6900 3500
Wire Wire Line
	6900 3500 6900 3600
$Comp
L power:+3.3V #PWR0129
U 1 1 60D65A0C
P 7550 3200
F 0 "#PWR0129" H 7550 3050 50  0001 C CNN
F 1 "+3.3V" H 7565 3373 50  0000 C CNN
F 2 "" H 7550 3200 50  0001 C CNN
F 3 "" H 7550 3200 50  0001 C CNN
	1    7550 3200
	1    0    0    -1  
$EndComp
$Comp
L power:GND #PWR?
U 1 1 60D65D72
P 7550 3550
AR Path="/60D65D72" Ref="#PWR?"  Part="1" 
AR Path="/60AB28B1/60D65D72" Ref="#PWR0130"  Part="1" 
F 0 "#PWR0130" H 7550 3300 50  0001 C CNN
F 1 "GND" H 7555 3377 50  0000 C CNN
F 2 "" H 7550 3550 50  0001 C CNN
F 3 "" H 7550 3550 50  0001 C CNN
	1    7550 3550
	1    0    0    -1  
$EndComp
Wire Wire Line
	7650 3350 7550 3350
Wire Wire Line
	7550 3350 7550 3200
Wire Wire Line
	7650 3450 7550 3450
Wire Wire Line
	7550 3450 7550 3550
$Comp
L power:GND #PWR?
U 1 1 60D67A54
P 6650 4550
AR Path="/60D67A54" Ref="#PWR?"  Part="1" 
AR Path="/60AB28B1/60D67A54" Ref="#PWR0131"  Part="1" 
F 0 "#PWR0131" H 6650 4300 50  0001 C CNN
F 1 "GND" H 6655 4377 50  0000 C CNN
F 2 "" H 6650 4550 50  0001 C CNN
F 3 "" H 6650 4550 50  0001 C CNN
	1    6650 4550
	1    0    0    -1  
$EndComp
Wire Wire Line
	6800 4350 6650 4350
Wire Wire Line
	6650 4350 6650 4250
Wire Wire Line
	6800 4450 6650 4450
Wire Wire Line
	6650 4450 6650 4550
$Comp
L power:+3.3V #PWR0128
U 1 1 60D810D7
P 6650 4250
F 0 "#PWR0128" H 6650 4100 50  0001 C CNN
F 1 "+3.3V" H 6665 4423 50  0000 C CNN
F 2 "" H 6650 4250 50  0001 C CNN
F 3 "" H 6650 4250 50  0001 C CNN
	1    6650 4250
	1    0    0    -1  
$EndComp
$Comp
L Connector_Generic:Conn_01x02 J?
U 1 1 60D827F6
P 7850 3350
AR Path="/60D827F6" Ref="J?"  Part="1" 
AR Path="/60AB28B1/60D827F6" Ref="J19"  Part="1" 
F 0 "J19" H 7930 3342 50  0000 L CNN
F 1 "LM_POWER_01x02" H 7930 3251 50  0000 L CNN
F 2 "Connector_Molex:Molex_PicoBlade_53398-0271_1x02-1MP_P1.25mm_Vertical" H 7850 3350 50  0001 C CNN
F 3 "~" H 7850 3350 50  0001 C CNN
	1    7850 3350
	1    0    0    -1  
$EndComp
$EndSCHEMATC
