Total Data: 18136
Starting Date: 2022-06-14 21:37:08.047161
Neutral Start: 2022-06-14 21:37:08.047161
Valve Check Start: 2022-06-14 21:37:21.831375
Fill Start: 2022-06-14 21:37:22.569969
Fire Start: 2022-06-14 21:37:40.911280
Approach Start: 2022-06-14 21:37:59.453567
Ready State from: 2022-06-14 21:38:04.597696
Final Date: 2022-06-14 21:41:42.029476
