(footprint "sd breakout" (version 20211014) (generator pcbnew)
  (layer "F.Cu")
  (tedit 63E2AB54)
  (attr smd)
  (fp_text reference "REF**" (at -0.01 -13.67 unlocked) (layer "F.SilkS")
    (effects (font (size 1 1) (thickness 0.15)))
    (tstamp de2abbd8-9b48-47ba-b77e-4c65ca048af6)
  )
  (fp_text value "sd breakout" (at 0.01 13.78 unlocked) (layer "F.Fab")
    (effects (font (size 1 1) (thickness 0.15)))
    (tstamp 0ab1512b-eb91-4574-b11f-326e0ff10082)
  )
  (fp_text user "${REFERENCE}" (at -18.369 9.815) (layer "F.Fab")
    (effects (font (size 1 1) (thickness 0.15)))
    (tstamp 09381f26-cb4f-4b8c-80c5-d067e9a87956)
  )
  (fp_text user "${REFERENCE}" (at 0.01 15.28 unlocked) (layer "F.Fab")
    (effects (font (size 1 1) (thickness 0.15)))
    (tstamp 9a458d6a-a84c-4faf-913e-90bab231d3f8)
  )
  (fp_text user "${REFERENCE}" (at 19.005 9.779) (layer "F.Fab")
    (effects (font (size 1 1) (thickness 0.15)))
    (tstamp c01bd657-afb5-4d94-861b-3bd3dc15337d)
  )
  (fp_text user "${REFERENCE}" (at -19.131 -10.378) (layer "F.Fab")
    (effects (font (size 1 1) (thickness 0.15)))
    (tstamp c7ac6f4f-aec0-40a4-ae50-e19ba44f04bd)
  )
  (fp_text user "${REFERENCE}" (at 19.005 -9.779) (layer "F.Fab")
    (effects (font (size 1 1) (thickness 0.15)))
    (tstamp e7ab17fa-eddb-4f4f-b438-aee088a01de3)
  )
  (fp_line (start 20.85 -11.955) (end 20.85 11.955) (layer "F.SilkS") (width 0.12) (tstamp 0ea0e524-3bbd-4f05-896d-54b702c204b2))
  (fp_line (start -20.85 11.955) (end 20.85 11.955) (layer "F.SilkS") (width 0.12) (tstamp 802bd717-75a4-4efc-bdc3-ab512c6bce65))
  (fp_line (start -20.85 -11.955) (end -20.85 11.955) (layer "F.SilkS") (width 0.12) (tstamp d66c8b0e-b6b3-43ea-8c6d-9724edcc57d6))
  (fp_line (start -20.85 -11.955) (end 20.85 -11.955) (layer "F.SilkS") (width 0.12) (tstamp ee80c1b4-78a3-4713-a7cd-fc09dd9d2b28))
  (pad "" np_thru_hole circle (at -19.431 10.378) (size 2 2) (drill 2) (layers F&B.Cu *.Mask) (tstamp 4db9ece0-e4db-4e6b-b8ad-7e41a1453f74))
  (pad "" np_thru_hole circle (at 19.431 10.378) (size 2 2) (drill 2) (layers F&B.Cu *.Mask) (tstamp 5edc5fc5-317b-45f8-bc2d-8921d8220cef))
  (pad "" np_thru_hole circle (at -19.431 -10.378) (size 2 2) (drill 2) (layers F&B.Cu *.Mask) (tstamp 6ac8cc6e-f010-4a41-8d99-06824f00b47e))
  (pad "" np_thru_hole circle (at 19.431 -10.378) (size 2 2) (drill 2) (layers F&B.Cu *.Mask) (tstamp 733c4271-0e9f-41e5-91df-309c7440d3c0))
  (pad "1" thru_hole circle (at 18.57 6.35) (size 1.7 1.7) (drill 1.02) (layers *.Cu *.Mask) (tstamp b027388d-8092-416a-ae2f-62be7825303f))
  (pad "2" thru_hole circle (at 18.57 3.81) (size 1.7 1.7) (drill 1.02) (layers *.Cu *.Mask) (tstamp 5c4ddc3a-1b67-4d06-8b43-5f565c9d4f71))
  (pad "3" thru_hole circle (at 18.57 1.27) (size 1.7 1.7) (drill 1.02) (layers *.Cu *.Mask) (tstamp d32a4687-3a9c-4aaa-9fc8-6c464698f554))
  (pad "4" thru_hole circle (at 18.57 -1.27) (size 1.7 1.7) (drill 1.02) (layers *.Cu *.Mask) (tstamp 18eef4d3-c3b1-4511-89f0-f3ca5fbf521d))
  (pad "5" thru_hole circle (at 18.57 -3.81) (size 1.7 1.7) (drill 1.02) (layers *.Cu *.Mask) (tstamp 22591446-6d82-47ac-b525-9e9deb496c8c))
  (pad "6" thru_hole circle (at 18.57 -6.35) (size 1.7 1.7) (drill 1.02) (layers *.Cu *.Mask) (tstamp cbdd084c-3cde-4340-9de6-6f6ca3f79e91))
)
