<?xml version="1.0" encoding="UTF-8" standalone="no"?>
<svg
   xmlns:shaper="http://www.shapertools.com/namespaces/shaper"
   xmlns:dc="http://purl.org/dc/elements/1.1/"
   xmlns:cc="http://creativecommons.org/ns#"
   xmlns:rdf="http://www.w3.org/1999/02/22-rdf-syntax-ns#"
   xmlns:svg="http://www.w3.org/2000/svg"
   xmlns="http://www.w3.org/2000/svg"
   xmlns:sodipodi="http://sodipodi.sourceforge.net/DTD/sodipodi-0.dtd"
   xmlns:inkscape="http://www.inkscape.org/namespaces/inkscape"
   enable-background="new 0 0 19.5 26.3"
   height="20.5cm"
   shaper:fusionaddin="version:1.5.0"
   version="1.1"
   viewBox="0 0 27.300001 20.500001"
   width="27.300001cm"
   x="0cm"
   xml:space="preserve"
   y="0cm"
   id="svg72"
   sodipodi:docname="Right panel.svg"
   inkscape:version="1.0 (4035a4fb49, 2020-05-01)"><metadata
     id="metadata78"><rdf:RDF><cc:Work
         rdf:about=""><dc:format>image/svg+xml</dc:format><dc:type
           rdf:resource="http://purl.org/dc/dcmitype/StillImage" /><dc:title /></cc:Work></rdf:RDF></metadata><defs
     id="defs76"><inkscape:path-effect
       effect="fillet_chamfer"
       id="path-effect1001"
       is_visible="true"
       lpeversion="1"
       satellites_param="F,0,0,1,0,0,0,1 @ F,0,0,1,0,0,0,1 @ F,0,0,1,0,2.3175749,0,1 @ F,0,0,1,0,2.3,0,1"
       unit="px"
       method="auto"
       mode="F"
       radius="4"
       chamfer_steps="1"
       flexible="false"
       use_knot_distance="true"
       apply_no_radius="true"
       apply_with_radius="true"
       only_selected="true"
       hide_knots="false" /><inkscape:path-effect
       effect="fillet_chamfer"
       id="path-effect999"
       is_visible="true"
       lpeversion="1"
       satellites_param="F,0,0,1,0,0,0,1 @ F,0,0,1,0,0,0,1 @ F,0,0,1,0,0,0,1 @ F,0,0,1,0,0,0,1"
       unit="px"
       method="auto"
       mode="F"
       radius="2.6"
       chamfer_steps="1"
       flexible="false"
       use_knot_distance="true"
       apply_no_radius="true"
       apply_with_radius="true"
       only_selected="true"
       hide_knots="false" /></defs><sodipodi:namedview
     inkscape:document-rotation="0"
     pagecolor="#ffffff"
     bordercolor="#666666"
     borderopacity="1"
     objecttolerance="10"
     gridtolerance="10"
     guidetolerance="10"
     inkscape:pageopacity="0"
     inkscape:pageshadow="2"
     inkscape:window-width="1920"
     inkscape:window-height="1051"
     id="namedview74"
     showgrid="false"
     fit-margin-top="0"
     fit-margin-left="0"
     fit-margin-right="0"
     fit-margin-bottom="0"
     inkscape:zoom="0.98103854"
     inkscape:cx="428.22414"
     inkscape:cy="277.53121"
     inkscape:window-x="-9"
     inkscape:window-y="-9"
     inkscape:window-maximized="1"
     inkscape:current-layer="svg72" /><g
     id="g100"
     transform="rotate(-90,10.25,10.25)"><path
       style="stroke:#ff0000;stroke-opacity:1"
       id="path2"
       vector-effect="non-scaling-stroke"
       stroke="rgb(100,100,100)"
       shaper:pathType="guide"
       shaper:cutDepth="0"
       fill="none"
       d="m 18.25,1.9406249 a 0.25,0.25 0 1 0 -0.5,0 0.25,0.25 0 1 0 0.5,0 z" /><path
       style="stroke:#ff0000;stroke-opacity:1"
       id="path4"
       vector-effect="non-scaling-stroke"
       stroke="rgb(100,100,100)"
       shaper:pathType="guide"
       shaper:cutDepth="0"
       fill="none"
       d="m 6.5833667,24.8 a 0.25,0.25 0 1 0 -0.5,0 0.25,0.25 0 1 0 0.5,0 z" /><path
       style="stroke:#ff0000;stroke-opacity:1"
       id="path6"
       vector-effect="non-scaling-stroke"
       stroke="rgb(100,100,100)"
       shaper:pathType="guide"
       shaper:cutDepth="0"
       fill="none"
       d="m 18.25,24.8 a 0.25,0.25 0 1 0 -0.5,0 0.25,0.25 0 1 0 0.5,0 z" /><path
       style="stroke:#ff0000;stroke-opacity:1"
       id="path8"
       vector-effect="non-scaling-stroke"
       stroke="rgb(100,100,100)"
       shaper:pathType="guide"
       shaper:cutDepth="0"
       fill="none"
       d="m 3.05,11.65 a 0.3,0.3 0 1 0 -0.6,0 0.3,0.3 0 1 0 0.6,0 z" /><path
       style="stroke:#ff0000;stroke-opacity:1"
       id="path10"
       vector-effect="non-scaling-stroke"
       stroke="rgb(100,100,100)"
       shaper:pathType="guide"
       shaper:cutDepth="0"
       fill="none"
       d="m 6.5833667,1.9406249 a 0.25,0.25 0 1 0 -0.5,0 0.25,0.25 0 1 0 0.5,0 z" /><path
       style="stroke:#ff0000;stroke-opacity:1"
       id="path12"
       vector-effect="non-scaling-stroke"
       stroke="rgb(100,100,100)"
       shaper:pathType="guide"
       shaper:cutDepth="0"
       fill="none"
       d="m 12.05,11.65 a 0.3,0.3 0 1 0 -0.6,0 0.3,0.3 0 1 0 0.6,0 z" /><path
       style="stroke:#ff0000;stroke-opacity:1"
       id="path14"
       vector-effect="non-scaling-stroke"
       stroke="rgb(100,100,100)"
       shaper:pathType="guide"
       shaper:cutDepth="0"
       fill="none"
       d="m 16.55,11.65 a 0.3,0.3 0 1 0 -0.6,0 0.3,0.3 0 1 0 0.6,0 z" /><path
       style="stroke:#ff0000;stroke-opacity:1"
       id="path16"
       vector-effect="non-scaling-stroke"
       stroke="rgb(100,100,100)"
       shaper:pathType="guide"
       shaper:cutDepth="0"
       fill="none"
       d="m 3.15,17.15 a 0.4,0.4 0 1 0 -0.8,0 0.4,0.4 0 1 0 0.8,0 z" /><path
       style="stroke:#ff0000;stroke-opacity:1"
       id="path18"
       vector-effect="non-scaling-stroke"
       stroke="rgb(100,100,100)"
       shaper:pathType="guide"
       shaper:cutDepth="0"
       fill="none"
       d="m 7.55,11.65 a 0.3,0.3 0 1 0 -0.6,0 0.3,0.3 0 1 0 0.6,0 z" /><path
       style="stroke:#ff0000;stroke-opacity:1"
       id="path20"
       vector-effect="non-scaling-stroke"
       stroke="rgb(100,100,100)"
       shaper:pathType="guide"
       shaper:cutDepth="0"
       fill="none"
       d="m 7.65,17.15 a 0.4,0.4 0 1 0 -0.8,0 0.4,0.4 0 1 0 0.8,0 z" /><path
       style="stroke:#ff0000;stroke-opacity:1"
       id="path22"
       vector-effect="non-scaling-stroke"
       stroke="rgb(100,100,100)"
       shaper:pathType="guide"
       shaper:cutDepth="0"
       fill="none"
       d="m 12.15,17.15 a 0.4,0.4 0 1 0 -0.8,0 0.4,0.4 0 1 0 0.8,0 z" /><path
       style="stroke:#ff0000;stroke-opacity:1"
       id="path24"
       vector-effect="non-scaling-stroke"
       stroke="rgb(100,100,100)"
       shaper:pathType="guide"
       shaper:cutDepth="0"
       fill="none"
       d="m 16.65,17.15 a 0.4,0.4 0 1 0 -0.8,0 0.4,0.4 0 1 0 0.8,0 z" /><path
       style="stroke:#ff0000;stroke-opacity:1"
       id="path26"
       vector-effect="non-scaling-stroke"
       stroke="rgb(100,100,100)"
       shaper:pathType="guide"
       shaper:cutDepth="0"
       fill="none"
       d="m 3.35,6.15 a 0.6,0.6 0 1 0 -1.2,0 0.6,0.6 0 1 0 1.2,0 z" /><path
       style="stroke:#ff0000;stroke-opacity:1"
       id="path28"
       vector-effect="non-scaling-stroke"
       stroke="rgb(100,100,100)"
       shaper:pathType="guide"
       shaper:cutDepth="0"
       fill="none"
       d="m 7.85,6.15 a 0.6,0.6 0 1 0 -1.2,0 0.6,0.6 0 1 0 1.2,0 z" /><path
       style="stroke:#ff0000;stroke-opacity:1"
       id="path30"
       vector-effect="non-scaling-stroke"
       stroke="rgb(100,100,100)"
       shaper:pathType="guide"
       shaper:cutDepth="0"
       fill="none"
       d="m 12.35,6.15 a 0.6,0.6 0 1 0 -1.2,0 0.6,0.6 0 1 0 1.2,0 z" /><path
       style="stroke:#ff0000;stroke-opacity:1"
       id="path32"
       vector-effect="non-scaling-stroke"
       stroke="rgb(100,100,100)"
       shaper:pathType="guide"
       shaper:cutDepth="0"
       fill="none"
       d="m 16.85,6.15 a 0.6,0.6 0 1 0 -1.2,0 0.6,0.6 0 1 0 1.2,0 z" /><path
       inkscape:original-d="M 0.5,0.5 V 26.8 H 20 V 0.5 Z"
       inkscape:path-effect="#path-effect1001"
       style="stroke:#ff0000;stroke-opacity:1"
       id="path34"
       vector-effect="non-scaling-stroke"
       stroke="rgb(100,100,100)"
       shaper:pathType="guide"
       shaper:cutDepth="0"
       fill="none"
       d="M 0.5,0.5 V 26.8 H 17.682425 A 2.3175749,2.3175749 135 0 0 20,24.482425 V 2.8 A 2.3,2.3 45 0 0 17.7,0.5 Z" /><path
       style="stroke:#0000ff;stroke-opacity:1"
       id="path36"
       vector-effect="non-scaling-stroke"
       stroke="rgb(100,100,100)"
       shaper:pathType="guide"
       shaper:cutDepth="0"
       fill="none"
       d="m 2.75,2.8 h -2 v 16.15 h 2 2 V 2.8 Z" /><path
       style="stroke:#0000ff;stroke-opacity:1"
       id="path38"
       vector-effect="non-scaling-stroke"
       stroke="rgb(100,100,100)"
       shaper:pathType="guide"
       shaper:cutDepth="0"
       fill="none"
       d="m 0.75,17.95 h 4" /><path
       style="stroke:#0000ff;stroke-opacity:1"
       id="path40"
       vector-effect="non-scaling-stroke"
       stroke="rgb(100,100,100)"
       shaper:pathType="guide"
       shaper:cutDepth="0"
       fill="none"
       d="m 7.25,2.8 h -2 v 16.15 h 2 2 V 2.8 Z" /><path
       style="stroke:#0000ff;stroke-opacity:1"
       id="path42"
       vector-effect="non-scaling-stroke"
       stroke="rgb(100,100,100)"
       shaper:pathType="guide"
       shaper:cutDepth="0"
       fill="none"
       d="m 5.25,17.95 h 4" /><path
       style="stroke:#0000ff;stroke-opacity:1"
       id="path44"
       vector-effect="non-scaling-stroke"
       stroke="rgb(100,100,100)"
       shaper:pathType="guide"
       shaper:cutDepth="0"
       fill="none"
       d="M 11.744993,2.7952186 H 9.7449934 V 18.945219 h 1.9999996 2 V 2.7952186 Z" /><path
       style="stroke:#0000ff;stroke-opacity:1"
       id="path46"
       vector-effect="non-scaling-stroke"
       stroke="rgb(100,100,100)"
       shaper:pathType="guide"
       shaper:cutDepth="0"
       fill="none"
       d="m 9.75,17.95 h 4" /><path
       style="stroke:#0000ff;stroke-opacity:1"
       id="path48"
       vector-effect="non-scaling-stroke"
       stroke="rgb(100,100,100)"
       shaper:pathType="guide"
       shaper:cutDepth="0"
       fill="none"
       d="m 16.25,2.8 h -2 v 16.15 h 2 2 V 2.8 Z" /><path
       style="stroke:#0000ff;stroke-opacity:1"
       id="path50"
       vector-effect="non-scaling-stroke"
       stroke="rgb(100,100,100)"
       shaper:pathType="guide"
       shaper:cutDepth="0"
       fill="none"
       d="m 14.25,17.95 h 4" /><path
       style="stroke:#0000ff;stroke-opacity:1"
       id="path52"
       vector-effect="non-scaling-stroke"
       stroke="rgb(100,100,100)"
       shaper:pathType="guide"
       shaper:cutDepth="0"
       fill="none"
       d="m 1.618554,18.75 v -0.6 h 0.0794 v 0.6 z" /><path
       style="stroke:#0000ff;stroke-opacity:1"
       id="path54"
       vector-effect="non-scaling-stroke"
       stroke="rgb(100,100,100)"
       shaper:pathType="guide"
       shaper:cutDepth="0"
       fill="none"
       d="m 1.8150069,18.786016 0.071624,0.01064 v 0 l 0.00289,0.01387 0.00199,0.0066 0.00264,0.0063 0.00348,0.0058 0.00423,0.0054 0.00973,0.0102 v 0 l 0.017495,0.0094 0.00897,0.0039 0.00924,0.003 0.00953,0.002 0.00976,0.0012 0.019897,0.0011 v 0 l 0.020903,-9.44e-4 0.010268,-0.0011 0.010047,-0.0019 0.00976,-0.003 0.00949,-0.0039 0.018525,-0.0095 v 0 l 0.012883,-0.01202 0.00584,-0.0064 0.00511,-0.0069 0.00426,-0.0075 0.00357,-0.0079 0.00599,-0.01659 v 0 l 0.00307,-0.02351 0.00191,-0.0236 5.256e-4,-0.02369 -1.841e-4,-0.02374 v 0 l -0.012644,0.01221 -0.012948,0.01157 -0.013556,0.01027 -0.0071,0.0045 -0.00737,0.0039 -0.00766,0.0033 -0.00793,0.0027 -0.016523,0.004 -0.017143,0.0026 -0.017453,0.002 v 0 l -0.0203,-0.0019 -0.01993,-0.0026 -0.019189,-0.0042 -0.0092,-0.0029 -0.00888,-0.0036 -0.00851,-0.0044 -0.00817,-0.0051 -0.015508,-0.01195 -0.014723,-0.0136 -0.014331,-0.01443 v 0 l -0.010959,-0.01784 -0.010331,-0.01804 -0.00908,-0.01844 -0.00719,-0.01905 -0.00496,-0.01977 -0.00319,-0.02034 -0.002,-0.02072 -0.00141,-0.02091 v 0 l 0.00161,-0.0295 0.00148,-0.01461 0.00229,-0.01445 0.0033,-0.01425 0.00414,-0.01409 0.00969,-0.02789 v 0 l 0.012237,-0.02362 0.0068,-0.01126 0.00762,-0.01059 0.00865,-0.0098 0.00951,-0.0091 0.020466,-0.01695 v 0 l 0.02359,-0.01243 0.012062,-0.0053 0.012382,-0.0042 0.01276,-0.0029 0.013061,-0.0019 0.026624,-0.002 v 0 l 0.018593,0.0022 0.018241,0.0029 0.017538,0.0043 0.0084,0.0029 0.00809,0.0036 0.00776,0.0042 0.00745,0.0049 0.014177,0.01123 0.013489,0.01264 0.013144,0.01335 v -0.05239 h 0.06794 v 0.375716 0 l -3.636e-4,0.03675 -9.098e-4,0.01826 -0.00178,0.01811 -0.00295,0.01792 -0.00418,0.01772 -0.010489,0.03509 v 0 l -0.012686,0.02031 -0.00698,0.0095 -0.00775,0.0088 -0.00866,0.0079 -0.0094,0.0072 -0.020013,0.01319 v 0 l -0.026449,0.01101 -0.013426,0.0046 -0.013668,0.0036 -0.013941,0.0024 -0.014154,0.0015 -0.028662,0.0014 v 0 l -0.033386,-0.002 -0.016373,-0.0021 -0.015989,-0.0034 -0.015493,-0.0051 -0.015049,-0.0066 -0.029358,-0.0158 v 0 l -0.010854,-0.01087 -0.010182,-0.01117 -0.00884,-0.01178 -0.00371,-0.0062 -0.00312,-0.0065 -0.00451,-0.01375 -0.00269,-0.01458 -0.00148,-0.01513 z" /><path
       style="stroke:#0000ff;stroke-opacity:1"
       id="path56"
       vector-effect="non-scaling-stroke"
       stroke="rgb(100,100,100)"
       shaper:pathType="guide"
       shaper:cutDepth="0"
       fill="none"
       d="m 1.8759891,18.524898 v 0 l 0.00124,0.03337 0.00175,0.01635 0.00311,0.01594 0.00491,0.01541 0.00666,0.01488 0.00785,0.01453 0.00844,0.01435 v 0 l 0.018204,0.01651 0.00963,0.0071 0.010253,0.0057 0.011023,0.0041 0.011656,0.0027 0.024368,0.0031 v 0 l 0.024315,-0.0031 0.011638,-0.0027 0.011014,-0.0041 0.010258,-0.0057 0.00964,-0.0071 0.018262,-0.01638 v 0 l 0.00848,-0.01404 0.0079,-0.01422 0.00672,-0.01458 0.00497,-0.01512 0.00317,-0.01567 0.0018,-0.01608 0.00133,-0.03286 v 0 l -0.0016,-0.03237 -0.00195,-0.01582 -0.00333,-0.01539 -0.00514,-0.01481 -0.00684,-0.01428 -0.016531,-0.02766 v 0 l -0.018225,-0.01676 -0.00963,-0.0073 -0.010261,-0.0059 -0.011041,-0.0043 -0.011695,-0.0029 -0.024479,-0.0034 v 0 l -0.024,0.0034 -0.011459,0.0028 -0.01081,0.0042 -0.010033,0.0058 -0.00941,0.0072 -0.01778,0.01653 v 0 l -0.016074,0.02729 -0.00665,0.01408 -0.00499,0.01459 -0.00323,0.01514 -0.00189,0.01556 z" /><path
       style="stroke:#0000ff;stroke-opacity:1"
       id="path58"
       vector-effect="non-scaling-stroke"
       stroke="rgb(100,100,100)"
       shaper:pathType="guide"
       shaper:cutDepth="0"
       fill="none"
       d="m 2.2946795,18.75 v -0.434652 h 0.066303 v 0.0618 0 l 0.013738,-0.01575 0.014196,-0.01488 0.00741,-0.0068 0.0077,-0.0063 0.00804,-0.0056 0.00844,-0.0049 0.00888,-0.004 0.00927,-0.0033 0.0096,-0.0026 0.00988,-0.0021 0.020368,-0.0031 0.020813,-0.0022 v 0 l 0.01856,0.001 0.018291,0.0024 0.017834,0.0047 0.017553,0.0061 v 0 l 0.014079,0.007 0.013166,0.0082 0.00597,0.0049 0.00558,0.0054 0.010518,0.01163 v 0 l 0.00771,0.01277 0.0066,0.01324 0.00482,0.01399 0.00379,0.01444 v 0 l 0.00213,0.01783 0.00142,0.01788 5.501e-4,0.03591 V 18.75 h -0.07367 v -0.264393 0 l -2.481e-4,-0.0171 -0.00119,-0.01697 -0.00294,-0.01672 -0.00422,-0.01654 v 0 l -0.00552,-0.01069 -0.00668,-0.0097 -0.00858,-0.0081 -0.0097,-0.0071 v 0 l -0.012184,-0.0058 -0.012553,-0.0044 -0.013143,-0.0022 -0.013485,-8.92e-4 v 0 l -0.022242,0.0023 -0.010794,0.002 -0.010402,0.0031 -0.00992,0.0044 -0.00952,0.0055 -0.018368,0.01272 v 0 l -0.00881,0.01263 -0.00815,0.01285 -0.00683,0.0133 -0.0049,0.01396 -0.00302,0.0146 -0.00161,0.01508 -8.567e-4,0.03096 V 18.75 Z" /><path
       style="stroke:#0000ff;stroke-opacity:1"
       id="path60"
       vector-effect="non-scaling-stroke"
       stroke="rgb(100,100,100)"
       shaper:pathType="guide"
       shaper:cutDepth="0"
       fill="none"
       d="M 2.7612551,18.23472 V 18.15 h 0.07367 v 0.08472 z" /><path
       style="stroke:#0000ff;stroke-opacity:1"
       id="path62"
       vector-effect="non-scaling-stroke"
       stroke="rgb(100,100,100)"
       shaper:pathType="guide"
       shaper:cutDepth="0"
       fill="none"
       d="m 2.7612551,18.75 v -0.434652 h 0.07367 V 18.75 Z" /><path
       style="stroke:#0000ff;stroke-opacity:1"
       id="path64"
       vector-effect="non-scaling-stroke"
       stroke="rgb(100,100,100)"
       shaper:pathType="guide"
       shaper:cutDepth="0"
       fill="none"
       d="m 3.1079128,18.684106 0.010641,0.06508 v 0 l -0.027668,0.0047 -0.027994,0.0019 v 0 l -0.016132,-5.33e-4 -0.015839,-0.0019 -0.00772,-0.0018 -0.00758,-0.0025 -0.014935,-0.006 v 0 l -0.00966,-0.0066 -0.00866,-0.0075 -0.00693,-0.0091 -0.00586,-0.01011 v 0 l -0.00489,-0.02141 -0.00188,-0.01078 -0.00126,-0.01085 -0.00103,-0.0219 5.42e-5,-0.02203 V 18.372647 H 2.906545 v -0.0573 h 0.054028 v -0.10764 l 0.073261,-0.0442 v 0.151842 h 0.074079 v 0.0573 H 3.033834 v 0.254161 0 l 3.781e-4,0.02044 0.00136,0.01008 0.00215,0.01 v 0 l 0.0052,0.0082 0.00749,0.0061 v 0 l 0.00602,0.0025 0.00618,0.0018 0.012965,9.96e-4 v 0 l 0.016212,-8.88e-4 z" /><path
       style="stroke:#0000ff;stroke-opacity:1"
       id="path66"
       vector-effect="non-scaling-stroke"
       stroke="rgb(100,100,100)"
       shaper:pathType="guide"
       shaper:cutDepth="0"
       fill="none"
       d="m 3.4774898,18.610027 0.076126,0.0094 v 0 l -0.010683,0.0298 -0.00634,0.01425 -0.00754,0.01347 -0.00904,0.01248 -0.010325,0.01165 -0.022783,0.0219 v 0 l -0.028899,0.01641 -0.014842,0.0069 -0.015314,0.0054 -0.015851,0.0036 -0.016271,0.0023 -0.033243,0.0022 v 0 l -0.021226,-0.0015 -0.020938,-0.0023 -0.020363,-0.0037 -0.00988,-0.0026 -0.00962,-0.0032 -0.00934,-0.0039 -0.00906,-0.0046 -0.017458,-0.01096 -0.016827,-0.01254 -0.016512,-0.01333 v 0 l -0.013045,-0.01844 -0.012229,-0.01873 -0.010595,-0.01931 -0.00443,-0.01 -0.00372,-0.01021 -0.00302,-0.01046 -0.0024,-0.01068 -0.00331,-0.0219 -0.00191,-0.0224 -0.0012,-0.02265 v 0 l 0.00119,-0.02333 0.0019,-0.02308 0.00333,-0.02258 0.00242,-0.01103 0.00305,-0.01081 0.00376,-0.01056 0.00448,-0.01031 0.010731,-0.02 0.012399,-0.01942 0.013232,-0.01913 v 0 l 0.015852,-0.01344 0.016172,-0.01268 0.016811,-0.01116 0.00875,-0.0048 0.00902,-0.0041 0.00932,-0.0034 0.00959,-0.0028 0.019827,-0.004 0.020436,-0.0025 0.020741,-0.0018 v 0 l 0.020182,0.0018 0.019882,0.0025 0.019283,0.0039 0.00932,0.0027 0.00906,0.0033 0.00877,0.004 0.0085,0.0047 0.01633,0.01091 0.015706,0.01239 0.015394,0.01313 v 0 l 0.012953,0.01877 0.012136,0.01905 0.010502,0.01962 0.00438,0.01011 0.00368,0.01036 0.00298,0.0106 0.00237,0.01081 0.00325,0.02214 0.00185,0.02263 0.00115,0.02287 v 0 l -4.091e-4,0.01965 H 3.2315342 v 0 l 0.00351,0.02998 0.00282,0.01458 0.0041,0.01408 0.00576,0.01344 0.00727,0.01286 0.017055,0.02474 v 0 l 0.019901,0.0162 0.010433,0.0069 0.011013,0.0056 0.011714,0.0039 0.012283,0.0026 0.025515,0.0029 v 0 l 0.018508,-0.0014 0.00905,-0.0014 0.00881,-0.0021 0.0085,-0.0031 0.00824,-0.0039 0.016053,-0.0093 v 0 l 0.014857,-0.01458 0.00679,-0.0077 0.00603,-0.0083 0.00519,-0.0088 0.00455,-0.0093 z" /><path
       style="stroke:#0000ff;stroke-opacity:1"
       id="path68"
       vector-effect="non-scaling-stroke"
       stroke="rgb(100,100,100)"
       shaper:pathType="guide"
       shaper:cutDepth="0"
       fill="none"
       d="m 3.2356075,18.490928 h 0.242701 v 0 l -0.00286,-0.02203 -0.00208,-0.01078 -0.00285,-0.01051 -0.00388,-0.01014 -0.00485,-0.0098 -0.011322,-0.01901 v 0 l -0.019362,-0.01803 -0.010272,-0.0078 -0.010981,-0.0062 -0.011844,-0.0044 -0.012546,-0.0029 -0.026264,-0.0033 v 0 l -0.023728,0.0025 -0.011459,0.0023 -0.010974,0.0035 -0.010374,0.005 -0.00988,0.0062 -0.018923,0.0145 v 0 l -0.015548,0.02014 -0.00672,0.01052 -0.00545,0.01107 -0.00399,0.0117 -0.00283,0.0122 z" /><path
       style="stroke:#0000ff;stroke-opacity:1"
       id="path70"
       vector-effect="non-scaling-stroke"
       stroke="rgb(100,100,100)"
       shaper:pathType="guide"
       shaper:cutDepth="0"
       fill="none"
       d="m 3.6452935,18.75 v -0.434652 h 0.066303 v 0.06589 0 l 0.00959,-0.01694 0.01063,-0.01611 0.00603,-0.0075 0.00656,-0.0071 0.014049,-0.01338 v 0 l 0.011035,-0.0062 0.011461,-0.0048 0.012174,-0.0025 0.012602,-0.0012 v 0 l 0.020067,0.0022 0.00983,0.0018 0.00959,0.0026 0.00931,0.0035 0.00909,0.0042 0.017822,0.0096 -0.025375,0.06835 v 0 l -0.012781,-0.0065 -0.013166,-0.0052 -0.013831,-0.0029 -0.014247,-0.0014 v 0 l -0.011683,0.0011 -0.011227,0.0025 -0.010465,0.0048 -0.010009,0.0061 v 0 l -0.00907,0.0086 -0.00783,0.0094 -0.00584,0.01078 -0.00468,0.01157 v 0 l -0.00534,0.02116 -0.00407,0.02134 -0.00203,0.02164 -8.424e-4,0.02181 V 18.75 Z" /><g
       id="g1330"
       transform="matrix(0.04531998,0,0,0.04511481,5.429477,20.180144)"
       style="stroke:#0000ff;stroke-width:1.00012;stroke-miterlimit:4;stroke-dasharray:none;stroke-opacity:1"><g
         transform="matrix(0.90365268,0,0,0.90917372,18.714117,9.7089423)"
         style="fill:none;stroke:#0000ff;stroke-width:1.10339;stroke-miterlimit:4;stroke-dasharray:none;stroke-opacity:1"
         id="g1015"><g
           style="fill:none;stroke:#0000ff;stroke-width:1.10339;stroke-miterlimit:4;stroke-dasharray:none;stroke-opacity:1"
           id="g1013"><path
             style="fill:none;stroke:#0000ff;stroke-width:1.10339;stroke-miterlimit:4;stroke-dasharray:none;stroke-opacity:1"
             fill="#6672d8"
             d="m 149.613,41.189 c -0.763,-2.987 -1.768,-5.934 -3.048,-8.807 -1.139,-2.558 -2.46,-4.999 -3.942,-7.315 C 136.394,15.332 127.264,7.857 116.273,3.638 109.985,1.224 103.411,0 96.734,0 85.817,0 75.245,3.241 66.159,9.374 c -6.207,4.189 -11.403,9.54 -15.376,15.757 -1.978,3.095 -3.658,6.401 -4.998,9.893 -0.789,2.056 -1.434,4.143 -1.968,6.245 -2.408,9.495 -2.208,19.36 0.578,28.739 0.679,2.286 1.498,4.546 2.484,6.761 1.507,3.384 3.329,6.565 5.427,9.516 6.157,8.662 14.717,15.333 24.865,19.228 l 1.875,0.72 6.351,-16.549 2.868,-7.472 c -0.679,0.167 -1.146,0.299 -1.235,0.363 l -7.894,5.75 c -0.839,0.611 -1.525,0.262 -1.525,-0.776 V 68.684 c 0,-1.037 0.724,-2.332 1.607,-2.875 L 82.4,63.85 c 0.696,-0.456 0.733,-1.062 0.746,-1.375 0.661,-15.841 10.331,-24.144 13.48,-24.144 3.167,0 13.339,8.501 13.947,24.398 0.012,0.288 -0.077,0.858 0.58,1.2 l 3.054,1.88 c 0.884,0.543 1.607,1.838 1.607,2.875 V 87.55 c 0,1.037 -0.686,1.387 -1.525,0.776 l -7.894,-5.75 c -0.083,-0.061 -0.541,-0.189 -1.211,-0.354 l 2.868,7.472 6.347,16.539 1.875,-0.72 c 10.036,-3.852 18.623,-10.573 24.785,-19.162 2.689,-3.747 4.921,-7.846 6.602,-12.225 0.511,-1.332 0.953,-2.679 1.357,-4.033 2.829,-9.482 3.02,-19.408 0.595,-28.904 z"
             id="path1011" /></g></g><g
         transform="matrix(0.90365268,0,0,0.90917372,18.714117,9.7089423)"
         style="fill:none;stroke:#0000ff;stroke-width:1.10339;stroke-miterlimit:4;stroke-dasharray:none;stroke-opacity:1"
         id="g1021"><path
           style="fill:none;stroke:#0000ff;stroke-width:1.10339;stroke-miterlimit:4;stroke-dasharray:none;stroke-opacity:1"
           fill="#6672d8"
           d="m 37.559,72.215 c -0.228,-0.768 -0.437,-1.54 -0.634,-2.313 -13.98,-3.645 -22.67,-8.719 -22.67,-14.336 0,-5.564 8.521,-10.598 22.271,-14.235 0.121,-0.537 0.244,-1.074 0.379,-1.609 0.603,-2.377 1.332,-4.736 2.225,-7.061 0.966,-2.518 2.091,-4.949 3.357,-7.289 -3.422,0.666 -6.699,1.4 -9.766,2.215 -8.326,2.214 -15.094,4.936 -20.115,8.092 C 2.187,42.227 0,50.108 0,55.565 c 0,5.458 2.187,13.338 12.607,19.887 5.021,3.156 11.789,5.878 20.115,8.092 3.375,0.897 6.983,1.705 10.783,2.422 -1.148,-1.964 -2.198,-3.999 -3.137,-6.107 -1.116,-2.504 -2.041,-5.059 -2.809,-7.644 z"
           id="path1017" /><path
           style="fill:none;stroke:#0000ff;stroke-width:1.10339;stroke-miterlimit:4;stroke-dasharray:none;stroke-opacity:1"
           fill="#6672d8"
           d="m 181.143,35.678 c -5.021,-3.156 -11.789,-5.878 -20.115,-8.092 -3.169,-0.842 -6.56,-1.599 -10.106,-2.281 0.77,1.42 1.492,2.875 2.156,4.367 1.447,3.249 2.583,6.581 3.446,9.958 0.137,0.538 0.262,1.078 0.384,1.619 13.933,3.644 22.587,8.71 22.587,14.316 0,5.662 -8.829,10.771 -23.005,14.422 -0.2,0.777 -0.41,1.552 -0.64,2.324 -0.457,1.53 -0.956,3.053 -1.534,4.56 -1.226,3.193 -2.714,6.252 -4.43,9.16 3.931,-0.732 7.662,-1.561 11.143,-2.487 8.326,-2.214 15.094,-4.936 20.115,-8.092 10.419,-6.549 12.607,-14.429 12.607,-19.887 -0.001,-5.457 -2.188,-13.338 -12.608,-19.887 z"
           id="path1019" /></g></g><path
       style="stroke:#ff0000;stroke-width:1;stroke-opacity:1"
       id="path30-3"
       vector-effect="non-scaling-stroke"
       stroke="rgb(100,100,100)"
       shaper:pathType="guide"
       shaper:cutDepth="0"
       fill="none"
       d="m 2.9999999,1.9406249 a 0.24999999,0.24999999 0 1 0 -0.4999999,0 0.24999999,0.24999999 0 1 0 0.4999999,0 z" /><path
       style="stroke:#ff0000;stroke-width:1;stroke-opacity:1"
       id="path30-3-6"
       vector-effect="non-scaling-stroke"
       stroke="rgb(100,100,100)"
       shaper:pathType="guide"
       shaper:cutDepth="0"
       fill="none"
       d="m 3,20.778958 a 0.25,0.25 0 1 0 -0.5,0 0.25,0.25 0 1 0 0.5,0 z" /><path
       d="m 19.397298,10.718118 a 0.25,0.25 0 1 0 -0.5,0 0.25,0.25 0 1 0 0.5,0 z"
       fill="none"
       shaper:cutDepth="0"
       shaper:pathType="guide"
       stroke="rgb(100,100,100)"
       vector-effect="non-scaling-stroke"
       id="path30-3-27"
       style="stroke:#ff0000;stroke-width:1;stroke-opacity:1" /><path
       style="stroke:#ff0000;stroke-width:1;stroke-opacity:1"
       id="path30-3-27-7"
       vector-effect="non-scaling-stroke"
       stroke="rgb(100,100,100)"
       shaper:pathType="guide"
       shaper:cutDepth="0"
       fill="none"
       d="m 19.397298,16.58188 a 0.25,0.25 0 1 0 -0.5,0 0.25,0.25 0 1 0 0.5,0 z" /></g></svg>
