../Core/Src/main.c:95:5:main	8	static
../Core/Src/main.c:156:6:SystemClock_Config	72	static
../Core/Src/main.c:196:13:MX_USART2_UART_Init	8	static
../Core/Src/main.c:227:13:MX_DMA_Init	16	static
../Core/Src/main.c:245:13:MX_GPIO_Init	40	static
../Core/Src/main.c:280:6:HAL_UART_RxHalfCpltCallback	16	static
../Core/Src/main.c:292:6:HAL_UARTEx_RxEventCallback	16	static
../Core/Src/main.c:314:6:edit_text	120	static
../Core/Src/main.c:372:6:Error_Handler	4	static,ignoring_inline_asm
