{
    "description": "Manage additional partitions",
    "supports_noop": true,
    "input_method": "stdin",
    "parameters": {
        "partition": {
            "description": "Partition name",
            "type": "Optional[String]"
        },
        "action": {
            "description": "Action",
            "type": "Enum[list, get, mkext4]"
        }
    }
}