EESchema Schematic File Version 4
LIBS:flipflop_eval-cache
EELAYER 29 0
EELAYER END
$Descr A4 11693 8268
encoding utf-8
Sheet 1 1
Title ""
Date ""
Rev ""
Comp "LibreCube"
Comment1 ""
Comment2 ""
Comment3 ""
Comment4 ""
$EndDescr
$Comp
L 74xx:74HC02 U1
U 1 1 5985A285
P 4500 3800
F 0 "U1" H 4500 3850 50  0000 C CNN
F 1 "74HC02" H 4550 3750 50  0000 C CNN
F 2 "Package_DIP:DIP-14_W7.62mm_LongPads" H 4500 3800 50  0000 C CNN
F 3 "" H 4500 3800 50  0000 C CNN
	1    4500 3800
	1    0    0    -1  
$EndComp
Wire Wire Line
	3900 4350 3900 4150
Wire Wire Line
	3900 4150 5100 4150
Wire Wire Line
	5100 4150 5100 3800
Wire Wire Line
	3900 3900 3900 4100
Wire Wire Line
	3900 4100 5200 4100
Wire Wire Line
	5200 4100 5200 4450
Wire Wire Line
	5100 3800 5350 3800
$Comp
L Device:D D1
U 1 1 5986F54A
P 5500 3800
F 0 "D1" H 5500 3900 50  0000 C CNN
F 1 "D" H 5500 3700 50  0000 C CNN
F 2 "Diode_SMD:D_0805_2012Metric" H 5500 3800 50  0000 C CNN
F 3 "" H 5500 3800 50  0000 C CNN
	1    5500 3800
	-1   0    0    1   
$EndComp
Wire Wire Line
	3900 5350 5100 5350
Wire Wire Line
	5100 5350 5100 5000
Wire Wire Line
	3900 5300 5200 5300
Wire Wire Line
	5200 5300 5200 5650
Wire Wire Line
	5100 5000 5350 5000
$Comp
L Device:D D2
U 1 1 5986F671
P 5500 5000
F 0 "D2" H 5500 5100 50  0000 C CNN
F 1 "D" H 5500 4900 50  0000 C CNN
F 2 "Diode_SMD:D_0805_2012Metric" H 5500 5000 50  0000 C CNN
F 3 "" H 5500 5000 50  0000 C CNN
	1    5500 5000
	-1   0    0    1   
$EndComp
Wire Wire Line
	3800 3700 3800 4900
Connection ~ 3800 3700
Wire Wire Line
	3750 4550 3750 5750
Connection ~ 3750 4550
Wire Wire Line
	3900 5100 3900 5300
Wire Wire Line
	3900 5350 3900 5550
Wire Wire Line
	5650 3800 5650 3900
Wire Wire Line
	6900 3900 7150 3900
Wire Wire Line
	7300 5100 7300 4100
Connection ~ 7300 4100
Connection ~ 7150 3900
Text Label 7450 3900 0    60   ~ 0
PWR_PCDU_RT_A
Text Label 7450 4100 0    60   ~ 0
PWR_PCDU_RT_B
Connection ~ 5650 3900
Connection ~ 5650 4900
Wire Wire Line
	5950 1750 5950 1850
$Comp
L power:+3.3V #PWR09
U 1 1 59878AE1
P 5950 1750
F 0 "#PWR09" H 5950 1600 50  0001 C CNN
F 1 "+3.3V" H 5950 1890 50  0000 C CNN
F 2 "" H 5950 1750 50  0000 C CNN
F 3 "" H 5950 1750 50  0000 C CNN
	1    5950 1750
	1    0    0    -1  
$EndComp
$Comp
L power:PWR_FLAG #FLG01
U 1 1 59878B72
P 6450 1850
F 0 "#FLG01" H 6450 1945 50  0001 C CNN
F 1 "PWR_FLAG" H 6450 2030 50  0000 C CNN
F 2 "" H 6450 1850 50  0000 C CNN
F 3 "" H 6450 1850 50  0000 C CNN
	1    6450 1850
	1    0    0    -1  
$EndComp
$Comp
L Regulator_Linear:TC1262-33 U2
U 1 1 598DE8A5
P 5150 1850
F 0 "U2" H 5150 2175 50  0000 C CNN
F 1 "TC1262-33VDB" H 5150 2100 50  0000 C CNN
F 2 "SOT-223" H 5200 1600 50  0001 L CIN
F 3 "" H 5150 1650 50  0001 C CNN
	1    5150 1850
	1    0    0    -1  
$EndComp
Connection ~ 5950 1850
$Comp
L Device:C C1
U 1 1 598DEBB5
P 5650 2000
F 0 "C1" H 5675 2100 50  0000 L CNN
F 1 "1uF" H 5675 1900 50  0000 L CNN
F 2 "Capacitor_SMD:C_0805_2012Metric" H 5688 1850 50  0000 C CNN
F 3 "" H 5650 2000 50  0000 C CNN
	1    5650 2000
	1    0    0    -1  
$EndComp
$Comp
L power:GND #PWR07
U 1 1 598DEE79
P 5650 2150
F 0 "#PWR07" H 5650 1900 50  0001 C CNN
F 1 "GND" H 5650 2000 50  0000 C CNN
F 2 "" H 5650 2150 50  0000 C CNN
F 3 "" H 5650 2150 50  0000 C CNN
	1    5650 2150
	1    0    0    -1  
$EndComp
$Comp
L power:GND #PWR05
U 1 1 598DEF20
P 5150 2150
F 0 "#PWR05" H 5150 1900 50  0001 C CNN
F 1 "GND" H 5150 2000 50  0000 C CNN
F 2 "" H 5150 2150 50  0000 C CNN
F 3 "" H 5150 2150 50  0000 C CNN
	1    5150 2150
	1    0    0    -1  
$EndComp
$Comp
L power:+5V #PWR03
U 1 1 598DEFC7
P 4850 1850
F 0 "#PWR03" H 4850 1700 50  0001 C CNN
F 1 "+5V" H 4850 1990 50  0000 C CNN
F 2 "" H 4850 1850 50  0000 C CNN
F 3 "" H 4850 1850 50  0000 C CNN
	1    4850 1850
	1    0    0    -1  
$EndComp
Wire Wire Line
	7300 4100 8450 4100
Wire Wire Line
	5650 3900 5650 4900
Wire Wire Line
	5650 4900 5650 5000
Wire Wire Line
	5950 1850 6450 1850
Wire Wire Line
	5450 1850 5650 1850
Wire Wire Line
	5950 1850 5950 2800
$Comp
L Regulator_Linear:TC1262-33 U3
U 1 1 5DC0B62D
P 5150 2800
F 0 "U3" H 5150 3125 50  0000 C CNN
F 1 "TC1262-33VDB" H 5150 3050 50  0000 C CNN
F 2 "SOT-223" H 5200 2550 50  0001 L CIN
F 3 "" H 5150 2600 50  0001 C CNN
	1    5150 2800
	1    0    0    -1  
$EndComp
$Comp
L Device:C C2
U 1 1 5DC0B637
P 5650 2950
F 0 "C2" H 5675 3050 50  0000 L CNN
F 1 "1uF" H 5675 2850 50  0000 L CNN
F 2 "Capacitor_SMD:C_0805_2012Metric" H 5688 2800 50  0000 C CNN
F 3 "" H 5650 2950 50  0000 C CNN
	1    5650 2950
	1    0    0    -1  
$EndComp
$Comp
L power:GND #PWR08
U 1 1 5DC0B641
P 5650 3100
F 0 "#PWR08" H 5650 2850 50  0001 C CNN
F 1 "GND" H 5650 2950 50  0000 C CNN
F 2 "" H 5650 3100 50  0000 C CNN
F 3 "" H 5650 3100 50  0000 C CNN
	1    5650 3100
	1    0    0    -1  
$EndComp
$Comp
L power:GND #PWR06
U 1 1 5DC0B64B
P 5150 3100
F 0 "#PWR06" H 5150 2850 50  0001 C CNN
F 1 "GND" H 5150 2950 50  0000 C CNN
F 2 "" H 5150 3100 50  0000 C CNN
F 3 "" H 5150 3100 50  0000 C CNN
	1    5150 3100
	1    0    0    -1  
$EndComp
$Comp
L power:+5V #PWR04
U 1 1 5DC0B655
P 4850 2800
F 0 "#PWR04" H 4850 2650 50  0001 C CNN
F 1 "+5V" H 4850 2940 50  0000 C CNN
F 2 "" H 4850 2800 50  0000 C CNN
F 3 "" H 4850 2800 50  0000 C CNN
	1    4850 2800
	1    0    0    -1  
$EndComp
Wire Wire Line
	5450 2800 5650 2800
Connection ~ 5650 2800
Wire Wire Line
	5650 2800 5950 2800
Connection ~ 5950 2800
Wire Wire Line
	3800 3700 4200 3700
Wire Wire Line
	4200 3900 3900 3900
Wire Wire Line
	3900 4350 4200 4350
Wire Wire Line
	3750 4550 4200 4550
Wire Wire Line
	3800 4900 4200 4900
Wire Wire Line
	4200 5100 3900 5100
Wire Wire Line
	3900 5550 4200 5550
Wire Wire Line
	3750 5750 4200 5750
Wire Wire Line
	4800 5650 5200 5650
Wire Wire Line
	4800 4450 5200 4450
Wire Wire Line
	4800 3800 5100 3800
Connection ~ 5100 3800
Wire Wire Line
	4800 5000 5100 5000
Connection ~ 5100 5000
Wire Wire Line
	6100 4200 5950 4200
Connection ~ 5950 4200
Wire Wire Line
	5650 3900 6400 3900
Wire Wire Line
	6700 4100 7300 4100
Wire Wire Line
	6700 4300 6900 4300
Wire Wire Line
	6900 4300 6900 3900
Wire Wire Line
	5950 2800 5950 4200
Wire Wire Line
	5950 5200 6100 5200
Wire Wire Line
	5950 4200 5950 5200
Wire Wire Line
	5650 4900 6400 4900
Wire Wire Line
	6700 5100 7300 5100
Wire Wire Line
	6700 5300 7150 5300
Wire Wire Line
	7150 3900 7150 5300
$Comp
L Connector:Conn_01x02_Male J2
U 1 1 5DC4E4F1
P 3300 2200
F 0 "J2" H 3408 2381 50  0000 C CNN
F 1 "Conn_01x02_Male" H 3408 2290 50  0000 C CNN
F 2 "Connector_PinHeader_2.54mm:PinHeader_1x02_P2.54mm_Vertical" H 3300 2200 50  0001 C CNN
F 3 "~" H 3300 2200 50  0001 C CNN
	1    3300 2200
	1    0    0    -1  
$EndComp
Wire Wire Line
	4000 2200 3500 2200
Wire Wire Line
	4000 2300 3500 2300
$Comp
L power:GND #PWR02
U 1 1 5DC53A48
P 4000 2300
F 0 "#PWR02" H 4000 2050 50  0001 C CNN
F 1 "GND" H 4000 2150 50  0000 C CNN
F 2 "" H 4000 2300 50  0000 C CNN
F 3 "" H 4000 2300 50  0000 C CNN
	1    4000 2300
	1    0    0    -1  
$EndComp
$Comp
L power:+5V #PWR01
U 1 1 5DC53E3E
P 4000 2200
F 0 "#PWR01" H 4000 2050 50  0001 C CNN
F 1 "+5V" H 4000 2340 50  0000 C CNN
F 2 "" H 4000 2200 50  0000 C CNN
F 3 "" H 4000 2200 50  0000 C CNN
	1    4000 2200
	1    0    0    -1  
$EndComp
$Comp
L Connector:Conn_01x02_Male J1
U 1 1 5DC58148
P 2200 4150
F 0 "J1" H 2308 4331 50  0000 C CNN
F 1 "Conn_01x02_Male" H 2308 4240 50  0000 C CNN
F 2 "Connector_PinHeader_2.54mm:PinHeader_1x02_P2.54mm_Vertical" H 2200 4150 50  0001 C CNN
F 3 "~" H 2200 4150 50  0001 C CNN
	1    2200 4150
	1    0    0    -1  
$EndComp
Text Label 2900 3700 0    60   ~ 0
SEL_PCDU_RT_B
Text Label 2900 4550 0    60   ~ 0
SEL_PCDU_RT_A
Wire Wire Line
	2800 3700 2800 4150
Wire Wire Line
	2800 4150 2400 4150
Wire Wire Line
	2800 3700 3800 3700
Wire Wire Line
	2800 4550 2800 4250
Wire Wire Line
	2800 4250 2400 4250
Wire Wire Line
	2800 4550 3750 4550
$Comp
L Connector:Conn_01x02_Male J3
U 1 1 5DC6C2B3
P 9050 4000
F 0 "J3" H 9022 3882 50  0000 R CNN
F 1 "Conn_01x02_Male" H 9022 3973 50  0000 R CNN
F 2 "Connector_PinHeader_2.54mm:PinHeader_1x02_P2.54mm_Vertical" H 9050 4000 50  0001 C CNN
F 3 "~" H 9050 4000 50  0001 C CNN
	1    9050 4000
	-1   0    0    1   
$EndComp
Wire Wire Line
	7150 3900 8850 3900
Wire Wire Line
	8450 4100 8450 4000
Wire Wire Line
	8450 4000 8850 4000
Connection ~ 5650 1850
Wire Wire Line
	5650 1850 5950 1850
$Comp
L 74xx:74HC02 U1
U 4 1 5986F665
P 4500 5650
F 0 "U1" H 4500 5700 50  0000 C CNN
F 1 "74HC02" H 4550 5600 50  0000 C CNN
F 2 "Package_SO:SSOP-14_5.3x6.2mm_P0.65mm" H 4500 5650 50  0000 C CNN
F 3 "" H 4500 5650 50  0000 C CNN
	4    4500 5650
	1    0    0    -1  
$EndComp
$Comp
L 74xx:74HC02 U1
U 3 1 5986F65F
P 4500 5000
F 0 "U1" H 4500 5050 50  0000 C CNN
F 1 "74HC02" H 4550 4950 50  0000 C CNN
F 2 "Package_SO:SSOP-14_5.3x6.2mm_P0.65mm" H 4500 5000 50  0000 C CNN
F 3 "" H 4500 5000 50  0000 C CNN
	3    4500 5000
	1    0    0    -1  
$EndComp
$Comp
L 74xx:74HC02 U1
U 2 1 5986F444
P 4500 4450
F 0 "U1" H 4500 4500 50  0000 C CNN
F 1 "74HC02" H 4550 4400 50  0000 C CNN
F 2 "Package_SO:SSOP-14_5.3x6.2mm_P0.65mm" H 4500 4450 50  0000 C CNN
F 3 "" H 4500 4450 50  0000 C CNN
	2    4500 4450
	1    0    0    -1  
$EndComp
$Comp
L Analog_Switch:TS5A3160DBV U4
U 1 1 5985A744
P 6400 4300
F 0 "U4" H 6300 4625 50  0000 R CNN
F 1 "TS5A3160" H 6300 4550 50  0000 R CNN
F 2 "Package_TO_SOT_SMD:SOT-23-6" H 6450 4050 50  0000 L CNN
F 3 "" H 6500 4300 50  0000 C CNN
	1    6400 4300
	1    0    0    1   
$EndComp
$Comp
L Analog_Switch:TS5A3160DBV U5
U 1 1 5DC71490
P 6400 5300
F 0 "U5" H 6300 5625 50  0000 R CNN
F 1 "TS5A3160" H 6300 5550 50  0000 R CNN
F 2 "Package_TO_SOT_SMD:SOT-23-6" H 6450 5050 50  0000 L CNN
F 3 "" H 6500 5300 50  0000 C CNN
	1    6400 5300
	1    0    0    1   
$EndComp
Wire Wire Line
	1400 6350 1700 6350
Wire Wire Line
	1150 6350 1400 6350
Connection ~ 1400 6350
$Comp
L power:GND #PWR0101
U 1 1 5DCCB2F5
P 1400 6350
F 0 "#PWR0101" H 1400 6100 50  0001 C CNN
F 1 "GND" H 1400 6200 50  0000 C CNN
F 2 "" H 1400 6350 50  0000 C CNN
F 3 "" H 1400 6350 50  0000 C CNN
	1    1400 6350
	1    0    0    -1  
$EndComp
$Comp
L Analog_Switch:TS5A3160DBV U5
U 2 1 5DCC68B9
P 1700 5850
F 0 "U5" H 1600 6175 50  0000 R CNN
F 1 "TS5A3160" H 1600 6100 50  0000 R CNN
F 2 "Package_TO_SOT_SMD:SOT-23-6" H 1750 5600 50  0000 L CNN
F 3 "" H 1800 5850 50  0000 C CNN
	2    1700 5850
	-1   0    0    -1  
$EndComp
$Comp
L Analog_Switch:TS5A3160DBV U4
U 2 1 5DCBE1D4
P 1150 5850
F 0 "U4" H 1050 6175 50  0000 R CNN
F 1 "TS5A3160" H 1050 6100 50  0000 R CNN
F 2 "Package_TO_SOT_SMD:SOT-23-6" H 1200 5600 50  0000 L CNN
F 3 "" H 1250 5850 50  0000 C CNN
	2    1150 5850
	-1   0    0    -1  
$EndComp
Wire Wire Line
	1150 5350 1400 5350
$Comp
L power:+3.3V #PWR0102
U 1 1 5DC1A721
P 1400 5350
F 0 "#PWR0102" H 1400 5200 50  0001 C CNN
F 1 "+3.3V" H 1400 5490 50  0000 C CNN
F 2 "" H 1400 5350 50  0000 C CNN
F 3 "" H 1400 5350 50  0000 C CNN
	1    1400 5350
	1    0    0    -1  
$EndComp
Connection ~ 1400 5350
Wire Wire Line
	1400 5350 1700 5350
$EndSCHEMATC
