(kicad_pcb (version 20171130) (host pcbnew 5.1.4)

  (general
    (thickness 1.6)
    (drawings 4)
    (tracks 137)
    (zones 0)
    (modules 12)
    (nets 13)
  )

  (page A4)
  (layers
    (0 F.Cu signal)
    (31 B.Cu signal)
    (32 B.Adhes user)
    (33 F.Adhes user)
    (34 B.Paste user)
    (35 F.Paste user)
    (36 B.SilkS user)
    (37 F.SilkS user)
    (38 B.Mask user)
    (39 F.Mask user)
    (40 Dwgs.User user)
    (41 Cmts.User user)
    (42 Eco1.User user)
    (43 Eco2.User user)
    (44 Edge.Cuts user)
    (45 Margin user)
    (46 B.CrtYd user)
    (47 F.CrtYd user)
    (48 B.Fab user)
    (49 F.Fab user hide)
  )

  (setup
    (last_trace_width 0.25)
    (user_trace_width 0.5)
    (trace_clearance 0.2)
    (zone_clearance 0.508)
    (zone_45_only no)
    (trace_min 0.2)
    (via_size 0.8)
    (via_drill 0.4)
    (via_min_size 0.4)
    (via_min_drill 0.3)
    (uvia_size 0.3)
    (uvia_drill 0.1)
    (uvias_allowed no)
    (uvia_min_size 0.2)
    (uvia_min_drill 0.1)
    (edge_width 0.1)
    (segment_width 0.2)
    (pcb_text_width 0.3)
    (pcb_text_size 1.5 1.5)
    (mod_edge_width 0.15)
    (mod_text_size 1 1)
    (mod_text_width 0.15)
    (pad_size 2 3.8)
    (pad_drill 0)
    (pad_to_mask_clearance 0)
    (aux_axis_origin 0 0)
    (visible_elements 7FFFFFFF)
    (pcbplotparams
      (layerselection 0x010fc_ffffffff)
      (usegerberextensions false)
      (usegerberattributes false)
      (usegerberadvancedattributes false)
      (creategerberjobfile false)
      (excludeedgelayer true)
      (linewidth 0.100000)
      (plotframeref false)
      (viasonmask false)
      (mode 1)
      (useauxorigin false)
      (hpglpennumber 1)
      (hpglpenspeed 20)
      (hpglpendiameter 15.000000)
      (psnegative false)
      (psa4output false)
      (plotreference true)
      (plotvalue true)
      (plotinvisibletext false)
      (padsonsilk false)
      (subtractmaskfromsilk false)
      (outputformat 1)
      (mirror false)
      (drillshape 1)
      (scaleselection 1)
      (outputdirectory ""))
  )

  (net 0 "")
  (net 1 GND)
  (net 2 +3V3)
  (net 3 "Net-(D1-Pad2)")
  (net 4 "Net-(D1-Pad1)")
  (net 5 "Net-(D2-Pad2)")
  (net 6 /SEL_PCDU_RT_A)
  (net 7 /SEL_PCDU_RT_B)
  (net 8 +5V)
  (net 9 /PWR_PCDU_RT_A)
  (net 10 /PWR_PCDU_RT_B)
  (net 11 "Net-(U1-Pad3)")
  (net 12 "Net-(U1-Pad13)")

  (net_class Default "This is the default net class."
    (clearance 0.2)
    (trace_width 0.25)
    (via_dia 0.8)
    (via_drill 0.4)
    (uvia_dia 0.3)
    (uvia_drill 0.1)
    (add_net +3V3)
    (add_net +5V)
    (add_net /PWR_PCDU_RT_A)
    (add_net /PWR_PCDU_RT_B)
    (add_net /SEL_PCDU_RT_A)
    (add_net /SEL_PCDU_RT_B)
    (add_net GND)
    (add_net "Net-(D1-Pad1)")
    (add_net "Net-(D1-Pad2)")
    (add_net "Net-(D2-Pad2)")
    (add_net "Net-(U1-Pad13)")
    (add_net "Net-(U1-Pad3)")
  )

  (module Package_TO_SOT_SMD:SOT-223 (layer F.Cu) (tedit 5DD08F85) (tstamp 5DC0AEE7)
    (at 119.38 72.39)
    (descr "module CMS SOT223 4 pins")
    (tags "CMS SOT")
    (path /5DC0B62D)
    (attr smd)
    (fp_text reference U3 (at 0 -4.5) (layer F.SilkS)
      (effects (font (size 1 1) (thickness 0.15)))
    )
    (fp_text value TC1262-33VDB (at 0 4.5) (layer F.Fab)
      (effects (font (size 1 1) (thickness 0.15)))
    )
    (fp_line (start 1.85 -3.35) (end 1.85 3.35) (layer F.Fab) (width 0.1))
    (fp_line (start -1.85 3.35) (end 1.85 3.35) (layer F.Fab) (width 0.1))
    (fp_line (start -4.1 -3.41) (end 1.91 -3.41) (layer F.SilkS) (width 0.12))
    (fp_line (start -0.8 -3.35) (end 1.85 -3.35) (layer F.Fab) (width 0.1))
    (fp_line (start -1.85 3.41) (end 1.91 3.41) (layer F.SilkS) (width 0.12))
    (fp_line (start -1.85 -2.3) (end -1.85 3.35) (layer F.Fab) (width 0.1))
    (fp_line (start -4.4 -3.6) (end -4.4 3.6) (layer F.CrtYd) (width 0.05))
    (fp_line (start -4.4 3.6) (end 4.4 3.6) (layer F.CrtYd) (width 0.05))
    (fp_line (start 4.4 3.6) (end 4.4 -3.6) (layer F.CrtYd) (width 0.05))
    (fp_line (start 4.4 -3.6) (end -4.4 -3.6) (layer F.CrtYd) (width 0.05))
    (fp_line (start 1.91 -3.41) (end 1.91 -2.15) (layer F.SilkS) (width 0.12))
    (fp_line (start 1.91 3.41) (end 1.91 2.15) (layer F.SilkS) (width 0.12))
    (fp_line (start -1.85 -2.3) (end -0.8 -3.35) (layer F.Fab) (width 0.1))
    (fp_text user %R (at 0 0 90) (layer F.Fab)
      (effects (font (size 0.8 0.8) (thickness 0.12)))
    )
    (pad 1 smd rect (at -3.15 -2.3) (size 2 1.5) (layers F.Cu F.Paste F.Mask)
      (net 8 +5V))
    (pad 3 smd rect (at -3.15 2.3) (size 2 1.5) (layers F.Cu F.Paste F.Mask)
      (net 2 +3V3))
    (pad 2 smd rect (at -3.15 0) (size 2 1.5) (layers F.Cu F.Paste F.Mask)
      (net 1 GND))
    (pad 4 smd rect (at 3.15 0) (size 2 3.8) (layers F.Cu F.Paste F.Mask)
      (net 1 GND) (zone_connect 2))
    (model ${KISYS3DMOD}/Package_TO_SOT_SMD.3dshapes/SOT-223.wrl
      (at (xyz 0 0 0))
      (scale (xyz 1 1 1))
      (rotate (xyz 0 0 0))
    )
  )

  (module Package_TO_SOT_SMD:SOT-223 (layer F.Cu) (tedit 5DD08F8D) (tstamp 5DC15CAB)
    (at 132.08 72.39)
    (descr "module CMS SOT223 4 pins")
    (tags "CMS SOT")
    (path /598DE8A5)
    (attr smd)
    (fp_text reference U2 (at 0 -4.5) (layer F.SilkS)
      (effects (font (size 1 1) (thickness 0.15)))
    )
    (fp_text value TC1262-33VDB (at 0 4.5) (layer F.Fab)
      (effects (font (size 1 1) (thickness 0.15)))
    )
    (fp_line (start 1.85 -3.35) (end 1.85 3.35) (layer F.Fab) (width 0.1))
    (fp_line (start -1.85 3.35) (end 1.85 3.35) (layer F.Fab) (width 0.1))
    (fp_line (start -4.1 -3.41) (end 1.91 -3.41) (layer F.SilkS) (width 0.12))
    (fp_line (start -0.8 -3.35) (end 1.85 -3.35) (layer F.Fab) (width 0.1))
    (fp_line (start -1.85 3.41) (end 1.91 3.41) (layer F.SilkS) (width 0.12))
    (fp_line (start -1.85 -2.3) (end -1.85 3.35) (layer F.Fab) (width 0.1))
    (fp_line (start -4.4 -3.6) (end -4.4 3.6) (layer F.CrtYd) (width 0.05))
    (fp_line (start -4.4 3.6) (end 4.4 3.6) (layer F.CrtYd) (width 0.05))
    (fp_line (start 4.4 3.6) (end 4.4 -3.6) (layer F.CrtYd) (width 0.05))
    (fp_line (start 4.4 -3.6) (end -4.4 -3.6) (layer F.CrtYd) (width 0.05))
    (fp_line (start 1.91 -3.41) (end 1.91 -2.15) (layer F.SilkS) (width 0.12))
    (fp_line (start 1.91 3.41) (end 1.91 2.15) (layer F.SilkS) (width 0.12))
    (fp_line (start -1.85 -2.3) (end -0.8 -3.35) (layer F.Fab) (width 0.1))
    (fp_text user %R (at 0 0 90) (layer F.Fab)
      (effects (font (size 0.8 0.8) (thickness 0.12)))
    )
    (pad 1 smd rect (at -3.15 -2.3) (size 2 1.5) (layers F.Cu F.Paste F.Mask)
      (net 8 +5V))
    (pad 3 smd rect (at -3.15 2.3) (size 2 1.5) (layers F.Cu F.Paste F.Mask)
      (net 2 +3V3))
    (pad 2 smd rect (at -3.15 0) (size 2 1.5) (layers F.Cu F.Paste F.Mask)
      (net 1 GND))
    (pad 4 smd rect (at 3.15 0) (size 2 3.8) (layers F.Cu F.Paste F.Mask)
      (net 1 GND) (zone_connect 2))
    (model ${KISYS3DMOD}/Package_TO_SOT_SMD.3dshapes/SOT-223.wrl
      (at (xyz 0 0 0))
      (scale (xyz 1 1 1))
      (rotate (xyz 0 0 0))
    )
  )

  (module Package_DIP:DIP-14_W7.62mm_LongPads (layer F.Cu) (tedit 5A02E8C5) (tstamp 5DC0AEBB)
    (at 119.38 95.25 180)
    (descr "14-lead though-hole mounted DIP package, row spacing 7.62 mm (300 mils), LongPads")
    (tags "THT DIP DIL PDIP 2.54mm 7.62mm 300mil LongPads")
    (path /5985A285)
    (fp_text reference U1 (at 10.414 0) (layer F.SilkS)
      (effects (font (size 1 1) (thickness 0.15)))
    )
    (fp_text value 74HC02 (at 3.81 17.57) (layer F.Fab)
      (effects (font (size 1 1) (thickness 0.15)))
    )
    (fp_text user %R (at 3.81 7.62) (layer F.Fab)
      (effects (font (size 1 1) (thickness 0.15)))
    )
    (fp_line (start 9.1 -1.55) (end -1.45 -1.55) (layer F.CrtYd) (width 0.05))
    (fp_line (start 9.1 16.8) (end 9.1 -1.55) (layer F.CrtYd) (width 0.05))
    (fp_line (start -1.45 16.8) (end 9.1 16.8) (layer F.CrtYd) (width 0.05))
    (fp_line (start -1.45 -1.55) (end -1.45 16.8) (layer F.CrtYd) (width 0.05))
    (fp_line (start 6.06 -1.33) (end 4.81 -1.33) (layer F.SilkS) (width 0.12))
    (fp_line (start 6.06 16.57) (end 6.06 -1.33) (layer F.SilkS) (width 0.12))
    (fp_line (start 1.56 16.57) (end 6.06 16.57) (layer F.SilkS) (width 0.12))
    (fp_line (start 1.56 -1.33) (end 1.56 16.57) (layer F.SilkS) (width 0.12))
    (fp_line (start 2.81 -1.33) (end 1.56 -1.33) (layer F.SilkS) (width 0.12))
    (fp_line (start 0.635 -0.27) (end 1.635 -1.27) (layer F.Fab) (width 0.1))
    (fp_line (start 0.635 16.51) (end 0.635 -0.27) (layer F.Fab) (width 0.1))
    (fp_line (start 6.985 16.51) (end 0.635 16.51) (layer F.Fab) (width 0.1))
    (fp_line (start 6.985 -1.27) (end 6.985 16.51) (layer F.Fab) (width 0.1))
    (fp_line (start 1.635 -1.27) (end 6.985 -1.27) (layer F.Fab) (width 0.1))
    (fp_arc (start 3.81 -1.33) (end 2.81 -1.33) (angle -180) (layer F.SilkS) (width 0.12))
    (pad 14 thru_hole oval (at 7.62 0 180) (size 2.4 1.6) (drill 0.8) (layers *.Cu *.Mask))
    (pad 7 thru_hole oval (at 0 15.24 180) (size 2.4 1.6) (drill 0.8) (layers *.Cu *.Mask))
    (pad 13 thru_hole oval (at 7.62 2.54 180) (size 2.4 1.6) (drill 0.8) (layers *.Cu *.Mask)
      (net 12 "Net-(U1-Pad13)"))
    (pad 6 thru_hole oval (at 0 12.7 180) (size 2.4 1.6) (drill 0.8) (layers *.Cu *.Mask)
      (net 6 /SEL_PCDU_RT_A))
    (pad 12 thru_hole oval (at 7.62 5.08 180) (size 2.4 1.6) (drill 0.8) (layers *.Cu *.Mask)
      (net 6 /SEL_PCDU_RT_A))
    (pad 5 thru_hole oval (at 0 10.16 180) (size 2.4 1.6) (drill 0.8) (layers *.Cu *.Mask)
      (net 3 "Net-(D1-Pad2)"))
    (pad 11 thru_hole oval (at 7.62 7.62 180) (size 2.4 1.6) (drill 0.8) (layers *.Cu *.Mask)
      (net 5 "Net-(D2-Pad2)"))
    (pad 4 thru_hole oval (at 0 7.62 180) (size 2.4 1.6) (drill 0.8) (layers *.Cu *.Mask)
      (net 11 "Net-(U1-Pad3)"))
    (pad 10 thru_hole oval (at 7.62 10.16 180) (size 2.4 1.6) (drill 0.8) (layers *.Cu *.Mask)
      (net 5 "Net-(D2-Pad2)"))
    (pad 3 thru_hole oval (at 0 5.08 180) (size 2.4 1.6) (drill 0.8) (layers *.Cu *.Mask)
      (net 11 "Net-(U1-Pad3)"))
    (pad 9 thru_hole oval (at 7.62 12.7 180) (size 2.4 1.6) (drill 0.8) (layers *.Cu *.Mask)
      (net 12 "Net-(U1-Pad13)"))
    (pad 2 thru_hole oval (at 0 2.54 180) (size 2.4 1.6) (drill 0.8) (layers *.Cu *.Mask)
      (net 7 /SEL_PCDU_RT_B))
    (pad 8 thru_hole oval (at 7.62 15.24 180) (size 2.4 1.6) (drill 0.8) (layers *.Cu *.Mask)
      (net 7 /SEL_PCDU_RT_B))
    (pad 1 thru_hole rect (at 0 0 180) (size 2.4 1.6) (drill 0.8) (layers *.Cu *.Mask)
      (net 3 "Net-(D1-Pad2)"))
    (model ${KISYS3DMOD}/Package_DIP.3dshapes/DIP-14_W7.62mm.wrl
      (at (xyz 0 0 0))
      (scale (xyz 1 1 1))
      (rotate (xyz 0 0 0))
    )
  )

  (module Package_TO_SOT_SMD:SOT-23-6 (layer F.Cu) (tedit 5A02FF57) (tstamp 5DC0AF13)
    (at 132.08 90.17)
    (descr "6-pin SOT-23 package")
    (tags SOT-23-6)
    (path /5DC71490)
    (attr smd)
    (fp_text reference U5 (at 0 -2.9) (layer F.SilkS)
      (effects (font (size 1 1) (thickness 0.15)))
    )
    (fp_text value TS5A3160 (at 0 2.9) (layer F.Fab)
      (effects (font (size 1 1) (thickness 0.15)))
    )
    (fp_line (start 0.9 -1.55) (end 0.9 1.55) (layer F.Fab) (width 0.1))
    (fp_line (start 0.9 1.55) (end -0.9 1.55) (layer F.Fab) (width 0.1))
    (fp_line (start -0.9 -0.9) (end -0.9 1.55) (layer F.Fab) (width 0.1))
    (fp_line (start 0.9 -1.55) (end -0.25 -1.55) (layer F.Fab) (width 0.1))
    (fp_line (start -0.9 -0.9) (end -0.25 -1.55) (layer F.Fab) (width 0.1))
    (fp_line (start -1.9 -1.8) (end -1.9 1.8) (layer F.CrtYd) (width 0.05))
    (fp_line (start -1.9 1.8) (end 1.9 1.8) (layer F.CrtYd) (width 0.05))
    (fp_line (start 1.9 1.8) (end 1.9 -1.8) (layer F.CrtYd) (width 0.05))
    (fp_line (start 1.9 -1.8) (end -1.9 -1.8) (layer F.CrtYd) (width 0.05))
    (fp_line (start 0.9 -1.61) (end -1.55 -1.61) (layer F.SilkS) (width 0.12))
    (fp_line (start -0.9 1.61) (end 0.9 1.61) (layer F.SilkS) (width 0.12))
    (fp_text user %R (at 0 0 90) (layer F.Fab)
      (effects (font (size 0.5 0.5) (thickness 0.075)))
    )
    (pad 5 smd rect (at 1.1 0) (size 1.06 0.65) (layers F.Cu F.Paste F.Mask)
      (net 2 +3V3))
    (pad 6 smd rect (at 1.1 -0.95) (size 1.06 0.65) (layers F.Cu F.Paste F.Mask)
      (net 4 "Net-(D1-Pad1)"))
    (pad 4 smd rect (at 1.1 0.95) (size 1.06 0.65) (layers F.Cu F.Paste F.Mask)
      (net 2 +3V3))
    (pad 3 smd rect (at -1.1 0.95) (size 1.06 0.65) (layers F.Cu F.Paste F.Mask)
      (net 9 /PWR_PCDU_RT_A))
    (pad 2 smd rect (at -1.1 0) (size 1.06 0.65) (layers F.Cu F.Paste F.Mask)
      (net 1 GND))
    (pad 1 smd rect (at -1.1 -0.95) (size 1.06 0.65) (layers F.Cu F.Paste F.Mask)
      (net 10 /PWR_PCDU_RT_B))
    (model ${KISYS3DMOD}/Package_TO_SOT_SMD.3dshapes/SOT-23-6.wrl
      (at (xyz 0 0 0))
      (scale (xyz 1 1 1))
      (rotate (xyz 0 0 0))
    )
  )

  (module Package_TO_SOT_SMD:SOT-23-6 (layer F.Cu) (tedit 5A02FF57) (tstamp 5DC0ACC6)
    (at 132.08 81.28)
    (descr "6-pin SOT-23 package")
    (tags SOT-23-6)
    (path /5985A744)
    (attr smd)
    (fp_text reference U4 (at 0 -2.9) (layer F.SilkS)
      (effects (font (size 1 1) (thickness 0.15)))
    )
    (fp_text value TS5A3160 (at 0 2.9) (layer F.Fab)
      (effects (font (size 1 1) (thickness 0.15)))
    )
    (fp_line (start 0.9 -1.55) (end 0.9 1.55) (layer F.Fab) (width 0.1))
    (fp_line (start 0.9 1.55) (end -0.9 1.55) (layer F.Fab) (width 0.1))
    (fp_line (start -0.9 -0.9) (end -0.9 1.55) (layer F.Fab) (width 0.1))
    (fp_line (start 0.9 -1.55) (end -0.25 -1.55) (layer F.Fab) (width 0.1))
    (fp_line (start -0.9 -0.9) (end -0.25 -1.55) (layer F.Fab) (width 0.1))
    (fp_line (start -1.9 -1.8) (end -1.9 1.8) (layer F.CrtYd) (width 0.05))
    (fp_line (start -1.9 1.8) (end 1.9 1.8) (layer F.CrtYd) (width 0.05))
    (fp_line (start 1.9 1.8) (end 1.9 -1.8) (layer F.CrtYd) (width 0.05))
    (fp_line (start 1.9 -1.8) (end -1.9 -1.8) (layer F.CrtYd) (width 0.05))
    (fp_line (start 0.9 -1.61) (end -1.55 -1.61) (layer F.SilkS) (width 0.12))
    (fp_line (start -0.9 1.61) (end 0.9 1.61) (layer F.SilkS) (width 0.12))
    (fp_text user %R (at 0 0 90) (layer F.Fab)
      (effects (font (size 0.5 0.5) (thickness 0.075)))
    )
    (pad 5 smd rect (at 1.1 0) (size 1.06 0.65) (layers F.Cu F.Paste F.Mask)
      (net 2 +3V3))
    (pad 6 smd rect (at 1.1 -0.95) (size 1.06 0.65) (layers F.Cu F.Paste F.Mask)
      (net 4 "Net-(D1-Pad1)"))
    (pad 4 smd rect (at 1.1 0.95) (size 1.06 0.65) (layers F.Cu F.Paste F.Mask)
      (net 2 +3V3))
    (pad 3 smd rect (at -1.1 0.95) (size 1.06 0.65) (layers F.Cu F.Paste F.Mask)
      (net 9 /PWR_PCDU_RT_A))
    (pad 2 smd rect (at -1.1 0) (size 1.06 0.65) (layers F.Cu F.Paste F.Mask)
      (net 1 GND))
    (pad 1 smd rect (at -1.1 -0.95) (size 1.06 0.65) (layers F.Cu F.Paste F.Mask)
      (net 10 /PWR_PCDU_RT_B))
    (model ${KISYS3DMOD}/Package_TO_SOT_SMD.3dshapes/SOT-23-6.wrl
      (at (xyz 0 0 0))
      (scale (xyz 1 1 1))
      (rotate (xyz 0 0 0))
    )
  )

  (module Connector_PinHeader_2.54mm:PinHeader_1x02_P2.54mm_Vertical (layer F.Cu) (tedit 59FED5CC) (tstamp 5DC0AE98)
    (at 128.27 82.55)
    (descr "Through hole straight pin header, 1x02, 2.54mm pitch, single row")
    (tags "Through hole pin header THT 1x02 2.54mm single row")
    (path /5DC6C2B3)
    (fp_text reference J3 (at 0 -2.33) (layer F.SilkS)
      (effects (font (size 1 1) (thickness 0.15)))
    )
    (fp_text value Conn_01x02_Male (at 0 4.87) (layer F.Fab)
      (effects (font (size 1 1) (thickness 0.15)))
    )
    (fp_text user %R (at 0 1.27 90) (layer F.Fab)
      (effects (font (size 1 1) (thickness 0.15)))
    )
    (fp_line (start 1.8 -1.8) (end -1.8 -1.8) (layer F.CrtYd) (width 0.05))
    (fp_line (start 1.8 4.35) (end 1.8 -1.8) (layer F.CrtYd) (width 0.05))
    (fp_line (start -1.8 4.35) (end 1.8 4.35) (layer F.CrtYd) (width 0.05))
    (fp_line (start -1.8 -1.8) (end -1.8 4.35) (layer F.CrtYd) (width 0.05))
    (fp_line (start -1.33 -1.33) (end 0 -1.33) (layer F.SilkS) (width 0.12))
    (fp_line (start -1.33 0) (end -1.33 -1.33) (layer F.SilkS) (width 0.12))
    (fp_line (start -1.33 1.27) (end 1.33 1.27) (layer F.SilkS) (width 0.12))
    (fp_line (start 1.33 1.27) (end 1.33 3.87) (layer F.SilkS) (width 0.12))
    (fp_line (start -1.33 1.27) (end -1.33 3.87) (layer F.SilkS) (width 0.12))
    (fp_line (start -1.33 3.87) (end 1.33 3.87) (layer F.SilkS) (width 0.12))
    (fp_line (start -1.27 -0.635) (end -0.635 -1.27) (layer F.Fab) (width 0.1))
    (fp_line (start -1.27 3.81) (end -1.27 -0.635) (layer F.Fab) (width 0.1))
    (fp_line (start 1.27 3.81) (end -1.27 3.81) (layer F.Fab) (width 0.1))
    (fp_line (start 1.27 -1.27) (end 1.27 3.81) (layer F.Fab) (width 0.1))
    (fp_line (start -0.635 -1.27) (end 1.27 -1.27) (layer F.Fab) (width 0.1))
    (pad 2 thru_hole oval (at 0 2.54) (size 1.7 1.7) (drill 1) (layers *.Cu *.Mask)
      (net 9 /PWR_PCDU_RT_A))
    (pad 1 thru_hole rect (at 0 0) (size 1.7 1.7) (drill 1) (layers *.Cu *.Mask)
      (net 10 /PWR_PCDU_RT_B))
    (model ${KISYS3DMOD}/Connector_PinHeader_2.54mm.3dshapes/PinHeader_1x02_P2.54mm_Vertical.wrl
      (at (xyz 0 0 0))
      (scale (xyz 1 1 1))
      (rotate (xyz 0 0 0))
    )
  )

  (module Connector_PinHeader_2.54mm:PinHeader_1x02_P2.54mm_Vertical (layer F.Cu) (tedit 59FED5CC) (tstamp 5DC0AE82)
    (at 106.68 71.12)
    (descr "Through hole straight pin header, 1x02, 2.54mm pitch, single row")
    (tags "Through hole pin header THT 1x02 2.54mm single row")
    (path /5DC4E4F1)
    (fp_text reference J2 (at 0 -2.33) (layer F.SilkS)
      (effects (font (size 1 1) (thickness 0.15)))
    )
    (fp_text value Conn_01x02_Male (at 0 4.87) (layer F.Fab)
      (effects (font (size 1 1) (thickness 0.15)))
    )
    (fp_text user %R (at 0 1.27 90) (layer F.Fab)
      (effects (font (size 1 1) (thickness 0.15)))
    )
    (fp_line (start 1.8 -1.8) (end -1.8 -1.8) (layer F.CrtYd) (width 0.05))
    (fp_line (start 1.8 4.35) (end 1.8 -1.8) (layer F.CrtYd) (width 0.05))
    (fp_line (start -1.8 4.35) (end 1.8 4.35) (layer F.CrtYd) (width 0.05))
    (fp_line (start -1.8 -1.8) (end -1.8 4.35) (layer F.CrtYd) (width 0.05))
    (fp_line (start -1.33 -1.33) (end 0 -1.33) (layer F.SilkS) (width 0.12))
    (fp_line (start -1.33 0) (end -1.33 -1.33) (layer F.SilkS) (width 0.12))
    (fp_line (start -1.33 1.27) (end 1.33 1.27) (layer F.SilkS) (width 0.12))
    (fp_line (start 1.33 1.27) (end 1.33 3.87) (layer F.SilkS) (width 0.12))
    (fp_line (start -1.33 1.27) (end -1.33 3.87) (layer F.SilkS) (width 0.12))
    (fp_line (start -1.33 3.87) (end 1.33 3.87) (layer F.SilkS) (width 0.12))
    (fp_line (start -1.27 -0.635) (end -0.635 -1.27) (layer F.Fab) (width 0.1))
    (fp_line (start -1.27 3.81) (end -1.27 -0.635) (layer F.Fab) (width 0.1))
    (fp_line (start 1.27 3.81) (end -1.27 3.81) (layer F.Fab) (width 0.1))
    (fp_line (start 1.27 -1.27) (end 1.27 3.81) (layer F.Fab) (width 0.1))
    (fp_line (start -0.635 -1.27) (end 1.27 -1.27) (layer F.Fab) (width 0.1))
    (pad 2 thru_hole oval (at 0 2.54) (size 1.7 1.7) (drill 1) (layers *.Cu *.Mask)
      (net 1 GND))
    (pad 1 thru_hole rect (at 0 0) (size 1.7 1.7) (drill 1) (layers *.Cu *.Mask)
      (net 8 +5V))
    (model ${KISYS3DMOD}/Connector_PinHeader_2.54mm.3dshapes/PinHeader_1x02_P2.54mm_Vertical.wrl
      (at (xyz 0 0 0))
      (scale (xyz 1 1 1))
      (rotate (xyz 0 0 0))
    )
  )

  (module Connector_PinHeader_2.54mm:PinHeader_1x02_P2.54mm_Vertical (layer F.Cu) (tedit 59FED5CC) (tstamp 5DC0AC5C)
    (at 106.68 81.28)
    (descr "Through hole straight pin header, 1x02, 2.54mm pitch, single row")
    (tags "Through hole pin header THT 1x02 2.54mm single row")
    (path /5DC58148)
    (fp_text reference J1 (at 0 -2.33) (layer F.SilkS)
      (effects (font (size 1 1) (thickness 0.15)))
    )
    (fp_text value Conn_01x02_Male (at 0 4.87) (layer F.Fab)
      (effects (font (size 1 1) (thickness 0.15)))
    )
    (fp_text user %R (at 0 1.27 90) (layer F.Fab)
      (effects (font (size 1 1) (thickness 0.15)))
    )
    (fp_line (start 1.8 -1.8) (end -1.8 -1.8) (layer F.CrtYd) (width 0.05))
    (fp_line (start 1.8 4.35) (end 1.8 -1.8) (layer F.CrtYd) (width 0.05))
    (fp_line (start -1.8 4.35) (end 1.8 4.35) (layer F.CrtYd) (width 0.05))
    (fp_line (start -1.8 -1.8) (end -1.8 4.35) (layer F.CrtYd) (width 0.05))
    (fp_line (start -1.33 -1.33) (end 0 -1.33) (layer F.SilkS) (width 0.12))
    (fp_line (start -1.33 0) (end -1.33 -1.33) (layer F.SilkS) (width 0.12))
    (fp_line (start -1.33 1.27) (end 1.33 1.27) (layer F.SilkS) (width 0.12))
    (fp_line (start 1.33 1.27) (end 1.33 3.87) (layer F.SilkS) (width 0.12))
    (fp_line (start -1.33 1.27) (end -1.33 3.87) (layer F.SilkS) (width 0.12))
    (fp_line (start -1.33 3.87) (end 1.33 3.87) (layer F.SilkS) (width 0.12))
    (fp_line (start -1.27 -0.635) (end -0.635 -1.27) (layer F.Fab) (width 0.1))
    (fp_line (start -1.27 3.81) (end -1.27 -0.635) (layer F.Fab) (width 0.1))
    (fp_line (start 1.27 3.81) (end -1.27 3.81) (layer F.Fab) (width 0.1))
    (fp_line (start 1.27 -1.27) (end 1.27 3.81) (layer F.Fab) (width 0.1))
    (fp_line (start -0.635 -1.27) (end 1.27 -1.27) (layer F.Fab) (width 0.1))
    (pad 2 thru_hole oval (at 0 2.54) (size 1.7 1.7) (drill 1) (layers *.Cu *.Mask)
      (net 6 /SEL_PCDU_RT_A))
    (pad 1 thru_hole rect (at 0 0) (size 1.7 1.7) (drill 1) (layers *.Cu *.Mask)
      (net 7 /SEL_PCDU_RT_B))
    (model ${KISYS3DMOD}/Connector_PinHeader_2.54mm.3dshapes/PinHeader_1x02_P2.54mm_Vertical.wrl
      (at (xyz 0 0 0))
      (scale (xyz 1 1 1))
      (rotate (xyz 0 0 0))
    )
  )

  (module Diode_SMD:D_0805_2012Metric (layer F.Cu) (tedit 5B36C52B) (tstamp 5DC0AE56)
    (at 124.46 90.17 180)
    (descr "Diode SMD 0805 (2012 Metric), square (rectangular) end terminal, IPC_7351 nominal, (Body size source: https://docs.google.com/spreadsheets/d/1BsfQQcO9C6DZCsRaXUlFlo91Tg2WpOkGARC1WS5S8t0/edit?usp=sharing), generated with kicad-footprint-generator")
    (tags diode)
    (path /5986F671)
    (attr smd)
    (fp_text reference D2 (at 0 -1.65) (layer F.SilkS)
      (effects (font (size 1 1) (thickness 0.15)))
    )
    (fp_text value D (at 0 1.65) (layer F.Fab)
      (effects (font (size 1 1) (thickness 0.15)))
    )
    (fp_text user %R (at 0 0) (layer F.Fab)
      (effects (font (size 0.5 0.5) (thickness 0.08)))
    )
    (fp_line (start 1.68 0.95) (end -1.68 0.95) (layer F.CrtYd) (width 0.05))
    (fp_line (start 1.68 -0.95) (end 1.68 0.95) (layer F.CrtYd) (width 0.05))
    (fp_line (start -1.68 -0.95) (end 1.68 -0.95) (layer F.CrtYd) (width 0.05))
    (fp_line (start -1.68 0.95) (end -1.68 -0.95) (layer F.CrtYd) (width 0.05))
    (fp_line (start -1.685 0.96) (end 1 0.96) (layer F.SilkS) (width 0.12))
    (fp_line (start -1.685 -0.96) (end -1.685 0.96) (layer F.SilkS) (width 0.12))
    (fp_line (start 1 -0.96) (end -1.685 -0.96) (layer F.SilkS) (width 0.12))
    (fp_line (start 1 0.6) (end 1 -0.6) (layer F.Fab) (width 0.1))
    (fp_line (start -1 0.6) (end 1 0.6) (layer F.Fab) (width 0.1))
    (fp_line (start -1 -0.3) (end -1 0.6) (layer F.Fab) (width 0.1))
    (fp_line (start -0.7 -0.6) (end -1 -0.3) (layer F.Fab) (width 0.1))
    (fp_line (start 1 -0.6) (end -0.7 -0.6) (layer F.Fab) (width 0.1))
    (pad 2 smd roundrect (at 0.9375 0 180) (size 0.975 1.4) (layers F.Cu F.Paste F.Mask) (roundrect_rratio 0.25)
      (net 5 "Net-(D2-Pad2)"))
    (pad 1 smd roundrect (at -0.9375 0 180) (size 0.975 1.4) (layers F.Cu F.Paste F.Mask) (roundrect_rratio 0.25)
      (net 4 "Net-(D1-Pad1)"))
    (model ${KISYS3DMOD}/Diode_SMD.3dshapes/D_0805_2012Metric.wrl
      (at (xyz 0 0 0))
      (scale (xyz 1 1 1))
      (rotate (xyz 0 0 0))
    )
  )

  (module Diode_SMD:D_0805_2012Metric (layer F.Cu) (tedit 5B36C52B) (tstamp 5DC0AE43)
    (at 124.46 81.28 180)
    (descr "Diode SMD 0805 (2012 Metric), square (rectangular) end terminal, IPC_7351 nominal, (Body size source: https://docs.google.com/spreadsheets/d/1BsfQQcO9C6DZCsRaXUlFlo91Tg2WpOkGARC1WS5S8t0/edit?usp=sharing), generated with kicad-footprint-generator")
    (tags diode)
    (path /5986F54A)
    (attr smd)
    (fp_text reference D1 (at 0 -1.65) (layer F.SilkS)
      (effects (font (size 1 1) (thickness 0.15)))
    )
    (fp_text value D (at 0 1.65) (layer F.Fab)
      (effects (font (size 1 1) (thickness 0.15)))
    )
    (fp_text user %R (at 0 0 270) (layer F.Fab)
      (effects (font (size 0.5 0.5) (thickness 0.08)))
    )
    (fp_line (start 1.68 0.95) (end -1.68 0.95) (layer F.CrtYd) (width 0.05))
    (fp_line (start 1.68 -0.95) (end 1.68 0.95) (layer F.CrtYd) (width 0.05))
    (fp_line (start -1.68 -0.95) (end 1.68 -0.95) (layer F.CrtYd) (width 0.05))
    (fp_line (start -1.68 0.95) (end -1.68 -0.95) (layer F.CrtYd) (width 0.05))
    (fp_line (start -1.685 0.96) (end 1 0.96) (layer F.SilkS) (width 0.12))
    (fp_line (start -1.685 -0.96) (end -1.685 0.96) (layer F.SilkS) (width 0.12))
    (fp_line (start 1 -0.96) (end -1.685 -0.96) (layer F.SilkS) (width 0.12))
    (fp_line (start 1 0.6) (end 1 -0.6) (layer F.Fab) (width 0.1))
    (fp_line (start -1 0.6) (end 1 0.6) (layer F.Fab) (width 0.1))
    (fp_line (start -1 -0.3) (end -1 0.6) (layer F.Fab) (width 0.1))
    (fp_line (start -0.7 -0.6) (end -1 -0.3) (layer F.Fab) (width 0.1))
    (fp_line (start 1 -0.6) (end -0.7 -0.6) (layer F.Fab) (width 0.1))
    (pad 2 smd roundrect (at 0.9375 0 180) (size 0.975 1.4) (layers F.Cu F.Paste F.Mask) (roundrect_rratio 0.25)
      (net 3 "Net-(D1-Pad2)"))
    (pad 1 smd roundrect (at -0.9375 0 180) (size 0.975 1.4) (layers F.Cu F.Paste F.Mask) (roundrect_rratio 0.25)
      (net 4 "Net-(D1-Pad1)"))
    (model ${KISYS3DMOD}/Diode_SMD.3dshapes/D_0805_2012Metric.wrl
      (at (xyz 0 0 0))
      (scale (xyz 1 1 1))
      (rotate (xyz 0 0 0))
    )
  )

  (module Capacitor_SMD:C_0805_2012Metric (layer F.Cu) (tedit 5B36C52B) (tstamp 5DC0AE30)
    (at 113.03 73.66 90)
    (descr "Capacitor SMD 0805 (2012 Metric), square (rectangular) end terminal, IPC_7351 nominal, (Body size source: https://docs.google.com/spreadsheets/d/1BsfQQcO9C6DZCsRaXUlFlo91Tg2WpOkGARC1WS5S8t0/edit?usp=sharing), generated with kicad-footprint-generator")
    (tags capacitor)
    (path /5DC0B637)
    (attr smd)
    (fp_text reference C2 (at 0 -1.65 90) (layer F.SilkS)
      (effects (font (size 1 1) (thickness 0.15)))
    )
    (fp_text value 1uF (at 0 1.65 90) (layer F.Fab)
      (effects (font (size 1 1) (thickness 0.15)))
    )
    (fp_text user %R (at 0 0 90) (layer F.Fab)
      (effects (font (size 0.5 0.5) (thickness 0.08)))
    )
    (fp_line (start 1.68 0.95) (end -1.68 0.95) (layer F.CrtYd) (width 0.05))
    (fp_line (start 1.68 -0.95) (end 1.68 0.95) (layer F.CrtYd) (width 0.05))
    (fp_line (start -1.68 -0.95) (end 1.68 -0.95) (layer F.CrtYd) (width 0.05))
    (fp_line (start -1.68 0.95) (end -1.68 -0.95) (layer F.CrtYd) (width 0.05))
    (fp_line (start -0.258578 0.71) (end 0.258578 0.71) (layer F.SilkS) (width 0.12))
    (fp_line (start -0.258578 -0.71) (end 0.258578 -0.71) (layer F.SilkS) (width 0.12))
    (fp_line (start 1 0.6) (end -1 0.6) (layer F.Fab) (width 0.1))
    (fp_line (start 1 -0.6) (end 1 0.6) (layer F.Fab) (width 0.1))
    (fp_line (start -1 -0.6) (end 1 -0.6) (layer F.Fab) (width 0.1))
    (fp_line (start -1 0.6) (end -1 -0.6) (layer F.Fab) (width 0.1))
    (pad 2 smd roundrect (at 0.9375 0 90) (size 0.975 1.4) (layers F.Cu F.Paste F.Mask) (roundrect_rratio 0.25)
      (net 1 GND))
    (pad 1 smd roundrect (at -0.9375 0 90) (size 0.975 1.4) (layers F.Cu F.Paste F.Mask) (roundrect_rratio 0.25)
      (net 2 +3V3))
    (model ${KISYS3DMOD}/Capacitor_SMD.3dshapes/C_0805_2012Metric.wrl
      (at (xyz 0 0 0))
      (scale (xyz 1 1 1))
      (rotate (xyz 0 0 0))
    )
  )

  (module Capacitor_SMD:C_0805_2012Metric (layer F.Cu) (tedit 5B36C52B) (tstamp 5DC0A539)
    (at 125.73 73.9925 90)
    (descr "Capacitor SMD 0805 (2012 Metric), square (rectangular) end terminal, IPC_7351 nominal, (Body size source: https://docs.google.com/spreadsheets/d/1BsfQQcO9C6DZCsRaXUlFlo91Tg2WpOkGARC1WS5S8t0/edit?usp=sharing), generated with kicad-footprint-generator")
    (tags capacitor)
    (path /598DEBB5)
    (attr smd)
    (fp_text reference C1 (at 0 -1.65 90) (layer F.SilkS)
      (effects (font (size 1 1) (thickness 0.15)))
    )
    (fp_text value 1uF (at 0 1.65 90) (layer F.Fab)
      (effects (font (size 1 1) (thickness 0.15)))
    )
    (fp_text user %R (at 0 0 270) (layer F.Fab)
      (effects (font (size 0.5 0.5) (thickness 0.08)))
    )
    (fp_line (start 1.68 0.95) (end -1.68 0.95) (layer F.CrtYd) (width 0.05))
    (fp_line (start 1.68 -0.95) (end 1.68 0.95) (layer F.CrtYd) (width 0.05))
    (fp_line (start -1.68 -0.95) (end 1.68 -0.95) (layer F.CrtYd) (width 0.05))
    (fp_line (start -1.68 0.95) (end -1.68 -0.95) (layer F.CrtYd) (width 0.05))
    (fp_line (start -0.258578 0.71) (end 0.258578 0.71) (layer F.SilkS) (width 0.12))
    (fp_line (start -0.258578 -0.71) (end 0.258578 -0.71) (layer F.SilkS) (width 0.12))
    (fp_line (start 1 0.6) (end -1 0.6) (layer F.Fab) (width 0.1))
    (fp_line (start 1 -0.6) (end 1 0.6) (layer F.Fab) (width 0.1))
    (fp_line (start -1 -0.6) (end 1 -0.6) (layer F.Fab) (width 0.1))
    (fp_line (start -1 0.6) (end -1 -0.6) (layer F.Fab) (width 0.1))
    (pad 2 smd roundrect (at 0.9375 0 90) (size 0.975 1.4) (layers F.Cu F.Paste F.Mask) (roundrect_rratio 0.25)
      (net 1 GND))
    (pad 1 smd roundrect (at -0.9375 0 90) (size 0.975 1.4) (layers F.Cu F.Paste F.Mask) (roundrect_rratio 0.25)
      (net 2 +3V3))
    (model ${KISYS3DMOD}/Capacitor_SMD.3dshapes/C_0805_2012Metric.wrl
      (at (xyz 0 0 0))
      (scale (xyz 1 1 1))
      (rotate (xyz 0 0 0))
    )
  )

  (gr_line (start 137.16 97.79) (end 137.16 67.31) (layer Edge.Cuts) (width 0.1))
  (gr_line (start 104.14 97.79) (end 137.16 97.79) (layer Edge.Cuts) (width 0.1))
  (gr_line (start 104.14 67.31) (end 104.14 97.79) (layer Edge.Cuts) (width 0.1))
  (gr_line (start 137.16 67.31) (end 104.14 67.31) (layer Edge.Cuts) (width 0.1))

  (segment (start 115.8975 72.7225) (end 116.23 72.39) (width 0.5) (layer F.Cu) (net 1))
  (segment (start 113.03 72.7225) (end 115.8975 72.7225) (width 0.5) (layer F.Cu) (net 1))
  (segment (start 112.0925 73.66) (end 113.03 72.7225) (width 0.5) (layer F.Cu) (net 1))
  (segment (start 106.68 73.66) (end 112.0925 73.66) (width 0.5) (layer F.Cu) (net 1))
  (via (at 132.049998 81.28) (size 0.8) (drill 0.4) (layers F.Cu B.Cu) (net 1))
  (segment (start 130.98 81.28) (end 132.049998 81.28) (width 0.5) (layer F.Cu) (net 1))
  (segment (start 132.049998 81.28) (end 132.049998 72.420002) (width 0.5) (layer B.Cu) (net 1))
  (via (at 132.049998 72.420002) (size 0.8) (drill 0.4) (layers F.Cu B.Cu) (net 1))
  (segment (start 128.93 72.39) (end 132.08 72.39) (width 0.5) (layer F.Cu) (net 1))
  (segment (start 128.265 73.055) (end 128.93 72.39) (width 0.5) (layer F.Cu) (net 1))
  (segment (start 125.73 73.055) (end 128.265 73.055) (width 0.5) (layer F.Cu) (net 1))
  (segment (start 125.173763 73.611237) (end 125.73 73.055) (width 0.5) (layer F.Cu) (net 1))
  (segment (start 124.044999 74.740001) (end 125.173763 73.611237) (width 0.5) (layer F.Cu) (net 1))
  (segment (start 121.169999 74.740001) (end 124.044999 74.740001) (width 0.5) (layer F.Cu) (net 1))
  (segment (start 118.819998 72.39) (end 121.169999 74.740001) (width 0.5) (layer F.Cu) (net 1))
  (segment (start 116.23 72.39) (end 118.819998 72.39) (width 0.5) (layer F.Cu) (net 1))
  (via (at 129.54 88.9) (size 0.8) (drill 0.4) (layers F.Cu B.Cu) (net 1))
  (segment (start 129.54 89.445002) (end 129.54 88.9) (width 0.5) (layer F.Cu) (net 1))
  (segment (start 130.98 90.17) (end 130.264998 90.17) (width 0.5) (layer F.Cu) (net 1))
  (segment (start 130.264998 90.17) (end 129.54 89.445002) (width 0.5) (layer F.Cu) (net 1))
  (segment (start 132.049998 81.845685) (end 132.049998 81.28) (width 0.5) (layer B.Cu) (net 1))
  (segment (start 132.049998 83.862) (end 132.049998 81.845685) (width 0.5) (layer B.Cu) (net 1))
  (segment (start 127.419999 88.491999) (end 132.049998 83.862) (width 0.5) (layer B.Cu) (net 1))
  (segment (start 127.861999 89.750001) (end 127.419999 89.308001) (width 0.5) (layer B.Cu) (net 1))
  (segment (start 128.689999 89.750001) (end 127.861999 89.750001) (width 0.5) (layer B.Cu) (net 1))
  (segment (start 127.419999 89.308001) (end 127.419999 88.491999) (width 0.5) (layer B.Cu) (net 1))
  (segment (start 129.54 88.9) (end 128.689999 89.750001) (width 0.5) (layer B.Cu) (net 1))
  (via (at 106.68 90.17) (size 0.8) (drill 0.4) (layers F.Cu B.Cu) (net 1))
  (via (at 106.68 95.25) (size 0.8) (drill 0.4) (layers F.Cu B.Cu) (net 1))
  (via (at 124.46 95.25) (size 0.8) (drill 0.4) (layers F.Cu B.Cu) (net 1))
  (via (at 132.08 95.25) (size 0.8) (drill 0.4) (layers F.Cu B.Cu) (net 1))
  (via (at 106.68 76.835) (size 0.8) (drill 0.4) (layers F.Cu B.Cu) (net 1))
  (via (at 114.3 76.835) (size 0.8) (drill 0.4) (layers F.Cu B.Cu) (net 1))
  (via (at 121.92 76.835) (size 0.8) (drill 0.4) (layers F.Cu B.Cu) (net 1))
  (via (at 130.81 76.962) (size 0.8) (drill 0.4) (layers F.Cu B.Cu) (net 1))
  (via (at 135.382 90.17) (size 0.8) (drill 0.4) (layers F.Cu B.Cu) (net 1))
  (via (at 135.382 82.55) (size 0.8) (drill 0.4) (layers F.Cu B.Cu) (net 1))
  (via (at 109.855 71.755) (size 0.8) (drill 0.4) (layers F.Cu B.Cu) (net 1))
  (via (at 109.855 68.707) (size 0.8) (drill 0.4) (layers F.Cu B.Cu) (net 1))
  (via (at 135.255 69.342) (size 0.8) (drill 0.4) (layers F.Cu B.Cu) (net 1))
  (via (at 125.095 70.485) (size 0.8) (drill 0.4) (layers F.Cu B.Cu) (net 1))
  (segment (start 116.1375 74.5975) (end 116.23 74.69) (width 0.5) (layer F.Cu) (net 2))
  (segment (start 113.03 74.5975) (end 116.1375 74.5975) (width 0.5) (layer F.Cu) (net 2))
  (segment (start 134.21 80.965002) (end 133.895002 81.28) (width 0.5) (layer F.Cu) (net 2))
  (segment (start 134.21 79.694998) (end 134.21 80.965002) (width 0.5) (layer F.Cu) (net 2))
  (segment (start 133.319992 78.80499) (end 134.21 79.694998) (width 0.5) (layer F.Cu) (net 2))
  (segment (start 116.23 74.69) (end 117.73 74.69) (width 0.5) (layer F.Cu) (net 2))
  (segment (start 117.73 74.69) (end 121.84499 78.80499) (width 0.5) (layer F.Cu) (net 2))
  (segment (start 133.18 81.405) (end 133.18 82.23) (width 0.5) (layer F.Cu) (net 2))
  (segment (start 133.305 81.28) (end 133.18 81.405) (width 0.5) (layer F.Cu) (net 2))
  (segment (start 133.895002 81.28) (end 133.305 81.28) (width 0.5) (layer F.Cu) (net 2))
  (segment (start 133.895002 90.17) (end 133.18 90.17) (width 0.5) (layer F.Cu) (net 2))
  (segment (start 134.160001 89.905001) (end 133.895002 90.17) (width 0.5) (layer F.Cu) (net 2))
  (segment (start 134.160001 84.035001) (end 134.160001 89.905001) (width 0.5) (layer F.Cu) (net 2))
  (segment (start 133.18 83.055) (end 134.160001 84.035001) (width 0.5) (layer F.Cu) (net 2))
  (segment (start 133.18 82.23) (end 133.18 83.055) (width 0.5) (layer F.Cu) (net 2))
  (segment (start 133.18 91.12) (end 133.18 90.17) (width 0.5) (layer F.Cu) (net 2))
  (segment (start 125.97 74.69) (end 125.73 74.93) (width 0.5) (layer F.Cu) (net 2))
  (segment (start 128.93 74.69) (end 125.97 74.69) (width 0.5) (layer F.Cu) (net 2))
  (segment (start 128.93 74.69) (end 128.93 76.81) (width 0.5) (layer F.Cu) (net 2))
  (segment (start 128.93 76.81) (end 126.93501 78.80499) (width 0.5) (layer F.Cu) (net 2))
  (segment (start 121.84499 78.80499) (end 126.93501 78.80499) (width 0.5) (layer F.Cu) (net 2))
  (segment (start 126.93501 78.80499) (end 133.319992 78.80499) (width 0.5) (layer F.Cu) (net 2))
  (segment (start 123.5225 81.3475) (end 123.5225 81.28) (width 0.5) (layer F.Cu) (net 3))
  (segment (start 119.78 85.09) (end 123.5225 81.3475) (width 0.5) (layer F.Cu) (net 3))
  (segment (start 119.38 85.09) (end 119.78 85.09) (width 0.5) (layer F.Cu) (net 3))
  (segment (start 121.08 85.09) (end 119.38 85.09) (width 0.5) (layer F.Cu) (net 3))
  (segment (start 124.46 88.47) (end 121.08 85.09) (width 0.5) (layer F.Cu) (net 3))
  (segment (start 124.46 91.87) (end 124.46 88.47) (width 0.5) (layer F.Cu) (net 3))
  (segment (start 121.08 95.25) (end 124.46 91.87) (width 0.5) (layer F.Cu) (net 3))
  (segment (start 119.38 95.25) (end 121.08 95.25) (width 0.5) (layer F.Cu) (net 3))
  (segment (start 132.975 80.33) (end 133.18 80.33) (width 0.5) (layer F.Cu) (net 4))
  (segment (start 132.15 79.505) (end 132.975 80.33) (width 0.5) (layer F.Cu) (net 4))
  (segment (start 127.1725 79.505) (end 132.15 79.505) (width 0.5) (layer F.Cu) (net 4))
  (segment (start 125.3975 81.28) (end 127.1725 79.505) (width 0.5) (layer F.Cu) (net 4))
  (segment (start 125.3975 90.17) (end 125.3975 81.28) (width 0.5) (layer F.Cu) (net 4))
  (segment (start 125.953737 90.726237) (end 125.3975 90.17) (width 0.5) (layer F.Cu) (net 4))
  (segment (start 127.122501 91.895001) (end 125.953737 90.726237) (width 0.5) (layer F.Cu) (net 4))
  (segment (start 131.870001 91.895001) (end 127.122501 91.895001) (width 0.5) (layer F.Cu) (net 4))
  (segment (start 131.960001 91.805001) (end 131.870001 91.895001) (width 0.5) (layer F.Cu) (net 4))
  (segment (start 131.960001 89.409999) (end 131.960001 91.805001) (width 0.5) (layer F.Cu) (net 4))
  (segment (start 132.15 89.22) (end 131.960001 89.409999) (width 0.5) (layer F.Cu) (net 4))
  (segment (start 133.18 89.22) (end 132.15 89.22) (width 0.5) (layer F.Cu) (net 4))
  (segment (start 111.76 86.39) (end 111.76 85.09) (width 0.5) (layer F.Cu) (net 5))
  (segment (start 111.76 87.779963) (end 111.76 86.39) (width 0.5) (layer F.Cu) (net 5))
  (segment (start 117.940047 93.96001) (end 111.76 87.779963) (width 0.5) (layer F.Cu) (net 5))
  (segment (start 120.53249 93.96001) (end 117.940047 93.96001) (width 0.5) (layer F.Cu) (net 5))
  (segment (start 123.5225 90.97) (end 120.53249 93.96001) (width 0.5) (layer F.Cu) (net 5))
  (segment (start 123.5225 90.17) (end 123.5225 90.97) (width 0.5) (layer F.Cu) (net 5))
  (segment (start 106.68 85.022081) (end 106.68 83.82) (width 0.5) (layer F.Cu) (net 6))
  (segment (start 106.68 86.79) (end 106.68 85.022081) (width 0.5) (layer F.Cu) (net 6))
  (segment (start 110.06 90.17) (end 106.68 86.79) (width 0.5) (layer F.Cu) (net 6))
  (segment (start 111.76 90.17) (end 110.06 90.17) (width 0.5) (layer F.Cu) (net 6))
  (segment (start 105.830001 82.970001) (end 106.68 83.82) (width 0.5) (layer F.Cu) (net 6))
  (segment (start 105.379999 80.069999) (end 105.379999 82.519999) (width 0.5) (layer F.Cu) (net 6))
  (segment (start 106.690008 78.75999) (end 105.379999 80.069999) (width 0.5) (layer F.Cu) (net 6))
  (segment (start 113.88999 78.75999) (end 106.690008 78.75999) (width 0.5) (layer F.Cu) (net 6))
  (segment (start 105.379999 82.519999) (end 105.830001 82.970001) (width 0.5) (layer F.Cu) (net 6))
  (segment (start 117.68 82.55) (end 113.88999 78.75999) (width 0.5) (layer F.Cu) (net 6))
  (segment (start 119.38 82.55) (end 117.68 82.55) (width 0.5) (layer F.Cu) (net 6))
  (segment (start 110.49 81.28) (end 111.76 80.01) (width 0.5) (layer F.Cu) (net 7))
  (segment (start 106.68 81.28) (end 110.49 81.28) (width 0.5) (layer F.Cu) (net 7))
  (segment (start 117.68 92.71) (end 115.57 90.6) (width 0.5) (layer F.Cu) (net 7))
  (segment (start 119.38 92.71) (end 117.68 92.71) (width 0.5) (layer F.Cu) (net 7))
  (segment (start 112.16 80.01) (end 111.76 80.01) (width 0.5) (layer F.Cu) (net 7))
  (segment (start 115.57 83.42) (end 112.16 80.01) (width 0.5) (layer F.Cu) (net 7))
  (segment (start 115.57 90.6) (end 115.57 83.42) (width 0.5) (layer F.Cu) (net 7))
  (segment (start 116.48 70.09) (end 116.23 70.09) (width 0.5) (layer F.Cu) (net 8))
  (segment (start 117.73 68.84) (end 116.48 70.09) (width 0.5) (layer F.Cu) (net 8))
  (segment (start 126.18 68.84) (end 117.73 68.84) (width 0.5) (layer F.Cu) (net 8))
  (segment (start 127.43 70.09) (end 126.18 68.84) (width 0.5) (layer F.Cu) (net 8))
  (segment (start 128.93 70.09) (end 127.43 70.09) (width 0.5) (layer F.Cu) (net 8))
  (segment (start 107.71 70.09) (end 106.68 71.12) (width 0.5) (layer F.Cu) (net 8))
  (segment (start 116.23 70.09) (end 107.71 70.09) (width 0.5) (layer F.Cu) (net 8))
  (segment (start 128.27 86.292081) (end 128.27 85.09) (width 0.5) (layer F.Cu) (net 9))
  (segment (start 128.27 89.44) (end 128.27 88.9) (width 0.5) (layer F.Cu) (net 9))
  (segment (start 129.95 91.12) (end 128.27 89.44) (width 0.5) (layer F.Cu) (net 9))
  (segment (start 130.98 91.12) (end 129.95 91.12) (width 0.5) (layer F.Cu) (net 9))
  (segment (start 128.27 88.9) (end 128.27 86.292081) (width 0.5) (layer F.Cu) (net 9) (tstamp 5DC1E75A))
  (segment (start 130.98 82.23) (end 131.185 82.23) (width 0.5) (layer F.Cu) (net 9))
  (segment (start 131.185 82.23) (end 132.08 83.125) (width 0.5) (layer F.Cu) (net 9))
  (via (at 132.08 85.09) (size 0.8) (drill 0.4) (layers F.Cu B.Cu) (net 9))
  (via (at 128.27 88.9) (size 0.8) (drill 0.4) (layers F.Cu B.Cu) (net 9))
  (segment (start 132.08 83.125) (end 132.08 85.09) (width 0.5) (layer F.Cu) (net 9))
  (segment (start 132.08 85.09) (end 128.27 88.9) (width 0.5) (layer B.Cu) (net 9))
  (segment (start 128.27 81.2) (end 128.27 82.55) (width 0.5) (layer F.Cu) (net 10))
  (segment (start 129.14 80.33) (end 128.27 81.2) (width 0.5) (layer F.Cu) (net 10))
  (segment (start 130.98 80.33) (end 129.14 80.33) (width 0.5) (layer F.Cu) (net 10))
  (segment (start 129.62 82.55) (end 128.27 82.55) (width 0.5) (layer F.Cu) (net 10))
  (segment (start 130.98 83.91) (end 129.62 82.55) (width 0.5) (layer F.Cu) (net 10))
  (segment (start 130.98 89.22) (end 130.98 83.91) (width 0.5) (layer F.Cu) (net 10))
  (segment (start 119.38 90.17) (end 119.38 87.63) (width 0.5) (layer F.Cu) (net 11))
  (segment (start 112.16 82.55) (end 111.76 82.55) (width 0.5) (layer B.Cu) (net 12))
  (segment (start 113.46 83.85) (end 112.16 82.55) (width 0.5) (layer B.Cu) (net 12))
  (segment (start 113.46 91.41) (end 113.46 83.85) (width 0.5) (layer B.Cu) (net 12))
  (segment (start 112.16 92.71) (end 113.46 91.41) (width 0.5) (layer B.Cu) (net 12))
  (segment (start 111.76 92.71) (end 112.16 92.71) (width 0.5) (layer B.Cu) (net 12))

  (zone (net 1) (net_name GND) (layer B.Cu) (tstamp 0) (hatch edge 0.508)
    (connect_pads (clearance 0.508))
    (min_thickness 0.254)
    (fill yes (arc_segments 32) (thermal_gap 0.508) (thermal_bridge_width 0.508))
    (polygon
      (pts
        (xy 104.14 67.31) (xy 104.14 97.79) (xy 137.16 97.79) (xy 137.16 67.31)
      )
    )
    (filled_polygon
      (pts
        (xy 136.475 97.105) (xy 104.825 97.105) (xy 104.825 83.82) (xy 105.187815 83.82) (xy 105.216487 84.111111)
        (xy 105.301401 84.391034) (xy 105.439294 84.649014) (xy 105.624866 84.875134) (xy 105.850986 85.060706) (xy 106.108966 85.198599)
        (xy 106.388889 85.283513) (xy 106.60705 85.305) (xy 106.75295 85.305) (xy 106.971111 85.283513) (xy 107.251034 85.198599)
        (xy 107.509014 85.060706) (xy 107.735134 84.875134) (xy 107.920706 84.649014) (xy 108.058599 84.391034) (xy 108.143513 84.111111)
        (xy 108.172185 83.82) (xy 108.143513 83.528889) (xy 108.058599 83.248966) (xy 107.920706 82.990986) (xy 107.735134 82.764866)
        (xy 107.705313 82.740393) (xy 107.77418 82.719502) (xy 107.884494 82.660537) (xy 107.981185 82.581185) (xy 108.060537 82.484494)
        (xy 108.119502 82.37418) (xy 108.155812 82.254482) (xy 108.168072 82.13) (xy 108.168072 80.43) (xy 108.155812 80.305518)
        (xy 108.119502 80.18582) (xy 108.060537 80.075506) (xy 108.006778 80.01) (xy 109.918057 80.01) (xy 109.945764 80.291309)
        (xy 110.027818 80.561808) (xy 110.161068 80.811101) (xy 110.340392 81.029608) (xy 110.558899 81.208932) (xy 110.691858 81.28)
        (xy 110.558899 81.351068) (xy 110.340392 81.530392) (xy 110.161068 81.748899) (xy 110.027818 81.998192) (xy 109.945764 82.268691)
        (xy 109.918057 82.55) (xy 109.945764 82.831309) (xy 110.027818 83.101808) (xy 110.161068 83.351101) (xy 110.340392 83.569608)
        (xy 110.558899 83.748932) (xy 110.691858 83.82) (xy 110.558899 83.891068) (xy 110.340392 84.070392) (xy 110.161068 84.288899)
        (xy 110.027818 84.538192) (xy 109.945764 84.808691) (xy 109.918057 85.09) (xy 109.945764 85.371309) (xy 110.027818 85.641808)
        (xy 110.161068 85.891101) (xy 110.340392 86.109608) (xy 110.558899 86.288932) (xy 110.691858 86.36) (xy 110.558899 86.431068)
        (xy 110.340392 86.610392) (xy 110.161068 86.828899) (xy 110.027818 87.078192) (xy 109.945764 87.348691) (xy 109.918057 87.63)
        (xy 109.945764 87.911309) (xy 110.027818 88.181808) (xy 110.161068 88.431101) (xy 110.340392 88.649608) (xy 110.558899 88.828932)
        (xy 110.691858 88.9) (xy 110.558899 88.971068) (xy 110.340392 89.150392) (xy 110.161068 89.368899) (xy 110.027818 89.618192)
        (xy 109.945764 89.888691) (xy 109.918057 90.17) (xy 109.945764 90.451309) (xy 110.027818 90.721808) (xy 110.161068 90.971101)
        (xy 110.340392 91.189608) (xy 110.558899 91.368932) (xy 110.691858 91.44) (xy 110.558899 91.511068) (xy 110.340392 91.690392)
        (xy 110.161068 91.908899) (xy 110.027818 92.158192) (xy 109.945764 92.428691) (xy 109.918057 92.71) (xy 109.945764 92.991309)
        (xy 110.027818 93.261808) (xy 110.161068 93.511101) (xy 110.340392 93.729608) (xy 110.558899 93.908932) (xy 110.691858 93.98)
        (xy 110.558899 94.051068) (xy 110.340392 94.230392) (xy 110.161068 94.448899) (xy 110.027818 94.698192) (xy 109.945764 94.968691)
        (xy 109.918057 95.25) (xy 109.945764 95.531309) (xy 110.027818 95.801808) (xy 110.161068 96.051101) (xy 110.340392 96.269608)
        (xy 110.558899 96.448932) (xy 110.808192 96.582182) (xy 111.078691 96.664236) (xy 111.289508 96.685) (xy 112.230492 96.685)
        (xy 112.441309 96.664236) (xy 112.711808 96.582182) (xy 112.961101 96.448932) (xy 113.179608 96.269608) (xy 113.358932 96.051101)
        (xy 113.492182 95.801808) (xy 113.574236 95.531309) (xy 113.601943 95.25) (xy 113.574236 94.968691) (xy 113.492182 94.698192)
        (xy 113.358932 94.448899) (xy 113.179608 94.230392) (xy 112.961101 94.051068) (xy 112.828142 93.98) (xy 112.961101 93.908932)
        (xy 113.179608 93.729608) (xy 113.358932 93.511101) (xy 113.492182 93.261808) (xy 113.574236 92.991309) (xy 113.601943 92.71)
        (xy 113.584875 92.536704) (xy 114.05505 92.066529) (xy 114.088817 92.038817) (xy 114.199411 91.904059) (xy 114.234824 91.837805)
        (xy 114.281589 91.750314) (xy 114.332195 91.58349) (xy 114.332195 91.583489) (xy 114.345 91.453477) (xy 114.345 91.453469)
        (xy 114.349281 91.41) (xy 114.345 91.366531) (xy 114.345 83.893469) (xy 114.349281 83.85) (xy 114.345 83.806531)
        (xy 114.345 83.806523) (xy 114.332195 83.67651) (xy 114.322388 83.64418) (xy 114.281589 83.509686) (xy 114.199411 83.355941)
        (xy 114.116532 83.254953) (xy 114.11653 83.254951) (xy 114.088817 83.221183) (xy 114.055049 83.19347) (xy 113.584875 82.723296)
        (xy 113.601943 82.55) (xy 113.574236 82.268691) (xy 113.492182 81.998192) (xy 113.358932 81.748899) (xy 113.179608 81.530392)
        (xy 112.961101 81.351068) (xy 112.828142 81.28) (xy 112.961101 81.208932) (xy 113.179608 81.029608) (xy 113.358932 80.811101)
        (xy 113.492182 80.561808) (xy 113.574236 80.291309) (xy 113.601943 80.01) (xy 117.538057 80.01) (xy 117.565764 80.291309)
        (xy 117.647818 80.561808) (xy 117.781068 80.811101) (xy 117.960392 81.029608) (xy 118.178899 81.208932) (xy 118.311858 81.28)
        (xy 118.178899 81.351068) (xy 117.960392 81.530392) (xy 117.781068 81.748899) (xy 117.647818 81.998192) (xy 117.565764 82.268691)
        (xy 117.538057 82.55) (xy 117.565764 82.831309) (xy 117.647818 83.101808) (xy 117.781068 83.351101) (xy 117.960392 83.569608)
        (xy 118.178899 83.748932) (xy 118.311858 83.82) (xy 118.178899 83.891068) (xy 117.960392 84.070392) (xy 117.781068 84.288899)
        (xy 117.647818 84.538192) (xy 117.565764 84.808691) (xy 117.538057 85.09) (xy 117.565764 85.371309) (xy 117.647818 85.641808)
        (xy 117.781068 85.891101) (xy 117.960392 86.109608) (xy 118.178899 86.288932) (xy 118.311858 86.36) (xy 118.178899 86.431068)
        (xy 117.960392 86.610392) (xy 117.781068 86.828899) (xy 117.647818 87.078192) (xy 117.565764 87.348691) (xy 117.538057 87.63)
        (xy 117.565764 87.911309) (xy 117.647818 88.181808) (xy 117.781068 88.431101) (xy 117.960392 88.649608) (xy 118.178899 88.828932)
        (xy 118.311858 88.9) (xy 118.178899 88.971068) (xy 117.960392 89.150392) (xy 117.781068 89.368899) (xy 117.647818 89.618192)
        (xy 117.565764 89.888691) (xy 117.538057 90.17) (xy 117.565764 90.451309) (xy 117.647818 90.721808) (xy 117.781068 90.971101)
        (xy 117.960392 91.189608) (xy 118.178899 91.368932) (xy 118.311858 91.44) (xy 118.178899 91.511068) (xy 117.960392 91.690392)
        (xy 117.781068 91.908899) (xy 117.647818 92.158192) (xy 117.565764 92.428691) (xy 117.538057 92.71) (xy 117.565764 92.991309)
        (xy 117.647818 93.261808) (xy 117.781068 93.511101) (xy 117.960392 93.729608) (xy 118.073482 93.822419) (xy 118.055518 93.824188)
        (xy 117.93582 93.860498) (xy 117.825506 93.919463) (xy 117.728815 93.998815) (xy 117.649463 94.095506) (xy 117.590498 94.20582)
        (xy 117.554188 94.325518) (xy 117.541928 94.45) (xy 117.541928 96.05) (xy 117.554188 96.174482) (xy 117.590498 96.29418)
        (xy 117.649463 96.404494) (xy 117.728815 96.501185) (xy 117.825506 96.580537) (xy 117.93582 96.639502) (xy 118.055518 96.675812)
        (xy 118.18 96.688072) (xy 120.58 96.688072) (xy 120.704482 96.675812) (xy 120.82418 96.639502) (xy 120.934494 96.580537)
        (xy 121.031185 96.501185) (xy 121.110537 96.404494) (xy 121.169502 96.29418) (xy 121.205812 96.174482) (xy 121.218072 96.05)
        (xy 121.218072 94.45) (xy 121.205812 94.325518) (xy 121.169502 94.20582) (xy 121.110537 94.095506) (xy 121.031185 93.998815)
        (xy 120.934494 93.919463) (xy 120.82418 93.860498) (xy 120.704482 93.824188) (xy 120.686518 93.822419) (xy 120.799608 93.729608)
        (xy 120.978932 93.511101) (xy 121.112182 93.261808) (xy 121.194236 92.991309) (xy 121.221943 92.71) (xy 121.194236 92.428691)
        (xy 121.112182 92.158192) (xy 120.978932 91.908899) (xy 120.799608 91.690392) (xy 120.581101 91.511068) (xy 120.448142 91.44)
        (xy 120.581101 91.368932) (xy 120.799608 91.189608) (xy 120.978932 90.971101) (xy 121.112182 90.721808) (xy 121.194236 90.451309)
        (xy 121.221943 90.17) (xy 121.194236 89.888691) (xy 121.112182 89.618192) (xy 120.978932 89.368899) (xy 120.799608 89.150392)
        (xy 120.581101 88.971068) (xy 120.448142 88.9) (xy 120.581101 88.828932) (xy 120.618717 88.798061) (xy 127.235 88.798061)
        (xy 127.235 89.001939) (xy 127.274774 89.201898) (xy 127.352795 89.390256) (xy 127.466063 89.559774) (xy 127.610226 89.703937)
        (xy 127.779744 89.817205) (xy 127.968102 89.895226) (xy 128.168061 89.935) (xy 128.371939 89.935) (xy 128.571898 89.895226)
        (xy 128.760256 89.817205) (xy 128.929774 89.703937) (xy 129.073937 89.559774) (xy 129.187205 89.390256) (xy 129.265226 89.201898)
        (xy 129.276535 89.145043) (xy 132.325044 86.096535) (xy 132.381898 86.085226) (xy 132.570256 86.007205) (xy 132.739774 85.893937)
        (xy 132.883937 85.749774) (xy 132.997205 85.580256) (xy 133.075226 85.391898) (xy 133.115 85.191939) (xy 133.115 84.988061)
        (xy 133.075226 84.788102) (xy 132.997205 84.599744) (xy 132.883937 84.430226) (xy 132.739774 84.286063) (xy 132.570256 84.172795)
        (xy 132.381898 84.094774) (xy 132.181939 84.055) (xy 131.978061 84.055) (xy 131.778102 84.094774) (xy 131.589744 84.172795)
        (xy 131.420226 84.286063) (xy 131.276063 84.430226) (xy 131.162795 84.599744) (xy 131.084774 84.788102) (xy 131.073465 84.844956)
        (xy 128.024957 87.893465) (xy 127.968102 87.904774) (xy 127.779744 87.982795) (xy 127.610226 88.096063) (xy 127.466063 88.240226)
        (xy 127.352795 88.409744) (xy 127.274774 88.598102) (xy 127.235 88.798061) (xy 120.618717 88.798061) (xy 120.799608 88.649608)
        (xy 120.978932 88.431101) (xy 121.112182 88.181808) (xy 121.194236 87.911309) (xy 121.221943 87.63) (xy 121.194236 87.348691)
        (xy 121.112182 87.078192) (xy 120.978932 86.828899) (xy 120.799608 86.610392) (xy 120.581101 86.431068) (xy 120.448142 86.36)
        (xy 120.581101 86.288932) (xy 120.799608 86.109608) (xy 120.978932 85.891101) (xy 121.112182 85.641808) (xy 121.194236 85.371309)
        (xy 121.221943 85.09) (xy 126.777815 85.09) (xy 126.806487 85.381111) (xy 126.891401 85.661034) (xy 127.029294 85.919014)
        (xy 127.214866 86.145134) (xy 127.440986 86.330706) (xy 127.698966 86.468599) (xy 127.978889 86.553513) (xy 128.19705 86.575)
        (xy 128.34295 86.575) (xy 128.561111 86.553513) (xy 128.841034 86.468599) (xy 129.099014 86.330706) (xy 129.325134 86.145134)
        (xy 129.510706 85.919014) (xy 129.648599 85.661034) (xy 129.733513 85.381111) (xy 129.762185 85.09) (xy 129.733513 84.798889)
        (xy 129.648599 84.518966) (xy 129.510706 84.260986) (xy 129.325134 84.034866) (xy 129.295313 84.010393) (xy 129.36418 83.989502)
        (xy 129.474494 83.930537) (xy 129.571185 83.851185) (xy 129.650537 83.754494) (xy 129.709502 83.64418) (xy 129.745812 83.524482)
        (xy 129.758072 83.4) (xy 129.758072 81.7) (xy 129.745812 81.575518) (xy 129.709502 81.45582) (xy 129.650537 81.345506)
        (xy 129.571185 81.248815) (xy 129.474494 81.169463) (xy 129.36418 81.110498) (xy 129.244482 81.074188) (xy 129.12 81.061928)
        (xy 127.42 81.061928) (xy 127.295518 81.074188) (xy 127.17582 81.110498) (xy 127.065506 81.169463) (xy 126.968815 81.248815)
        (xy 126.889463 81.345506) (xy 126.830498 81.45582) (xy 126.794188 81.575518) (xy 126.781928 81.7) (xy 126.781928 83.4)
        (xy 126.794188 83.524482) (xy 126.830498 83.64418) (xy 126.889463 83.754494) (xy 126.968815 83.851185) (xy 127.065506 83.930537)
        (xy 127.17582 83.989502) (xy 127.244687 84.010393) (xy 127.214866 84.034866) (xy 127.029294 84.260986) (xy 126.891401 84.518966)
        (xy 126.806487 84.798889) (xy 126.777815 85.09) (xy 121.221943 85.09) (xy 121.194236 84.808691) (xy 121.112182 84.538192)
        (xy 120.978932 84.288899) (xy 120.799608 84.070392) (xy 120.581101 83.891068) (xy 120.448142 83.82) (xy 120.581101 83.748932)
        (xy 120.799608 83.569608) (xy 120.978932 83.351101) (xy 121.112182 83.101808) (xy 121.194236 82.831309) (xy 121.221943 82.55)
        (xy 121.194236 82.268691) (xy 121.112182 81.998192) (xy 120.978932 81.748899) (xy 120.799608 81.530392) (xy 120.581101 81.351068)
        (xy 120.448142 81.28) (xy 120.581101 81.208932) (xy 120.799608 81.029608) (xy 120.978932 80.811101) (xy 121.112182 80.561808)
        (xy 121.194236 80.291309) (xy 121.221943 80.01) (xy 121.194236 79.728691) (xy 121.112182 79.458192) (xy 120.978932 79.208899)
        (xy 120.799608 78.990392) (xy 120.581101 78.811068) (xy 120.331808 78.677818) (xy 120.061309 78.595764) (xy 119.850492 78.575)
        (xy 118.909508 78.575) (xy 118.698691 78.595764) (xy 118.428192 78.677818) (xy 118.178899 78.811068) (xy 117.960392 78.990392)
        (xy 117.781068 79.208899) (xy 117.647818 79.458192) (xy 117.565764 79.728691) (xy 117.538057 80.01) (xy 113.601943 80.01)
        (xy 113.574236 79.728691) (xy 113.492182 79.458192) (xy 113.358932 79.208899) (xy 113.179608 78.990392) (xy 112.961101 78.811068)
        (xy 112.711808 78.677818) (xy 112.441309 78.595764) (xy 112.230492 78.575) (xy 111.289508 78.575) (xy 111.078691 78.595764)
        (xy 110.808192 78.677818) (xy 110.558899 78.811068) (xy 110.340392 78.990392) (xy 110.161068 79.208899) (xy 110.027818 79.458192)
        (xy 109.945764 79.728691) (xy 109.918057 80.01) (xy 108.006778 80.01) (xy 107.981185 79.978815) (xy 107.884494 79.899463)
        (xy 107.77418 79.840498) (xy 107.654482 79.804188) (xy 107.53 79.791928) (xy 105.83 79.791928) (xy 105.705518 79.804188)
        (xy 105.58582 79.840498) (xy 105.475506 79.899463) (xy 105.378815 79.978815) (xy 105.299463 80.075506) (xy 105.240498 80.18582)
        (xy 105.204188 80.305518) (xy 105.191928 80.43) (xy 105.191928 82.13) (xy 105.204188 82.254482) (xy 105.240498 82.37418)
        (xy 105.299463 82.484494) (xy 105.378815 82.581185) (xy 105.475506 82.660537) (xy 105.58582 82.719502) (xy 105.654687 82.740393)
        (xy 105.624866 82.764866) (xy 105.439294 82.990986) (xy 105.301401 83.248966) (xy 105.216487 83.528889) (xy 105.187815 83.82)
        (xy 104.825 83.82) (xy 104.825 74.01689) (xy 105.238524 74.01689) (xy 105.283175 74.164099) (xy 105.408359 74.42692)
        (xy 105.582412 74.660269) (xy 105.798645 74.855178) (xy 106.048748 75.004157) (xy 106.323109 75.101481) (xy 106.553 74.980814)
        (xy 106.553 73.787) (xy 106.807 73.787) (xy 106.807 74.980814) (xy 107.036891 75.101481) (xy 107.311252 75.004157)
        (xy 107.561355 74.855178) (xy 107.777588 74.660269) (xy 107.951641 74.42692) (xy 108.076825 74.164099) (xy 108.121476 74.01689)
        (xy 108.000155 73.787) (xy 106.807 73.787) (xy 106.553 73.787) (xy 105.359845 73.787) (xy 105.238524 74.01689)
        (xy 104.825 74.01689) (xy 104.825 70.27) (xy 105.191928 70.27) (xy 105.191928 71.97) (xy 105.204188 72.094482)
        (xy 105.240498 72.21418) (xy 105.299463 72.324494) (xy 105.378815 72.421185) (xy 105.475506 72.500537) (xy 105.58582 72.559502)
        (xy 105.666466 72.583966) (xy 105.582412 72.659731) (xy 105.408359 72.89308) (xy 105.283175 73.155901) (xy 105.238524 73.30311)
        (xy 105.359845 73.533) (xy 106.553 73.533) (xy 106.553 73.513) (xy 106.807 73.513) (xy 106.807 73.533)
        (xy 108.000155 73.533) (xy 108.121476 73.30311) (xy 108.076825 73.155901) (xy 107.951641 72.89308) (xy 107.777588 72.659731)
        (xy 107.693534 72.583966) (xy 107.77418 72.559502) (xy 107.884494 72.500537) (xy 107.981185 72.421185) (xy 108.060537 72.324494)
        (xy 108.119502 72.21418) (xy 108.155812 72.094482) (xy 108.168072 71.97) (xy 108.168072 70.27) (xy 108.155812 70.145518)
        (xy 108.119502 70.02582) (xy 108.060537 69.915506) (xy 107.981185 69.818815) (xy 107.884494 69.739463) (xy 107.77418 69.680498)
        (xy 107.654482 69.644188) (xy 107.53 69.631928) (xy 105.83 69.631928) (xy 105.705518 69.644188) (xy 105.58582 69.680498)
        (xy 105.475506 69.739463) (xy 105.378815 69.818815) (xy 105.299463 69.915506) (xy 105.240498 70.02582) (xy 105.204188 70.145518)
        (xy 105.191928 70.27) (xy 104.825 70.27) (xy 104.825 67.995) (xy 136.475001 67.995)
      )
    )
  )
  (zone (net 1) (net_name GND) (layer F.Cu) (tstamp 0) (hatch edge 0.508)
    (connect_pads (clearance 0.508))
    (min_thickness 0.254)
    (fill yes (arc_segments 32) (thermal_gap 0.508) (thermal_bridge_width 0.508))
    (polygon
      (pts
        (xy 104.14 67.31) (xy 137.16 67.31) (xy 137.16 97.79) (xy 104.14 97.79)
      )
    )
    (filled_polygon
      (pts
        (xy 117.389687 68.018411) (xy 117.235941 68.100589) (xy 117.235939 68.10059) (xy 117.23594 68.10059) (xy 117.134953 68.183468)
        (xy 117.134951 68.18347) (xy 117.101183 68.211183) (xy 117.07347 68.244951) (xy 116.616493 68.701928) (xy 115.23 68.701928)
        (xy 115.105518 68.714188) (xy 114.98582 68.750498) (xy 114.875506 68.809463) (xy 114.778815 68.888815) (xy 114.699463 68.985506)
        (xy 114.640498 69.09582) (xy 114.607379 69.205) (xy 107.753469 69.205) (xy 107.71 69.200719) (xy 107.666531 69.205)
        (xy 107.666523 69.205) (xy 107.559731 69.215518) (xy 107.536509 69.217805) (xy 107.485903 69.233157) (xy 107.369687 69.268411)
        (xy 107.215941 69.350589) (xy 107.215939 69.35059) (xy 107.21594 69.35059) (xy 107.114953 69.433468) (xy 107.114951 69.43347)
        (xy 107.081183 69.461183) (xy 107.05347 69.494951) (xy 106.916493 69.631928) (xy 105.83 69.631928) (xy 105.705518 69.644188)
        (xy 105.58582 69.680498) (xy 105.475506 69.739463) (xy 105.378815 69.818815) (xy 105.299463 69.915506) (xy 105.240498 70.02582)
        (xy 105.204188 70.145518) (xy 105.191928 70.27) (xy 105.191928 71.97) (xy 105.204188 72.094482) (xy 105.240498 72.21418)
        (xy 105.299463 72.324494) (xy 105.378815 72.421185) (xy 105.475506 72.500537) (xy 105.58582 72.559502) (xy 105.666466 72.583966)
        (xy 105.582412 72.659731) (xy 105.408359 72.89308) (xy 105.283175 73.155901) (xy 105.238524 73.30311) (xy 105.359845 73.533)
        (xy 106.553 73.533) (xy 106.553 73.513) (xy 106.807 73.513) (xy 106.807 73.533) (xy 108.000155 73.533)
        (xy 108.121476 73.30311) (xy 108.076825 73.155901) (xy 107.951641 72.89308) (xy 107.777588 72.659731) (xy 107.693534 72.583966)
        (xy 107.77418 72.559502) (xy 107.884494 72.500537) (xy 107.981185 72.421185) (xy 108.060537 72.324494) (xy 108.108373 72.235)
        (xy 111.691928 72.235) (xy 111.695 72.43675) (xy 111.85375 72.5955) (xy 112.903 72.5955) (xy 112.903 71.75875)
        (xy 113.157 71.75875) (xy 113.157 72.5955) (xy 114.20625 72.5955) (xy 114.365 72.43675) (xy 114.368072 72.235)
        (xy 114.355812 72.110518) (xy 114.319502 71.99082) (xy 114.260537 71.880506) (xy 114.181185 71.783815) (xy 114.084494 71.704463)
        (xy 113.97418 71.645498) (xy 113.854482 71.609188) (xy 113.73 71.596928) (xy 113.31575 71.6) (xy 113.157 71.75875)
        (xy 112.903 71.75875) (xy 112.74425 71.6) (xy 112.33 71.596928) (xy 112.205518 71.609188) (xy 112.08582 71.645498)
        (xy 111.975506 71.704463) (xy 111.878815 71.783815) (xy 111.799463 71.880506) (xy 111.740498 71.99082) (xy 111.704188 72.110518)
        (xy 111.691928 72.235) (xy 108.108373 72.235) (xy 108.119502 72.21418) (xy 108.155812 72.094482) (xy 108.168072 71.97)
        (xy 108.168072 70.975) (xy 114.607379 70.975) (xy 114.640498 71.08418) (xy 114.699463 71.194494) (xy 114.736809 71.24)
        (xy 114.699463 71.285506) (xy 114.640498 71.39582) (xy 114.604188 71.515518) (xy 114.591928 71.64) (xy 114.595 72.10425)
        (xy 114.75375 72.263) (xy 116.103 72.263) (xy 116.103 72.243) (xy 116.357 72.243) (xy 116.357 72.263)
        (xy 117.70625 72.263) (xy 117.865 72.10425) (xy 117.868072 71.64) (xy 117.855812 71.515518) (xy 117.819502 71.39582)
        (xy 117.760537 71.285506) (xy 117.723191 71.24) (xy 117.760537 71.194494) (xy 117.819502 71.08418) (xy 117.855812 70.964482)
        (xy 117.868072 70.84) (xy 117.868072 69.953507) (xy 118.096579 69.725) (xy 125.813422 69.725) (xy 126.773468 70.685047)
        (xy 126.801183 70.718817) (xy 126.834951 70.74653) (xy 126.834953 70.746532) (xy 126.906452 70.80521) (xy 126.935941 70.829411)
        (xy 127.089687 70.911589) (xy 127.204804 70.94651) (xy 127.256509 70.962195) (xy 127.271306 70.963652) (xy 127.304941 70.966965)
        (xy 127.340498 71.08418) (xy 127.399463 71.194494) (xy 127.436809 71.24) (xy 127.399463 71.285506) (xy 127.340498 71.39582)
        (xy 127.304188 71.515518) (xy 127.291928 71.64) (xy 127.295 72.10425) (xy 127.45375 72.263) (xy 128.803 72.263)
        (xy 128.803 72.243) (xy 129.057 72.243) (xy 129.057 72.263) (xy 130.40625 72.263) (xy 130.565 72.10425)
        (xy 130.568072 71.64) (xy 130.555812 71.515518) (xy 130.519502 71.39582) (xy 130.460537 71.285506) (xy 130.423191 71.24)
        (xy 130.460537 71.194494) (xy 130.519502 71.08418) (xy 130.555812 70.964482) (xy 130.568072 70.84) (xy 130.568072 69.34)
        (xy 130.555812 69.215518) (xy 130.519502 69.09582) (xy 130.460537 68.985506) (xy 130.381185 68.888815) (xy 130.284494 68.809463)
        (xy 130.17418 68.750498) (xy 130.054482 68.714188) (xy 129.93 68.701928) (xy 127.93 68.701928) (xy 127.805518 68.714188)
        (xy 127.68582 68.750498) (xy 127.575506 68.809463) (xy 127.479682 68.888103) (xy 126.836534 68.244956) (xy 126.808817 68.211183)
        (xy 126.674059 68.100589) (xy 126.520313 68.018411) (xy 126.443138 67.995) (xy 136.475001 67.995) (xy 136.475 97.105)
        (xy 104.825 97.105) (xy 104.825 83.216578) (xy 105.209388 83.600966) (xy 105.187815 83.82) (xy 105.216487 84.111111)
        (xy 105.301401 84.391034) (xy 105.439294 84.649014) (xy 105.624866 84.875134) (xy 105.795 85.014759) (xy 105.795 85.065557)
        (xy 105.795001 85.065567) (xy 105.795 86.746531) (xy 105.790719 86.79) (xy 105.795 86.833469) (xy 105.795 86.833476)
        (xy 105.802317 86.907768) (xy 105.807805 86.96349) (xy 105.823157 87.014096) (xy 105.858411 87.130312) (xy 105.940589 87.284058)
        (xy 106.051183 87.418817) (xy 106.084956 87.446534) (xy 109.40347 90.765049) (xy 109.431183 90.798817) (xy 109.464951 90.82653)
        (xy 109.464953 90.826532) (xy 109.554141 90.899727) (xy 109.565941 90.909411) (xy 109.719687 90.991589) (xy 109.88651 91.042195)
        (xy 110.016523 91.055) (xy 110.016531 91.055) (xy 110.06 91.059281) (xy 110.103469 91.055) (xy 110.229922 91.055)
        (xy 110.340392 91.189608) (xy 110.558899 91.368932) (xy 110.691858 91.44) (xy 110.558899 91.511068) (xy 110.340392 91.690392)
        (xy 110.161068 91.908899) (xy 110.027818 92.158192) (xy 109.945764 92.428691) (xy 109.918057 92.71) (xy 109.945764 92.991309)
        (xy 110.027818 93.261808) (xy 110.161068 93.511101) (xy 110.340392 93.729608) (xy 110.558899 93.908932) (xy 110.691858 93.98)
        (xy 110.558899 94.051068) (xy 110.340392 94.230392) (xy 110.161068 94.448899) (xy 110.027818 94.698192) (xy 109.945764 94.968691)
        (xy 109.918057 95.25) (xy 109.945764 95.531309) (xy 110.027818 95.801808) (xy 110.161068 96.051101) (xy 110.340392 96.269608)
        (xy 110.558899 96.448932) (xy 110.808192 96.582182) (xy 111.078691 96.664236) (xy 111.289508 96.685) (xy 112.230492 96.685)
        (xy 112.441309 96.664236) (xy 112.711808 96.582182) (xy 112.961101 96.448932) (xy 113.179608 96.269608) (xy 113.358932 96.051101)
        (xy 113.492182 95.801808) (xy 113.574236 95.531309) (xy 113.601943 95.25) (xy 113.574236 94.968691) (xy 113.492182 94.698192)
        (xy 113.358932 94.448899) (xy 113.179608 94.230392) (xy 112.961101 94.051068) (xy 112.828142 93.98) (xy 112.961101 93.908932)
        (xy 113.179608 93.729608) (xy 113.358932 93.511101) (xy 113.492182 93.261808) (xy 113.574236 92.991309) (xy 113.601943 92.71)
        (xy 113.574236 92.428691) (xy 113.492182 92.158192) (xy 113.358932 91.908899) (xy 113.179608 91.690392) (xy 112.961101 91.511068)
        (xy 112.828142 91.44) (xy 112.961101 91.368932) (xy 113.179608 91.189608) (xy 113.358932 90.971101) (xy 113.477582 90.749123)
        (xy 117.283517 94.555059) (xy 117.31123 94.588827) (xy 117.344998 94.61654) (xy 117.345 94.616542) (xy 117.391805 94.654954)
        (xy 117.445988 94.699421) (xy 117.541928 94.750701) (xy 117.541928 96.05) (xy 117.554188 96.174482) (xy 117.590498 96.29418)
        (xy 117.649463 96.404494) (xy 117.728815 96.501185) (xy 117.825506 96.580537) (xy 117.93582 96.639502) (xy 118.055518 96.675812)
        (xy 118.18 96.688072) (xy 120.58 96.688072) (xy 120.704482 96.675812) (xy 120.82418 96.639502) (xy 120.934494 96.580537)
        (xy 121.031185 96.501185) (xy 121.110537 96.404494) (xy 121.169502 96.29418) (xy 121.205812 96.174482) (xy 121.210545 96.126425)
        (xy 121.25349 96.122195) (xy 121.420313 96.071589) (xy 121.574059 95.989411) (xy 121.708817 95.878817) (xy 121.736534 95.845044)
        (xy 125.05505 92.526529) (xy 125.088817 92.498817) (xy 125.146369 92.428691) (xy 125.199411 92.364059) (xy 125.234153 92.29906)
        (xy 125.281589 92.210313) (xy 125.332195 92.04349) (xy 125.345 91.913477) (xy 125.345 91.913469) (xy 125.349281 91.87)
        (xy 125.345 91.826531) (xy 125.345 91.508072) (xy 125.483994 91.508072) (xy 126.465971 92.49005) (xy 126.493684 92.523818)
        (xy 126.527452 92.551531) (xy 126.527454 92.551533) (xy 126.597978 92.609411) (xy 126.628442 92.634412) (xy 126.782188 92.71659)
        (xy 126.949011 92.767196) (xy 127.079024 92.780001) (xy 127.079032 92.780001) (xy 127.122501 92.784282) (xy 127.16597 92.780001)
        (xy 131.826532 92.780001) (xy 131.870001 92.784282) (xy 131.91347 92.780001) (xy 131.913478 92.780001) (xy 132.043491 92.767196)
        (xy 132.210314 92.71659) (xy 132.36406 92.634412) (xy 132.498818 92.523818) (xy 132.526535 92.490045) (xy 132.555045 92.461535)
        (xy 132.588818 92.433818) (xy 132.699412 92.29906) (xy 132.78159 92.145314) (xy 132.800471 92.083072) (xy 133.71 92.083072)
        (xy 133.834482 92.070812) (xy 133.95418 92.034502) (xy 134.064494 91.975537) (xy 134.161185 91.896185) (xy 134.240537 91.799494)
        (xy 134.299502 91.68918) (xy 134.335812 91.569482) (xy 134.348072 91.445) (xy 134.348072 90.93132) (xy 134.389061 90.909411)
        (xy 134.523819 90.798817) (xy 134.551536 90.765044) (xy 134.755045 90.561535) (xy 134.788818 90.533818) (xy 134.899412 90.39906)
        (xy 134.98159 90.245314) (xy 135.032196 90.078491) (xy 135.045001 89.948478) (xy 135.045001 89.948468) (xy 135.049282 89.905002)
        (xy 135.045001 89.861536) (xy 135.045001 84.07847) (xy 135.049282 84.035001) (xy 135.045001 83.991532) (xy 135.045001 83.991524)
        (xy 135.032196 83.861511) (xy 134.98159 83.694688) (xy 134.899412 83.540942) (xy 134.84914 83.479686) (xy 134.816533 83.439954)
        (xy 134.816531 83.439952) (xy 134.788818 83.406184) (xy 134.755051 83.378472) (xy 134.256398 82.87982) (xy 134.299502 82.79918)
        (xy 134.335812 82.679482) (xy 134.348072 82.555) (xy 134.348072 82.04132) (xy 134.389061 82.019411) (xy 134.523819 81.908817)
        (xy 134.551536 81.875044) (xy 134.805044 81.621536) (xy 134.838817 81.593819) (xy 134.949411 81.459061) (xy 135.031589 81.305315)
        (xy 135.082195 81.138492) (xy 135.095 81.008479) (xy 135.095 81.008469) (xy 135.099281 80.965003) (xy 135.095 80.921537)
        (xy 135.095 79.738463) (xy 135.099281 79.694997) (xy 135.095 79.651531) (xy 135.095 79.651521) (xy 135.082195 79.521508)
        (xy 135.031589 79.354685) (xy 134.949411 79.200939) (xy 134.92521 79.17145) (xy 134.866532 79.099951) (xy 134.86653 79.099949)
        (xy 134.838817 79.066181) (xy 134.80505 79.038469) (xy 133.976524 78.209944) (xy 133.948809 78.176173) (xy 133.814051 78.065579)
        (xy 133.660305 77.983401) (xy 133.493482 77.932795) (xy 133.363469 77.91999) (xy 133.363461 77.91999) (xy 133.319992 77.915709)
        (xy 133.276523 77.91999) (xy 129.071589 77.91999) (xy 129.525049 77.46653) (xy 129.558817 77.438817) (xy 129.669411 77.304059)
        (xy 129.751589 77.150313) (xy 129.802195 76.98349) (xy 129.815 76.853477) (xy 129.815 76.853469) (xy 129.819281 76.81)
        (xy 129.815 76.766531) (xy 129.815 76.078072) (xy 129.93 76.078072) (xy 130.054482 76.065812) (xy 130.17418 76.029502)
        (xy 130.284494 75.970537) (xy 130.381185 75.891185) (xy 130.460537 75.794494) (xy 130.519502 75.68418) (xy 130.555812 75.564482)
        (xy 130.568072 75.44) (xy 130.568072 73.94) (xy 130.555812 73.815518) (xy 130.519502 73.69582) (xy 130.460537 73.585506)
        (xy 130.423191 73.54) (xy 130.460537 73.494494) (xy 130.519502 73.38418) (xy 130.555812 73.264482) (xy 130.568072 73.14)
        (xy 130.565 72.67575) (xy 130.40625 72.517) (xy 129.057 72.517) (xy 129.057 72.537) (xy 128.803 72.537)
        (xy 128.803 72.517) (xy 127.45375 72.517) (xy 127.295 72.67575) (xy 127.291928 73.14) (xy 127.304188 73.264482)
        (xy 127.340498 73.38418) (xy 127.399463 73.494494) (xy 127.436809 73.54) (xy 127.399463 73.585506) (xy 127.340498 73.69582)
        (xy 127.307379 73.805) (xy 127.00971 73.805) (xy 127.019502 73.78668) (xy 127.055812 73.666982) (xy 127.068072 73.5425)
        (xy 127.065 73.34075) (xy 126.90625 73.182) (xy 125.857 73.182) (xy 125.857 73.202) (xy 125.603 73.202)
        (xy 125.603 73.182) (xy 124.55375 73.182) (xy 124.395 73.34075) (xy 124.391928 73.5425) (xy 124.404188 73.666982)
        (xy 124.440498 73.78668) (xy 124.499463 73.896994) (xy 124.578815 73.993685) (xy 124.656564 74.057492) (xy 124.650208 74.062708)
        (xy 124.540542 74.196336) (xy 124.459053 74.348791) (xy 124.408872 74.514215) (xy 124.391928 74.68625) (xy 124.391928 75.17375)
        (xy 124.408872 75.345785) (xy 124.459053 75.511209) (xy 124.540542 75.663664) (xy 124.650208 75.797292) (xy 124.783836 75.906958)
        (xy 124.936291 75.988447) (xy 125.101715 76.038628) (xy 125.27375 76.055572) (xy 126.18625 76.055572) (xy 126.358285 76.038628)
        (xy 126.523709 75.988447) (xy 126.676164 75.906958) (xy 126.809792 75.797292) (xy 126.919458 75.663664) (xy 126.96685 75.575)
        (xy 127.307379 75.575) (xy 127.340498 75.68418) (xy 127.399463 75.794494) (xy 127.478815 75.891185) (xy 127.575506 75.970537)
        (xy 127.68582 76.029502) (xy 127.805518 76.065812) (xy 127.93 76.078072) (xy 128.045001 76.078072) (xy 128.045001 76.44342)
        (xy 126.568432 77.91999) (xy 122.211569 77.91999) (xy 118.386532 74.094954) (xy 118.358817 74.061183) (xy 118.224059 73.950589)
        (xy 118.070313 73.868411) (xy 117.90349 73.817805) (xy 117.855059 73.813035) (xy 117.819502 73.69582) (xy 117.760537 73.585506)
        (xy 117.723191 73.54) (xy 117.760537 73.494494) (xy 117.819502 73.38418) (xy 117.855812 73.264482) (xy 117.868072 73.14)
        (xy 117.865 72.67575) (xy 117.75675 72.5675) (xy 124.391928 72.5675) (xy 124.395 72.76925) (xy 124.55375 72.928)
        (xy 125.603 72.928) (xy 125.603 72.09125) (xy 125.857 72.09125) (xy 125.857 72.928) (xy 126.90625 72.928)
        (xy 127.065 72.76925) (xy 127.068072 72.5675) (xy 127.055812 72.443018) (xy 127.019502 72.32332) (xy 126.960537 72.213006)
        (xy 126.881185 72.116315) (xy 126.784494 72.036963) (xy 126.67418 71.977998) (xy 126.554482 71.941688) (xy 126.43 71.929428)
        (xy 126.01575 71.9325) (xy 125.857 72.09125) (xy 125.603 72.09125) (xy 125.44425 71.9325) (xy 125.03 71.929428)
        (xy 124.905518 71.941688) (xy 124.78582 71.977998) (xy 124.675506 72.036963) (xy 124.578815 72.116315) (xy 124.499463 72.213006)
        (xy 124.440498 72.32332) (xy 124.404188 72.443018) (xy 124.391928 72.5675) (xy 117.75675 72.5675) (xy 117.70625 72.517)
        (xy 116.357 72.517) (xy 116.357 72.537) (xy 116.103 72.537) (xy 116.103 72.517) (xy 114.75375 72.517)
        (xy 114.595 72.67575) (xy 114.591928 73.14) (xy 114.604188 73.264482) (xy 114.640498 73.38418) (xy 114.699463 73.494494)
        (xy 114.736809 73.54) (xy 114.699463 73.585506) (xy 114.640498 73.69582) (xy 114.635438 73.7125) (xy 114.118657 73.7125)
        (xy 114.181185 73.661185) (xy 114.260537 73.564494) (xy 114.319502 73.45418) (xy 114.355812 73.334482) (xy 114.368072 73.21)
        (xy 114.365 73.00825) (xy 114.20625 72.8495) (xy 113.157 72.8495) (xy 113.157 72.8695) (xy 112.903 72.8695)
        (xy 112.903 72.8495) (xy 111.85375 72.8495) (xy 111.695 73.00825) (xy 111.691928 73.21) (xy 111.704188 73.334482)
        (xy 111.740498 73.45418) (xy 111.799463 73.564494) (xy 111.878815 73.661185) (xy 111.956564 73.724992) (xy 111.950208 73.730208)
        (xy 111.840542 73.863836) (xy 111.759053 74.016291) (xy 111.708872 74.181715) (xy 111.691928 74.35375) (xy 111.691928 74.84125)
        (xy 111.708872 75.013285) (xy 111.759053 75.178709) (xy 111.840542 75.331164) (xy 111.950208 75.464792) (xy 112.083836 75.574458)
        (xy 112.236291 75.655947) (xy 112.401715 75.706128) (xy 112.57375 75.723072) (xy 113.48625 75.723072) (xy 113.658285 75.706128)
        (xy 113.823709 75.655947) (xy 113.976164 75.574458) (xy 114.088215 75.4825) (xy 114.596114 75.4825) (xy 114.604188 75.564482)
        (xy 114.640498 75.68418) (xy 114.699463 75.794494) (xy 114.778815 75.891185) (xy 114.875506 75.970537) (xy 114.98582 76.029502)
        (xy 115.105518 76.065812) (xy 115.23 76.078072) (xy 117.23 76.078072) (xy 117.354482 76.065812) (xy 117.47418 76.029502)
        (xy 117.584494 75.970537) (xy 117.680318 75.891896) (xy 120.683644 78.895223) (xy 120.581101 78.811068) (xy 120.331808 78.677818)
        (xy 120.061309 78.595764) (xy 119.850492 78.575) (xy 118.909508 78.575) (xy 118.698691 78.595764) (xy 118.428192 78.677818)
        (xy 118.178899 78.811068) (xy 117.960392 78.990392) (xy 117.781068 79.208899) (xy 117.647818 79.458192) (xy 117.565764 79.728691)
        (xy 117.538057 80.01) (xy 117.565764 80.291309) (xy 117.647818 80.561808) (xy 117.781068 80.811101) (xy 117.960392 81.029608)
        (xy 118.178899 81.208932) (xy 118.311858 81.28) (xy 118.178899 81.351068) (xy 117.960392 81.530392) (xy 117.938566 81.556987)
        (xy 114.546524 78.164946) (xy 114.518807 78.131173) (xy 114.384049 78.020579) (xy 114.230303 77.938401) (xy 114.06348 77.887795)
        (xy 113.933467 77.87499) (xy 113.933459 77.87499) (xy 113.88999 77.870709) (xy 113.846521 77.87499) (xy 106.733473 77.87499)
        (xy 106.690007 77.870709) (xy 106.646541 77.87499) (xy 106.646531 77.87499) (xy 106.516518 77.887795) (xy 106.349695 77.938401)
        (xy 106.195949 78.020579) (xy 106.195947 78.02058) (xy 106.195948 78.02058) (xy 106.094961 78.103458) (xy 106.094959 78.10346)
        (xy 106.061191 78.131173) (xy 106.033478 78.164941) (xy 104.825 79.37342) (xy 104.825 74.01689) (xy 105.238524 74.01689)
        (xy 105.283175 74.164099) (xy 105.408359 74.42692) (xy 105.582412 74.660269) (xy 105.798645 74.855178) (xy 106.048748 75.004157)
        (xy 106.323109 75.101481) (xy 106.553 74.980814) (xy 106.553 73.787) (xy 106.807 73.787) (xy 106.807 74.980814)
        (xy 107.036891 75.101481) (xy 107.311252 75.004157) (xy 107.561355 74.855178) (xy 107.777588 74.660269) (xy 107.951641 74.42692)
        (xy 108.076825 74.164099) (xy 108.121476 74.01689) (xy 108.000155 73.787) (xy 106.807 73.787) (xy 106.553 73.787)
        (xy 105.359845 73.787) (xy 105.238524 74.01689) (xy 104.825 74.01689) (xy 104.825 67.995) (xy 117.466862 67.995)
      )
    )
    (filled_polygon
      (pts
        (xy 130.095001 84.27658) (xy 130.095 88.364878) (xy 129.998815 88.443815) (xy 129.919463 88.540506) (xy 129.860498 88.65082)
        (xy 129.824188 88.770518) (xy 129.811928 88.895) (xy 129.811928 89.545) (xy 129.824188 89.669482) (xy 129.831929 89.695)
        (xy 129.824188 89.720518) (xy 129.822207 89.740629) (xy 129.268254 89.186676) (xy 129.305 89.001939) (xy 129.305 88.798061)
        (xy 129.265226 88.598102) (xy 129.187205 88.409744) (xy 129.155 88.361546) (xy 129.155 86.284759) (xy 129.325134 86.145134)
        (xy 129.510706 85.919014) (xy 129.648599 85.661034) (xy 129.733513 85.381111) (xy 129.762185 85.09) (xy 129.733513 84.798889)
        (xy 129.648599 84.518966) (xy 129.510706 84.260986) (xy 129.325134 84.034866) (xy 129.295313 84.010393) (xy 129.36418 83.989502)
        (xy 129.474494 83.930537) (xy 129.571185 83.851185) (xy 129.615549 83.797127)
      )
    )
    (filled_polygon
      (pts
        (xy 132.011928 81.432678) (xy 131.986252 81.407002) (xy 132.011928 81.407002)
      )
    )
    (filled_polygon
      (pts
        (xy 132.011928 81.152998) (xy 131.986252 81.152998) (xy 132.011928 81.127322)
      )
    )
  )
)
