{
    "TimeKeeper": {
        "epoch_time": "2030-01-01 00:00:00",
        "mission_start_time": "2025-01-01 00:00:00",
        "simulation_time": 0
    },
    "Scheduler": {
        "scheduled_events": {
            "1": {
                "entry_point": {
                    "name": "update",
                    "description": "Updates temperature from associated thermal node",
                    "parent": "Models/Thermistor",
                    "function": "do_update"
                },
                "simulation_time": 1,
                "cycle_time": 1,
                "repeat": -1
            },
            "2": {
                "entry_point": {
                    "name": "print_output",
                    "description": "",
                    "parent": "Models/Example",
                    "function": "print_output"
                },
                "simulation_time": 1,
                "cycle_time": 1,
                "repeat": -1
            },
            "3": {
                "entry_point": {
                    "name": "update",
                    "description": "Updates temperatures of all thermal nodes in the thermal network",
                    "parent": "Models/ThermalNetwork",
                    "function": "do_update"
                },
                "simulation_time": 1,
                "cycle_time": 1,
                "repeat": -1
            }
        }
    },
    "Models": {
        "Models/ThermalNetwork/delta_time": 1,
        "Models/ThermalNetwork/HotObjects/HO_Heater/status": 1,
        "Models/ThermalNetwork/ThermalNodes/TN_Heater/base_temperature": 20,
        "Models/ThermalNetwork/ThermalNodes/TN_Heater/steady_state_temperature": 40,
        "Models/ThermalNetwork/ThermalNodes/TN_Heater/current_temperature": 22,
        "Models/ThermalNetwork/ThermalNodes/TN_Heater/rise_rate": 2,
        "Models/ThermalNetwork/ThermalNodes/TN_Heater/fall_rate": 1,
        "Models/ThermalNetwork/ThermalNodes/TN_Heater/RelatedHotObjects/TN_Heater/hot_object_name": "HO_Heater",
        "Models/ThermalNetwork/ThermalNodes/TN_Heater/RelatedHotObjects/TN_Heater/maximum_effect": 20,
        "Models/ElectricalNetwork/Elements/Switch1/low_voltage_threshold": 0,
        "Models/ElectricalNetwork/Elements/Switch1/intrinsic_load": 0,
        "Models/ElectricalNetwork/Elements/Switch1/load": 22,
        "Models/ElectricalNetwork/Elements/Switch1/voltage": 28,
        "Models/ElectricalNetwork/Elements/Switch1/position": 1,
        "Models/ElectricalNetwork/Elements/Source/low_voltage_threshold": null,
        "Models/ElectricalNetwork/Elements/Source/intrinsic_load": null,
        "Models/ElectricalNetwork/Elements/Source/load": 22,
        "Models/ElectricalNetwork/Elements/Source/voltage": 28,
        "Models/ElectricalNetwork/Elements/Source/active": 1,
        "Models/ElectricalNetwork/Elements/Switch2/low_voltage_threshold": 0,
        "Models/ElectricalNetwork/Elements/Switch2/intrinsic_load": 0,
        "Models/ElectricalNetwork/Elements/Switch2/load": 22,
        "Models/ElectricalNetwork/Elements/Switch2/voltage": 28,
        "Models/ElectricalNetwork/Elements/Switch2/position": 1,
        "Models/ElectricalNetwork/Elements/Terminator/low_voltage_threshold": 0,
        "Models/ElectricalNetwork/Elements/Terminator/intrinsic_load": 22,
        "Models/ElectricalNetwork/Elements/Terminator/load": 22,
        "Models/ElectricalNetwork/Elements/Terminator/voltage": 28,
        "Models/Heater/resistance": null,
        "Models/Heater/ModelParameters/switch_status/parameter_value": 1,
        "Models/Thermistor/ModelParameters/measured_temperature/parameter_value": 20,
        "Models/ParameterPool/Parameters/Param1/raw_value": null,
        "Models/ParameterPool/Parameters/Param1/calibrated_value": null,
        "Models/ParameterPool/Parameters/Param2/raw_value": null,
        "Models/ParameterPool/Parameters/Param2/calibrated_value": null
    }
}