START RECORD GO HERE.                                                   S      1
1H,,1H;,7Hbattery,11Hbattery.igs,44HDASSAULT SYSTEMES CATIA V5 R20 - wwwG      1
.3ds.com,32HCATIA Version 5 Release 20 SP 4 ,32,75,6,75,15,7Hbattery,   G      2
1.0,2,2HMM,1000,1.0,15H20140418.172212,0.001,10000.0,5Hartur,8Hartur-PC,G      3
11,0,15H20140418.172212,;                                               G      4
     110       1       0       0       0       0       0       001010001D      1
     110       0       0       1       0                               0D      2
     110       2       0       0       0       0       0       001010001D      3
     110       0       0       1       0                               0D      4
     120       3       0       0       0       0       0       001010001D      5
     120       0       4       1       0                               0D      6
     124       4       0       0       0       0       0       001020201D      7
     124       0       0       1       0                               0D      8
     100       5       0       0       0       0       7       001010001D      9
     100       0       0       1       0                               0D     10
     110       6       0       0       0       0       0       001010001D     11
     110       0       0       1       0                               0D     12
     124       7       0       0       0       0       0       001020201D     13
     124       0       0       1       0                               0D     14
     100       8       0       0       0       0      13       001010001D     15
     100       0       0       1       0                               0D     16
     110       9       0       0       0       0       0       001010001D     17
     110       0       0       1       0                               0D     18
     102      10       0       0       0       0       0       001010001D     19
     102       0       0       1       0                               0D     20
     142      11       0       0       0       0       0       001010001D     21
     142       0       0       1       0                               0D     22
     144      12       0       0   10000       0       0       000000000D     23
     144       0       4       1       0                PartBody       0D     24
     110      13       0       0       0       0       0       001010001D     25
     110       0       0       1       0                               0D     26
     110      14       0       0       0       0       0       001010001D     27
     110       0       0       1       0                               0D     28
     120      15       0       0       0       0       0       001010001D     29
     120       0       4       1       0                               0D     30
     124      16       0       0       0       0       0       001020201D     31
     124       0       0       1       0                               0D     32
     100      17       0       0       0       0      31       001010001D     33
     100       0       0       1       0                               0D     34
     110      18       0       0       0       0       0       001010001D     35
     110       0       0       1       0                               0D     36
     124      19       0       0       0       0       0       001020201D     37
     124       0       0       1       0                               0D     38
     100      20       0       0       0       0      37       001010001D     39
     100       0       0       1       0                               0D     40
     110      21       0       0       0       0       0       001010001D     41
     110       0       0       1       0                               0D     42
     102      22       0       0       0       0       0       001010001D     43
     102       0       0       1       0                               0D     44
     142      23       0       0       0       0       0       001010001D     45
     142       0       0       1       0                               0D     46
     144      24       0       0   10000       0       0       000000000D     47
     144       0       4       1       0                PartBody       0D     48
     108      25       0       0       0       0       0       001010001D     49
     108       0       4       1       0                               0D     50
     124      26       0       0       0       0       0       001020201D     51
     124       0       0       1       0                               0D     52
     100      27       0       0       0       0      51       001010001D     53
     100       0       0       1       0                               0D     54
     124      28       0       0       0       0       0       001020201D     55
     124       0       0       1       0                               0D     56
     100      29       0       0       0       0      55       001010001D     57
     100       0       0       1       0                               0D     58
     102      30       0       0       0       0       0       001010001D     59
     102       0       0       1       0                               0D     60
     142      31       0       0       0       0       0       001010001D     61
     142       0       0       1       0                               0D     62
     144      32       0       0   10000       0       0       000000000D     63
     144       0       4       1       0                PartBody       0D     64
     108      33       0       0       0       0       0       001010001D     65
     108       0       5       1       0                               0D     66
     110      34       0       0       0       0       0       001010001D     67
     110       0       0       1       0                               0D     68
     124      35       0       0       0       0       0       001020201D     69
     124       0       0       1       0                               0D     70
     100      36       0       0       0       0      69       001010001D     71
     100       0       0       1       0                               0D     72
     110      37       0       0       0       0       0       001010001D     73
     110       0       0       1       0                               0D     74
     124      38       0       0       0       0       0       001020201D     75
     124       0       0       1       0                               0D     76
     100      39       0       0       0       0      75       001010001D     77
     100       0       0       1       0                               0D     78
     102      40       0       0       0       0       0       001010001D     79
     102       0       0       1       0                               0D     80
     142      41       0       0       0       0       0       001010001D     81
     142       0       0       1       0                               0D     82
     124      42       0       0       0       0       0       001020201D     83
     124       0       0       1       0                               0D     84
     100      43       0       0       0       0      83       001010001D     85
     100       0       0       1       0                               0D     86
     124      44       0       0       0       0       0       001020201D     87
     124       0       0       1       0                               0D     88
     100      45       0       0       0       0      87       001010001D     89
     100       0       0       1       0                               0D     90
     102      46       0       0       0       0       0       001010001D     91
     102       0       0       1       0                               0D     92
     142      47       0       0       0       0       0       001010001D     93
     142       0       0       1       0                               0D     94
     144      48       0       0   10000       0       0       000000000D     95
     144       0       5       1       0                PartBody       0D     96
     108      49       0       0       0       0       0       001010001D     97
     108       0       4       1       0                               0D     98
     124      50       0       0       0       0       0       001020201D     99
     124       0       0       1       0                               0D    100
     100      51       0       0       0       0      99       001010001D    101
     100       0       0       1       0                               0D    102
     110      52       0       0       0       0       0       001010001D    103
     110       0       0       1       0                               0D    104
     124      53       0       0       0       0       0       001020201D    105
     124       0       0       1       0                               0D    106
     100      54       0       0       0       0     105       001010001D    107
     100       0       0       1       0                               0D    108
     110      55       0       0       0       0       0       001010001D    109
     110       0       0       1       0                               0D    110
     102      56       0       0       0       0       0       001010001D    111
     102       0       0       1       0                               0D    112
     142      57       0       0       0       0       0       001010001D    113
     142       0       0       1       0                               0D    114
     144      58       0       0   10000       0       0       000000000D    115
     144       0       4       1       0                PartBody       0D    116
     108      59       0       0       0       0       0       001010001D    117
     108       0       4       1       0                               0D    118
     110      60       0       0       0       0       0       001010001D    119
     110       0       0       1       0                               0D    120
     110      61       0       0       0       0       0       001010001D    121
     110       0       0       1       0                               0D    122
     110      62       0       0       0       0       0       001010001D    123
     110       0       0       1       0                               0D    124
     110      63       0       0       0       0       0       001010001D    125
     110       0       0       1       0                               0D    126
     102      64       0       0       0       0       0       001010001D    127
     102       0       0       1       0                               0D    128
     142      65       0       0       0       0       0       001010001D    129
     142       0       0       1       0                               0D    130
     144      66       0       0   10000       0       0       000000000D    131
     144       0       4       1       0                PartBody       0D    132
     110      67       0       0       0       0       0       001010001D    133
     110       0       0       1       0                               0D    134
     110      68       0       0       0       0       0       001010001D    135
     110       0       0       1       0                               0D    136
     120      69       0       0       0       0       0       001010001D    137
     120       0       4       1       0                               0D    138
     124      70       0       0       0       0       0       001020201D    139
     124       0       0       1       0                               0D    140
     100      71       0       0       0       0     139       001010001D    141
     100       0       0       1       0                               0D    142
     110      72       0       0       0       0       0       001010001D    143
     110       0       0       1       0                               0D    144
     124      73       0       0       0       0       0       001020201D    145
     124       0       0       1       0                               0D    146
     100      74       0       0       0       0     145       001010001D    147
     100       0       0       1       0                               0D    148
     110      75       0       0       0       0       0       001010001D    149
     110       0       0       1       0                               0D    150
     102      76       0       0       0       0       0       001010001D    151
     102       0       0       1       0                               0D    152
     142      77       0       0       0       0       0       001010001D    153
     142       0       0       1       0                               0D    154
     144      78       0       0   10000       0       0       000000000D    155
     144       0       4       1       0                PartBody       0D    156
     108      79       0       0       0       0       0       001010001D    157
     108       0       4       1       0                               0D    158
     110      80       0       0       0       0       0       001010001D    159
     110       0       0       1       0                               0D    160
     110      81       0       0       0       0       0       001010001D    161
     110       0       0       1       0                               0D    162
     110      82       0       0       0       0       0       001010001D    163
     110       0       0       1       0                               0D    164
     110      83       0       0       0       0       0       001010001D    165
     110       0       0       1       0                               0D    166
     102      84       0       0       0       0       0       001010001D    167
     102       0       0       1       0                               0D    168
     142      85       0       0       0       0       0       001010001D    169
     142       0       0       1       0                               0D    170
     144      86       0       0   10000       0       0       000000000D    171
     144       0       4       1       0                PartBody       0D    172
     110      87       0       0       0       0       0       001010001D    173
     110       0       0       1       0                               0D    174
     110      88       0       0       0       0       0       001010001D    175
     110       0       0       1       0                               0D    176
     120      89       0       0       0       0       0       001010001D    177
     120       0       4       1       0                               0D    178
     124      90       0       0       0       0       0       001020201D    179
     124       0       0       1       0                               0D    180
     100      91       0       0       0       0     179       001010001D    181
     100       0       0       1       0                               0D    182
     110      92       0       0       0       0       0       001010001D    183
     110       0       0       1       0                               0D    184
     124      93       0       0       0       0       0       001020201D    185
     124       0       0       1       0                               0D    186
     100      94       0       0       0       0     185       001010001D    187
     100       0       0       1       0                               0D    188
     110      95       0       0       0       0       0       001010001D    189
     110       0       0       1       0                               0D    190
     102      96       0       0       0       0       0       001010001D    191
     102       0       0       1       0                               0D    192
     142      97       0       0       0       0       0       001010001D    193
     142       0       0       1       0                               0D    194
     144      98       0       0   10000       0       0       000000000D    195
     144       0       4       1       0                PartBody       0D    196
110,0.0,0.0,49.95,0.0,0.0,50.95,0,0;                                   1P      1
110,5.0,0.0,49.7,5.0,0.0,50.2,0,0;                                     3P      2
120,1,3,0.0,6.283185307,0,0;                                           5P      3
124,1.0,0.0,0.0,0.0,0.0,1.0,0.0,0.0,0.0,0.0,1.0,49.7,0,0;              7P      4
100,0.0,0.0,0.0,5.0,0.0,-5.0,0.0,0,0;                                  9P      5
110,-5.0,0.0,49.7,-5.0,0.0,50.2,0,0;                                  11P      6
124,-1.0,0.0,0.0,0.0,0.0,1.0,0.0,0.0,0.0,0.0,-1.0,50.2,0,0;           13P      7
100,0.0,0.0,0.0,5.0,0.0,-5.0,0.0,0,0;                                 15P      8
110,5.0,0.0,50.2,5.0,0.0,49.7,0,0;                                    17P      9
102,4,9,11,15,17,0,0;                                                 19P     10
142,0,5,0,19,2,0,0;                                                   21P     11
144,5,1,0,21,0,0;                                                     23P     12
110,0.0,0.0,49.95,0.0,0.0,50.95,0,0;                                  25P     13
110,-5.0,0.0,49.7,-5.0,0.0,50.2,0,0;                                  27P     14
120,25,27,0.0,6.283185307,0,0;                                        29P     15
124,-1.0,0.0,0.0,0.0,0.0,-1.0,0.0,0.0,0.0,0.0,1.0,49.7,0,0;           31P     16
100,0.0,0.0,0.0,5.0,0.0,-5.0,0.0,0,0;                                 33P     17
110,5.0,0.0,49.7,5.0,0.0,50.2,0,0;                                    35P     18
124,1.0,0.0,0.0,0.0,0.0,-1.0,0.0,0.0,0.0,0.0,-1.0,50.2,0,0;           37P     19
100,0.0,0.0,0.0,5.0,0.0,-5.0,0.0,0,0;                                 39P     20
110,-5.0,0.0,50.2,-5.0,0.0,49.7,0,0;                                  41P     21
102,4,33,35,39,41,0,0;                                                43P     22
142,0,29,0,43,2,0,0;                                                  45P     23
144,29,1,0,45,0,0;                                                    47P     24
108,0.0,0.0,1.0,49.7,0,0.0,0.0,49.7,1.0,0,0;                          49P     25
124,1.0,0.0,0.0,0.0,0.0,-1.0,0.0,0.0,0.0,0.0,-1.0,49.7,0,0;           51P     26
100,0.0,0.0,0.0,5.0,0.0,-5.0,0.0,0,0;                                 53P     27
124,-1.0,0.0,0.0,0.0,0.0,1.0,0.0,0.0,0.0,0.0,-1.0,49.7,0,0;           55P     28
100,0.0,0.0,0.0,5.0,0.0,-5.0,0.0,0,0;                                 57P     29
102,2,53,57,0,0;                                                      59P     30
142,0,49,0,59,2,0,0;                                                  61P     31
144,49,1,0,61,0,0;                                                    63P     32
108,0.0,0.0,1.0,50.2,0,0.0,0.0,50.2,1.0,0,0;                          65P     33
110,-11.55,5.4,50.2,11.55,5.4,50.2,0,0;                               67P     34
124,0.0,1.0,0.0,11.55,1.0,0.0,0.0,0.0,0.0,0.0,-1.0,50.2,0,0;          69P     35
100,0.0,0.0,0.0,5.4,0.0,-5.4,0.0,0,0;                                 71P     36
110,11.55,-5.4,50.2,-11.55,-5.4,50.2,0,0;                             73P     37
124,0.0,-1.0,0.0,-11.55,-1.0,0.0,0.0,0.0,0.0,0.0,-1.0,50.2,0,0;       75P     38
100,0.0,0.0,0.0,5.4,0.0,-5.4,0.0,0,0;                                 77P     39
102,4,67,71,73,77,0,0;                                                79P     40
142,0,65,0,79,2,0,0;                                                  81P     41
124,-1.0,0.0,0.0,0.0,0.0,-1.0,0.0,0.0,0.0,0.0,1.0,50.2,0,0;           83P     42
100,0.0,0.0,0.0,5.0,0.0,-5.0,0.0,0,0;                                 85P     43
124,1.0,0.0,0.0,0.0,0.0,1.0,0.0,0.0,0.0,0.0,1.0,50.2,0,0;             87P     44
100,0.0,0.0,0.0,5.0,0.0,-5.0,0.0,0,0;                                 89P     45
102,2,85,89,0,0;                                                      91P     46
142,0,65,0,91,2,0,0;                                                  93P     47
144,65,1,1,81,93,0,0;                                                 95P     48
108,0.0,0.0,1.0,0.0,0,0.0,0.0,0.0,1.0,0,0;                            97P     49
124,0.0,-1.0,0.0,-11.55,1.0,0.0,0.0,0.0,0.0,0.0,1.0,0.0,0,0;          99P     50
100,0.0,0.0,0.0,5.4,0.0,-5.4,0.0,0,0;                                101P     51
110,-11.55,-5.4,0.0,11.55,-5.4,0.0,0,0;                              103P     52
124,0.0,1.0,0.0,11.55,-1.0,0.0,0.0,0.0,0.0,0.0,1.0,0.0,0,0;          105P     53
100,0.0,0.0,0.0,5.4,0.0,-5.4,0.0,0,0;                                107P     54
110,11.55,5.4,0.0,-11.55,5.4,0.0,0,0;                                109P     55
102,4,101,103,107,109,0,0;                                           111P     56
142,0,97,0,111,2,0,0;                                                113P     57
144,97,1,0,113,0,0;                                                  115P     58
108,0.0,-1.0,0.0,-5.4,0,-11.55,5.4,0.0,1.0,0,0;                      117P     59
110,11.55,5.4,50.2,-11.55,5.4,50.2,0,0;                              119P     60
110,-11.55,5.4,50.2,-11.55,5.4,0.0,0,0;                              121P     61
110,-11.55,5.4,0.0,11.55,5.4,0.0,0,0;                                123P     62
110,11.55,5.4,0.0,11.55,5.4,50.2,0,0;                                125P     63
102,4,119,121,123,125,0,0;                                           127P     64
142,0,117,0,127,2,0,0;                                               129P     65
144,117,1,0,129,0,0;                                                 131P     66
110,11.55,0.0,25.1,11.55,0.0,26.1,0,0;                               133P     67
110,11.55,-5.4,0.0,11.55,-5.4,50.2,0,0;                              135P     68
120,133,135,0.0,6.283185307,0,0;                                     137P     69
124,0.0,1.0,0.0,11.55,-1.0,0.0,0.0,0.0,0.0,0.0,1.0,50.2,0,0;         139P     70
100,0.0,0.0,0.0,5.4,0.0,-5.4,0.0,0,0;                                141P     71
110,11.55,5.4,50.2,11.55,5.4,0.0,0,0;                                143P     72
124,0.0,1.0,0.0,11.55,1.0,0.0,0.0,0.0,0.0,0.0,-1.0,0.0,0,0;          145P     73
100,0.0,0.0,0.0,5.4,0.0,-5.4,0.0,0,0;                                147P     74
110,11.55,-5.4,0.0,11.55,-5.4,50.2,0,0;                              149P     75
102,4,141,143,147,149,0,0;                                           151P     76
142,0,137,0,151,2,0,0;                                               153P     77
144,137,1,0,153,0,0;                                                 155P     78
108,0.0,1.0,0.0,-5.4,0,11.55,-5.4,0.0,1.0,0,0;                       157P     79
110,-11.55,-5.4,50.2,11.55,-5.4,50.2,0,0;                            159P     80
110,11.55,-5.4,50.2,11.55,-5.4,0.0,0,0;                              161P     81
110,11.55,-5.4,0.0,-11.55,-5.4,0.0,0,0;                              163P     82
110,-11.55,-5.4,0.0,-11.55,-5.4,50.2,0,0;                            165P     83
102,4,159,161,163,165,0,0;                                           167P     84
142,0,157,0,167,2,0,0;                                               169P     85
144,157,1,0,169,0,0;                                                 171P     86
110,-11.55,0.0,25.1,-11.55,0.0,26.1,0,0;                             173P     87
110,-11.55,5.4,0.0,-11.55,5.4,50.2,0,0;                              175P     88
120,173,175,0.0,6.283185307,0,0;                                     177P     89
124,0.0,-1.0,0.0,-11.55,1.0,0.0,0.0,0.0,0.0,0.0,1.0,50.2,0,0;        179P     90
100,0.0,0.0,0.0,5.4,0.0,-5.4,0.0,0,0;                                181P     91
110,-11.55,-5.4,50.2,-11.55,-5.4,0.0,0,0;                            183P     92
124,0.0,-1.0,0.0,-11.55,-1.0,0.0,0.0,0.0,0.0,0.0,-1.0,0.0,0,0;       185P     93
100,0.0,0.0,0.0,5.4,0.0,-5.4,0.0,0,0;                                187P     94
110,-11.55,5.4,0.0,-11.55,5.4,50.2,0,0;                              189P     95
102,4,181,183,187,189,0,0;                                           191P     96
142,0,177,0,191,2,0,0;                                               193P     97
144,177,1,0,193,0,0;                                                 195P     98
S      1G      4D    196P     98                                        T      1
