{
    "parameters": [
        {
            "parameter_id": 1,
            "parameter_name": "is moving",
            "encoding": "B",
            "value": 0
        },
        {
            "parameter_id": 2,
            "parameter_name": "speed",
            "encoding": "B",
            "value": 0
        }
    ]
}
