{
    "parameters": [
        {
            "parameter_id": 1,
            "parameter_name": "counter",
            "comment": "a monotonic counter",
            "encoding": "i",
            "value": 0
        },
        {
            "parameter_id": 2,
            "parameter_name": "switch status",
            "encoding": "B",
            "value": 0
        },
        {
            "parameter_id": 3,
            "parameter_name": "temperature",
            "encoding": "f",
            "value": 0
        },
        {
            "parameter_id": 4,
            "parameter_name": "voltage",
            "encoding": "f",
            "value": 0
        }
    ]
}
